{"text_format":"1","workbook":"xlsx","n_sheets":20,"sheets":["1","CARATULA RESUMEN","A Y  II D3","A Y II D4","B)","II B) Y 1","II C y 1_","II D) 2","II D) 4","II D) 4 A","II D) 6","II D) 7 1","II D) 7 2 ","II D) 7 3","E)","F) 1","F) 2","G)","H)","Listas"],"not_rendered":{"charts":0,"images":19,"macros":1,"external_links":0,"defined_names":17,"comments":16,"pivot_tables":0},"unopened":[],"bounds":{"document_bytes":16777216,"sheet_cells":100000,"rows_first":2000,"rows_last":500,"rows_between":2000,"halvings":0,"cell_chars":16384,"cell_head_chars":4096},"cells_cut":0,"cells_raw":0,"read":"whole","date_system":"1900"}

{"sheet":"1","index":0,"n_rows":73,"n_cols":18,"rows_kept":73,"cut":false,"hidden":false,"merged":[[36,3,36,6],[10,3,10,18],[11,3,11,18],[12,3,12,18],[34,3,34,6],[35,3,35,6],[46,3,46,6],[47,3,47,6],[48,3,48,6],[37,3,37,6],[38,3,38,6],[39,3,39,6],[40,3,40,6],[41,3,41,6],[42,3,42,6],[69,2,69,5],[71,2,71,5],[72,2,72,5],[73,2,73,5],[20,3,20,14],[21,3,21,14],[22,3,22,14],[49,3,49,6],[62,2,62,5],[63,2,63,5],[65,2,65,5],[66,2,66,5],[68,2,68,5],[43,3,43,6],[44,3,44,6],[45,3,45,6]]}
[]
[]
[]
[]
[]
[]
[]
[]
[]
[]
[]
[null,null,null,"FORMATOS ENTREGADOS PARA DAR CUMPLIMIENTO AL ARTICULO 73 DE \"LA LEY GENERAL DE CONTABILIDAD GUBERNAMENTAL\""]
[]
[]
[]
[]
[]
[]
[]
[]
[null,null,"Entidad Federativa :","CHIHUAHUA "]
[null,null,"Fondo :","Fondo de Aportaciones para la Educación Tecnológica y de Adultos/Colegio Nacional de Educación Profesional Técnica (FAETA/CONALEP)"]
[null,null,"Periodo :","2do. Trimestre"]
[]
[]
[]
[]
[]
[]
[]
[]
[null,null,null,null,null,null,null,"TOTAL REGISTROS ",null,"Num. de Paginas",null,"TOTAL PERSONAS",null,"TOTAL PLAZAS",null,"Total Pto. Federal",null,"Total Ppto. Otras Fuentes"]
[]
[]
[null,1,"A Y II D3","Personal Comisionado",null,null,null,null,null,null,null,null,null,null,null,null,null,0]
[null,2,"A Y II D4","Personal con Licencia",null,null,null,null,null,null,null,null,null,null,null,null,null,0]
[null,3,"B)   ","Registro Federal de Contribuyentes de Trabajadores con Pagos Retroactivos con un Periodo Mayor a 45 días",null,null,null,"N/A",null,"N/A",null,"N/A",null,"N/A",null,"N/A",null,"N/A"]
[null,4,"II B) Y 1","Plaza / Función",null,null,null,null,null,null,null,null,null,"N/A",null,"N/A",null,"N/A"]
[null,5,"II C y 1_","Personal Federalizado por Registro Federal de Contribuyentes",null,null,null,null,null,null,null,null,null,null,null,null,null,0]
[null,6,"II D) 2","Movimientos de Plazas",null,null,null,null,null,null,null,null,null,null,null,"N/A",null,"N/A"]
[null,7,"II D) 4","Trabajadores Jubilados en el Periodo",null,null,null,null,null,null,null,null,null,null,null,"N/A",null,"N/A"]
[null,8,"II D) 4 A","Trabajadores que Tramitaron Licencia Prejubilatoria en el Periodo",null,null,null,null,null,null,null,null,null,null,null,null,null,0]
[null,9,"II D) 6","Trabajadores Contratados por Honorarios en el Periodo",null,null,null,null,null,null,null,null,null,"N/A",null,"N/A",null,"N/A"]
[null,10,"II D) 7 1 ","Analítico de Categorías / Plazas Autorizadas con su Tabulador",null,null,null,null,null,null,null,"N/A",null,"N/A",null,"N/A",null,"N/A"]
[null,11,"II D) 7 2 ","Catálogo de Categorías y Tabuladores",null,null,null,null,null,null,null,"N/A",null,"N/A",null,"N/A",null,"N/A"]
[null,12,"II D) 7 3 ","Catálogo de Percepciones y Deducciones",null,null,null,null,null,null,null,"N/A",null,"N/A",null,"N/A",null,"N/A"]
[null,13,"E)","Trabajadores que Cobran con RFC / CURP con Formato Incorrecto",null,null,null,"N/A",null,"N/A",null,"N/A",null,"N/A",null,"N/A",null,"N/A"]
[null,14,"F) 1","Trabajadores con Doble Asignación Salarial en Municipios no Colindantes Geográficamente",null,null,null,"N/A",null,"N/A",null,"N/A",null,"N/A",null,"N/A",null,"N/A"]
[null,15,"F) 2","Trabajadores Ocupando Plazas que Superan el Número de Horas de Compatibilidad Autorizadas",null,null,null,"N/A",null,"N/A",null,"N/A",null,"N/A",null,"N/A",null,"N/A"]
[null,16,"G)","Trabajadores Cuyo Salario Básico Supere los Ingresos Promedio de un Docente en la Categoría más Alta del Tabulador Salarial Correspondiente a Cada Entidad",null,null,null,"N/A",null,"N/A",null,"N/A",null,"N/A",null,"N/A",null,"N/A"]
[]
[]
[]
[]
[]
[]
[]
[]
[]
[]
[]
[]
[null,null,"LIC. JESUS ALFONSO RAMIREZ MARRUFO"]
[null,null,"Nombre del  Responsable"]
[]
[null,null,"SUBJEFE TECNICO ESPECIALISTA DE RECURSOS HUMANOS"]
[null,null,"Cargo"]
[]
[]
[null,null,"Firma"]
[]
[null,null,"2016-04-13"]
[null,null,"Fecha"]

{"sheet":"CARATULA RESUMEN","index":1,"n_rows":73,"n_cols":18,"rows_kept":73,"cut":false,"hidden":false,"merged":[[22,3,22,14],[10,3,10,18],[11,3,11,18],[12,3,12,18],[20,3,20,14],[21,3,21,14],[45,3,45,6],[34,3,34,6],[35,3,35,6],[36,3,36,6],[37,3,37,6],[38,3,38,6],[39,3,39,6],[40,3,40,6],[41,3,41,6],[42,3,42,6],[43,3,43,6],[44,3,44,6],[46,3,46,6],[47,3,47,6],[48,3,48,6],[49,3,49,6],[62,2,62,5],[73,2,73,5],[50,3,50,6],[65,2,65,5],[66,2,66,5],[68,2,68,5],[69,2,69,5],[71,2,71,5],[72,2,72,5],[63,2,63,5]]}
[]
[]
[]
[]
[]
[]
[]
[]
[]
[]
[]
[null,null,null,"FORMATOS ENTREGADOS PARA DAR CUMPLIMIENTO AL ARTICULO 73 DE \"LA LEY GENERAL DE CONTABILIDAD GUBERNAMENTAL\""]
[]
[]
[]
[]
[]
[]
[]
[]
[null,null,"Entidad Federativa :","CHIHUAHUA "]
[null,null,"Fondo :","Fondo de Aportaciones para la Educación Tecnológica y de Adultos/Colegio Nacional de Educación Profesional Técnica (FAETA/CONALEP)"]
[null,null,"Periodo :","4to. Trimestre 2017"]
[]
[]
[]
[]
[]
[]
[]
[]
[null,null,null,null,null,null,null,"TOTAL REGISTROS ",null,"Num. de Paginas",null,"TOTAL PERSONAS",null,"TOTAL PLAZAS",null,"Total Pto. Federal",null,"Total Ppto. Otras Fuentes"]
[]
[]
[null,1,"A Y II D3","Personal Comisionado",null,null,null,22,null,1,null,22,null,22,null,2229423.87,null,"N/A"]
[null,2,"A Y II D4","Personal con Licencia",null,null,null,33,null,1,null,33,null,11,null,1013075.01,null,"N/A"]
[null,3,"B)   ","Registro Federal de Contribuyentes de Trabajadores con Pagos Retroactivos con un Periodo Mayor a 45 días",null,null,null,"N/A",null,"N/A",null,"N/A",null,"N/A",null,"N/A",null,"N/A"]
[null,4,"II B) Y 1","Plaza / Función",null,null,null,753,null,16,null,753,null,243,null,37140120.173822962,null,"N/A"]
[null,5,"II C y 1_","Personal Federalizado por Registro Federal de Contribuyentes",null,null,null,753,null,17,null,753,null,243,null,37140120.173822954,null,"N/A"]
[null,6,"II D) 2","Movimientos de Plazas",null,null,null,27,null,1,null,22,null,15,null,"N/A",null,"N/A"]
[null,7,"II D) 4","Trabajadores Jubilados en el Periodo",null,null,null,1,null,1,null,1,null,1,null,"N/A",null,"N/A"]
[null,8,"II D) 4 A","Trabajadores que Tramitaron Licencia Prejubilatoria en el Periodo",null,null,null,5,null,1,null,5,null,5,null,611227.25,null,"N/A"]
[null,9,"II D) 6","Trabajadores Contratados por Honorarios en el Periodo",null,null,null,1,null,1,null,1,null,"N/A",null,39606.11,null,"N/A"]
[null,10,"II D) 7 1 ","Analítico de Categorías / Plazas Autorizadas con su Tabulador",null,null,null,140,null,3,null,"N/A",null,"N/A",null,"N/A",null,"N/A"]
[null,11,"II D) 7 2 ","Catálogo de Categorías y Tabuladores",null,null,null,144,null,5,null,"N/A",null,"N/A",null,"N/A",null,"N/A"]
[null,12,"II D) 7 3 ","Catálogo de Percepciones y Deducciones",null,null,null,78,null,3,null,"N/A",null,"N/A",null,"N/A",null,"N/A"]
[null,13,"E)","Trabajadores que Cobran con RFC / CURP con Formato Incorrecto",null,null,null,"N/A",null,"N/A",null,"N/A",null,"N/A",null,"N/A",null,"N/A"]
[null,14,"F) 1","Trabajadores con Doble Asignación Salarial en Municipios no Colindantes Geográficamente",null,null,null,"N/A",null,"N/A",null,"N/A",null,"N/A",null,"N/A",null,"N/A"]
[null,15,"F) 2","Trabajadores Ocupando Plazas que Superan el Número de Horas de Compatibilidad Autorizadas",null,null,null,"N/A",null,"N/A",null,"N/A",null,"N/A",null,"N/A",null,"N/A"]
[null,16,"G)","Trabajadores Cuyo Salario Básico Supere los Ingresos Promedio de un Docente en la Categoría más Alta del Tabulador Salarial Correspondiente a Cada Entidad",null,null,null,"N/A",null,"N/A",null,"N/A",null,"N/A",null,"N/A",null,"N/A"]
[null,17,"H) ","Movimientos de Personal por Centro de Trabajo",null,null,null,"N/A",null,"N/A",null,"N/A",null,"N/A",null,"N/A",null,"N/A"]
[]
[]
[]
[]
[]
[]
[]
[]
[]
[]
[]
[null,null,"LIC. JESUS ALFONSO RAMIREZ MARRUFO"]
[null,null,"Nombre del  Responsable"]
[]
[null,null,"SUBJEFE TECNICO ESPECIALISTA DE RECURSOS HUMANOS"]
[null,null,"Cargo"]
[]
[]
[null,null,"Firma"]
[]
[null,null,"2018-01-12"]
[null,null,"Fecha"]

{"sheet":"A Y  II D3","index":2,"n_rows":44,"n_cols":25,"rows_kept":44,"cut":false,"hidden":false,"merged":[[40,12,40,14],[12,24,13,24],[12,13,12,14],[12,15,13,15],[12,16,13,16],[12,17,13,17],[12,18,12,19],[12,20,13,20],[38,13,38,14],[12,21,13,21],[12,22,13,22],[12,23,13,23],[9,1,9,7],[12,6,12,12],[12,1,13,1],[12,2,13,2],[12,3,13,3],[12,4,13,4],[12,5,13,5]]}
[]
[]
[]
[]
[]
[]
[]
[]
[null,"Formato: Personal Comisionado"]
[null,{"$f":"IF('1'!D22=\"Elige el Periodo…\",\"\",'1'!D22)","v":"Fondo de Aportaciones para la Educación Tecnológica y de Adultos/Colegio Nacional de Educación Profesional Técnica (FAETA/CONALEP)"},null,null,null,null,null,null,null,null,null,null,null,null,null,null,null,null,null,null,null,null,null,"4to. Trimestre 2017"]
[]
[]
[null,"Entidad Federativa","R.F.C.","CURP","Nombre","Clave integrada","Clave Presupuestal",null,null,null,null,null,null,"Fecha Comisión",null,"Percepciones pagadas en el Periodo de Comisión con Presupuesto Federal*","Percepciones pagadas en el Periodo de Comisión con Presupuesto de otra fuente*","Clave CT Origen","CT Destino dentro del sector",null,"Lugar de la comisión fuera del sector educativo","Tipo de Comisión","Función Específica","Objeto de la comision","No. Oficio"]
[null,null,null,null,null,null,"Partida Presupuestal","Código de Pago","Clave de Unidad","Clave de Sub Unidad","Clave de Categoría","Horas Semana Mes ","Número de Plaza","Inicio","Conclusión",null,null,null,"Clave","Turno"]
[]
[null,"Entidad Federativa","R.F.C.","CURP","Nombre","Clave integrada","Partida Presupuestal","Código de Pago","Clave de Unidad","Clave de Sub Unidad","Clave de Categoría","Horas Semana Mes ","Número de Plaza","Fecha Comisión\nInicio","Fecha Comisión\nConclusión","Percepciones pagadas en el Periodo de Comisión con Presupuesto Federal*","Percepciones pagadas en el Periodo de Comisión con Presupuesto de otra fuente*","Clave CT Origen","Clave","Turno","Lugar de la comisión fuera del sector educativo","Tipo de Comisión","Función Específica","Objeto de la comision","No. Oficio"]
[null,"CHIHUAHUA","REVB701115KRA","REVB701115MCHGTH02","BHERDINA REGALADO VITELA","8310110030225CF3320400.09333",83101,1003,"02","25","CF33204","00.0",9333,20170216,99999999,80535.240000000005,0,"08DTP0001C","08DTP0001C",120,"/","h","SUBJEFE TECNICO ESPECIALISTA","APOYO PARA EL DEPARTAMENTO","AJ/OFC/04/2017"]
[null,"CHIHUAHUA","AUPC720823T59","AUPC720823MZSGLL09","CLARA AGÜERO PALACIOS","8310110030026S0120240.02434",83101,1003,"00","26","S01202","40.0",2434,20120216,99999999,44427.96,0,"08DPT0002B","08DPT0007X",200,"/","h","AUXILIAR DE SERVICIOS GENERALES","APOYO PARA EL DEPARTAMENTO","DGE/159-A/2012"]
[null,"CHIHUAHUA","CIBA710920FVA","CIBA710920MDGTRL04","ALMA ROSA CITAL BERTAHUD","8310110030026CF3320640.014304",83101,1003,"00","26","CF33206","40.0",14304,20100716,99999999,173022.32,0,"08DPT0002B","08DPT0013H",124,"/","h","DIRECCION DEL PLANTEL ","COORDINAR INICIO PLANTEL III","DGE/515/2010"]
[null,"CHIHUAHUA","FOLC560327T8A","FOLC560327MDFLRR07","MARIA DEL CARMEN FLORES LARA","8310110030026CF3320640.09278",83101,1003,"00","26","CF33206","40.0",9278,20100716,20171231,166561.01999999999,0,"08DPT0002B","08DPT0013H",124,"/","h","JEFE DE PROYECTO","APOYO AREA DE FORMACION TECNICA","DGE/515/2010"]
[null,"CHIHUAHUA","LOCJ681030V96","LOCJ681030HCHZLS07","JESUS EDUARDO LOZOYA CALDERON","8310110030026A0320240.02419",83101,1003,"00","26","A03202","40.0",2419,20130216,99999999,72062.53,0,"08DPT0002B","08DPT0007X",200,"/","h","AUXILIAR DE SERVICIOS GENERALES","APOYO PARA EL DEPARTAMENTO","RH/087/2013"]
[null,"CHIHUAHUA","ROGJ6511161S5","ROGJ651116HDGCRN00","JUAN JESUS ROCHA GARCIA","8310110030026CF1820340.0131",83101,1003,"00","26","CF18203","40.0",131,20120216,99999999,70070.899999999994,0,"08DPT0002B","08DPT0007X",200,"/","h","SUPERVISOR DE MANTENIMIENTO","APOYO PARA EL DEPARTAMENTO","DGE/156-B/2012"]
[null,"CHIHUAHUA","VASC8109266G6","VASC810926MCHLLL08","CLAUDIA VALVERDE SALAZAR","8310110030026ED0120140.02445",83101,1003,"00","26","ED01201","40.0",2445,20160701,99999999,73766.070000000007,0,"08DPT0002B","08DPT0007X",700,"/","h","DELEGADA SINDICAL ESTATAL","COMISION SINDICAL POR TIEMPO COMPLETO","DP/1086/2016"]
[null,"CHIHUAHUA","HERO621113HM2","HEXR621113HCHRXG06","ROGELIO HERNANDEZ","8310110030026CF3320440.02451",83101,1003,"00","26","CF33204","40.0",2451,20170201,20171231,140198.15,0,"08DPT0002B","08DPT0013H",123,"/","h","SUBJEFE TECNICO ESPECIALISTA","APOYO EN MANTENIMIENTO","DGE/107/2017"]
[null,"CHIHUAHUA","LIMR6608162E8","LIMR660816HZSRNY01","RAYMUNDO LIRA MENDOZA","8310110030026CF3320640.013756",83101,1003,"00","26","CF33206","40.0",13756,20170201,99999999,184677.54,0,"08DPT0002B","08DPT0007X",123,"/","h","JEFE DE PROYECTO","APOYO EN AREA DE SERVICIOS ESCOLARES","DGE/106/2017"]
[null,"CHIHUAHUA","LOCJ6307091T8","LOCJ630709HCHPRS08","JESUS MARTIN LOPEZ CARO","8310110030026CF3320640.013757",83101,1003,"00","26","CF33206","40.0",13757,20170316,99999999,170813.44,0,"08DPT0002B","00XXX0000X",123,"/","h","JEFE DE PROYECTO","APOYO EN AREA DE CAPACITACION","DGE/109/2017"]
[null,"CHIHUAHUA","ROCS700130LMA","ROCS700130MDGDLL00","SILVIA ESTELA RODRIGUEZ CALVILLO","8310110030026CF0210540.014574",83101,1003,"00","26","CF02105","40.0",14574,20171001,99999999,63508.11,0,"08DPT0002B","08DPT0007X",123,"/","h","COORDINADORA EJECUTIVA II","APOYO EN FORMACION TECNICA","RH/087/2013"]
[null,"CHIHUAHUA","EAGK7806257R9","EAGK780625MCHSBR04","KARLA  ESPARZA GABALDON","8310110030207CF3320600.013431",83101,1003,"02","07","CF33206","00.0",13431,20120322,99999999,134361.34,0,"08DPT0007X","08DPT0002B",100,"/","h","JEFE DE PROYECTO PROMOCION Y VINCULACION","APOYO PARA EL DEPARTAMENTO","O.I.I. D-38-2012"]
[null,"CHIHUAHUA","CAEA740422SF8","CAEA740422MCHBSL02","ALMA SOFIA CABALLERO ESPARZA","8310110030207CF3320600.013431",83101,1003,"02","07","CF33206","00.0",13431,20170201,99999999,133721.97,0,"08DPT0007X","08DPT0002B",100,"/","h","JEFE DE PROYECTO CAPACITACION","APOYO PARA EL DEPARTAMENTO","DGE/108/2017"]
[null,"CHIHUAHUA","HEGJ620729F26","HEGJ620729HCHRNV07","JOSE JAVIER HERNANDEZ GONZALEZ","8310110030207CF3320600.014112",83101,1003,"02","07","CF33206","00.0",14112,20170201,99999999,102053.96,0,"08DPT0007X","08DPT0002B",100,"/","h","JEFE DE PROYECTO INFORMATICA","APOYO PARA EL DEPARTAMENTO","AJ/OFC/03/2017"]
[null,"CHIHUAHUA","TULO5510064A6","TULO551006MCHDYL01","OLGA ESPERANZA TUDA LEYVA","8310110030207CF3320600.013432",83101,1003,"02","07","CF33206","00.0",13432,20171001,99999999,78301.710000000006,0,"08DPT0007X","08DPT0002B",100,"/","h","JEFE DE PROYECTO SERVICIOS ESCOLARES","APOYO PARA EL DEPARTAMENTO","RH/087/2017"]
[null,"CHIHUAHUA","FEPD840911LH2","FEPD840911MCHRZN04","DENISSE JANETT FERNANDEZ PAEZ","8310110030219CF3320400.09714",83101,1003,"02","19","CF33204","00.0",9714,20130716,99999999,85357,0,"08DPT0011J","00XXX0000X",120,"/","h","SUBJEFE TECNICO ESPECIALISTA","APOYO AL DEPARTAMENTO DE RECURSOS HUMANOS","DGE/364/2013"]
[null,"CHIHUAHUA","MACE880915VB1","MACE880915HCHRNR04","MARTELL CONTRERAS ERICK ","8310110030219CF3320400.09705",83101,1003,"02","19","CF33204","00.0",9705,20170201,99999999,74466.22,0,"08DPT0011J","00XXX0000X",120,"/","h","SUBJEFE TECNICO ESPECIALISTA","APOYO AL PLANTEL PARRAL "," AJ/OFC/02/2017"]
[null,"CHIHUAHUA","CATC7205274V8","CATC720527HCHNRR09","CARLOS CANO TORRES","8310110030704CF3320400.010990",83101,1003,"07","04","CF33204","00.0",10990,20110104,99999999,118152.38,0,"00XXX0000X","08DPT0013H",124,"/","h","PREFECTO","APOYO PARA EL DEPARTAMENTO","DGE/001-B/2011"]
[null,"CHIHUAHUA","MONL710121CT7","MONL710121MSLGVR08","LORENA INES MOGUEL NOVELO","8310110030704CF0160100.010993",83101,1003,"07","04","CF01601","00.0",10993,20170201,99999999,84502.13,0,"00XXX0000X","08DPT0007X",124,"/","h","PROMOCION Y VINCULACION","APOYO PARA EL DEPARTAMENTO","DGE/105/2017"]
[null,"CHIHUAHUA","PALU750621U84","PAXL750621HCHLXS05","LUIS ENRIQUE PALACIOS","8310110030704CF3320400.010995",83101,1003,"07","04","CF33204","00.0",10995,20170201,99999999,109994.8,0,"00XXX0000X","08DPT0002B",124,"/","h","JEFE DE INFORMÁTICA","APOYO PARA EL DEPARTAMENTO","DGE/104/2017"]
[null,"CHIHUAHUA","PELV7211011F2","PELV721101MCHRY06","VERONICA PERALES LEYVA","8310110030704CF0160100.011822",83101,1003,"07","04","CF01601","00.0",11822,20170701,20171015,10338.25,0,"00XXX0000X","00XXX0000X",124,"/","h","RELACIONES PUBLICAS","APOYO PARA EL DEPARTAMENTO","RH/88/2017"]
[null,"CHIHUAHUA","QUEG630216GA8","QUEG630216MCHXSR02","QUIÑONEZ ESTRADA GRACIELA","8310110030704CF0160100.011822",83101,1003,"07","04","CF01601","00.0",11822,20171016,99999999,58530.83,0,"00XXX0000X","00XXX0000X",124,"/","h","RELACIONES PUBLICAS","APOYO PARA EL DEPARTAMENTO","RH/105/2017"]
[null,"Total Personas : ",22,null,null,null,null,null,null,null,"Total Plazas : ",null,22,"Total Pto. Federal",null,{"$f":"SUBTOTAL(109,Tabla1[Percepciones pagadas en el Periodo de Comisión con Presupuesto Federal*])","v":2229423.87}]
[]
[null,null,null,null,null,null,null,null,null,null,null,null,"Total Ppto. Otras Fuentes",null,null,null,0]
[]
[null,"*Total de Percepciones reportadas por la Entidad Federativa como pagadas al trabajador durante la comisión."]
[null,"Fuente : Información proporcionada por las Entidades Federativas."]

{"sheet":"A Y II D4","index":3,"n_rows":55,"n_cols":21,"rows_kept":55,"cut":false,"hidden":false,"merged":[[9,1,9,6],[49,13,49,14],[12,16,13,16],[12,17,13,17],[12,20,13,20],[12,1,13,1],[12,3,13,3],[12,4,13,4],[12,5,13,5],[12,6,12,12],[12,13,12,14],[12,2,13,2],[12,18,12,19],[12,15,13,15]]}
[]
[]
[]
[]
[]
[]
[]
[]
[null,"Formato: Personal con Licencia"]
[null,{"$f":"IF('1'!D22=\"Elige el Periodo…\",\"\",'1'!D22)","v":"Fondo de Aportaciones para la Educación Tecnológica y de Adultos/Colegio Nacional de Educación Profesional Técnica (FAETA/CONALEP)"},null,null,null,null,null,null,null,null,null,null,null,null,null,null,null,null,null,null,"4to. Trimestre 2017"]
[]
[]
[null,"Entidad Federativa","R.F.C.","CURP","NOMBRE","Clave integrada","Clave Presupuestal",null,null,null,null,null,null,"Periodo Licencia",null,"Percepciones pagadas en el Periodo de la Licencia con Presupuesto Federal*","Percepciones pagadas en el Periodo de la Licencia con Presupuesto de otra fuente*","Clave CT Origen","Licencia",null,"Descripción de la Licencia"]
[null,null,null,null,null,null,"Partida Presupuestal","Código de Pago","Clave de Unidad","Clave de Sub Unidad","Clave de Categoría","Horas Semana Mes ","Número de Plaza","Inicio","Conclusión",null,null,null,"Clave","Tipo"]
[]
[null,"Entidad Federativa","R.F.C.","CURP","NOMBRE","Clave integrada","Partida Presupuestal","Código de Pago","Clave de Unidad","Clave de Sub Unidad","Clave de Categoría","Horas Semana Mes ","Número de Plaza","Periodo Licencia\nInicio","Periodo Licencia\nConclusión","Percepciones pagadas en el Periodo de la Licencia con Presupuesto Federal*","Percepciones pagadas en el Periodo de la Licencia con Presupuesto de otra fuente*","Clave CT Origen","Licencia\nClave","Licencia\nTipo","Descripción de la Licencia"]
[null,"CHIHUAHUA","MELE840906AR7","MELE840906HCHDYD07","EDGAR IVAN MEDINA LOYA","8310110010025L5XATEC20.00",83101,1001,"00","25","L5XATEC","20.0",0,20170807,20180215,0,0,"08DPT0001C",16,"SIN GOCE","SIN GOCE DE SUELDO"]
[null,"CHIHUAHUA","GAGJ811020H48","GAGJ811020HCHRNN01","JUAN EDUARDO GARDEA GINER","8310110010025L5XCBll9.00",83101,1001,"00","25","L5XCBll","9.0",0,20170807,20180215,0,0,"08DPT0001C",16,"SIN GOCE","SIN GOCE DE SUELDO"]
[null,"CHIHUAHUA","GALR830327972","GALR830327MCHRYS00","ROSA HERLINDA GARCIA  LOYA","8310110010025L5XCBll15.00",83101,1001,"00","25","L5XCBll","15.0",0,20170701,20170930,18749,0,"08DPT0001C",25,"GOCE","POR GRAVIDEZ"]
[null,"CHIHUAHUA","MOAP870129UT9","MOAP870129MCHLCT09","PATRICIA ARALI MOLINA ACOSTA","8310110030025CF3320400.02392",83101,1003,"00","25","CF33204","00.0",2392,20170821,20171118,57124,0,"08DPT0001C",25,"GOCE","POR GRAVIDEZ"]
[null,"CHIHUAHUA","VAAH770519CJ9","VAAH770519HCHZRC04","HECTOR MANUEL VAZQUEZ ARMENDARIZ","8310110030025S0120100.02374",83101,1003,"00","25","S01201","00.0",2374,20170816,20171030,16262,0,"08DPT0001C",14,"GOCE","INCAPACIDAD MEDICA"]
[null,"CHIHUAHUA","EIDM611216HY9","EIDM611216MCHSMY09","MYRNA LETICIA ESPINOZA DOMINGUEZ","8310110030025CF1820300.02397",83101,1003,"00","25","CF18203","00.0",2397,20171001,20171231,69451.570000000007,0,"08DPT0001C",26,"GOCE","PREPENSIONARIA"]
[null,"CHIHUAHUA","NASP6305126A9","NASP630512HCHJLD06","PEDRO GERARDO NAJERA SILVA","8310110030025CF3320600.02385",83101,1003,"00","25","CF33206","00.0",2385,20171101,20180131,145933.65,0,"08DPT0001C",26,"GOCE","PREPENSIONARIA"]
[null,"CHIHUAHUA","GOCY840110NQ4","GOCY840110MCHNLS07","YSELA GONZALEZ CALDERA","8310110010026L5XCB120.00",83101,1001,"00","26","L5XCB1","20.0",0,20171011,20171110,4821,0,"08DPT0002B",14,"GOCE","INCAPACIDAD MEDICA"]
[null,"CHIHUAHUA","ROGJ6511161S5","ROGJ651116HDGCRN00","JUAN JESUS ROCHA GARCIA","8310110030026CF1820300.0131",83101,1003,"00","26","CF18203","00.0",131,20170922,20171019,10081.94,0,"08DPT0002B",14,"GOCE","INCAPACIDAD MEDICA"]
[null,"CHIHUAHUA","ROGJ6511161S5","ROGJ651116HDGCRN00","JUAN JESUS ROCHA GARCIA","8310110030026CF1820300.0131",83101,1003,"00","26","CF18203","00.0",131,20171020,20171116,6770.94,0,"08DPT0002B",14,"GOCE","INCAPACIDAD MEDICA"]
[null,"CHIHUAHUA","ROGJ6511161S5","ROGJ651116HDGCRN00","JUAN JESUS ROCHA GARCIA","8310110030026CF1820300.0131",83101,1003,"00","26","CF18203","00.0",131,20171117,20171204,10329.870000000001,0,"08DPT0002B",14,"GOCE","INCAPACIDAD MEDICA"]
[null,"CHIHUAHUA","ROGJ6511161S5","ROGJ651116HDGCRN00","JUAN JESUS ROCHA GARCIA","8310110030026CF1820300.0131",83101,1003,"00","26","CF18203","00.0",131,20171215,20180109,0,0,"08DPT0002B",16,"SIN GOCE","SIN GOCE DE SUELDO"]
[null,"CHIHUAHUA","HERO621113HM2","HEXR621113HCHRXG06","ROGELIO HERNANDEZ","8310110030026CF3320400.02450",83101,1003,"00","26","CF33204","00.0",2450,20171001,20171231,140198.15,0,"08DPT0002B",26,"GOCE","PREPENSIONARIA"]
[null,"CHIHUAHUA","FOLC560327T8A","FOLC560327MDFLRR07","MARIA DEL CARMEN FLORES LARA","8310110030026CF3320600.09278",83101,1003,"00","26","CF33206","00.0",9278,20171001,20171231,166561.01999999999,0,"08DPT0002B",26,"GOCE","PREPENSIONARIA"]
[null,"CHIHUAHUA","MECR611201IB7","MECR611201HCHZRL07","RAUL MEZA CARDONA","8310110030026CF1820300.02442",83101,1003,"00","26","CF18203","00.0",2442,20171001,20171231,89082.86,0,"08DPT0002B",26,"GOCE","PREPENSIONARIA"]
[null,"CHIHUAHUA","NAMR830722I63","NAMR830722MCHXNB01","REBECA DIANA NAﾑEZ MENDOZA","8310110010156L5XCBI20.00",83101,1001,"01","56","L5XCBI","20.0",0,20170828,20171124,14249,0,"08DPT0003A",25,"GOCE","POR GRAVIDEZ"]
[null,"CHIHUAHUA","EARD8007284EA","EARD800728MCHSCL06","DULCE MARGARITA ESCALANTE ROCHA","8310110010156L5XC20.00",83101,1001,"01","56","L5XC","20.0",0,20170928,20171220,27936,0,"08DPT0003A",25,"GOCE","POR GRAVIDEZ"]
[null,"CHIHUAHUA","HEAA881029IG6","HEAA881029MCHRNN04","ANGELICA HERNANDEZ ANGEL","8310110010156L5XC20.00",83101,1001,"01","56","L5XC","20.0",0,20171009,20180106,25142.400000000001,0,"08DPT0003A",25,"GOCE","POR GRAVIDEZ"]
[null,"CHIHUAHUA","CEBC880121MJ0","CEBC880121MCHBCL06","CLAUDIA INES CEBALLOS BACA","8310110010156L5XCBII20.00",83101,1001,"01","56","L5XCBII","20.0",0,20171030,20180127,8129.75,0,"08DPT0003A",25,"GOCE","POR GRAVIDEZ"]
[null,"CHIHUAHUA","QUVC860309IX4","QUVC860208MCHNLR06","CRISTINA QUINTANA VILLEGAS","8310110010156L5XC18.00",83101,1001,"01","56","L5XC","18.0",0,20171101,20171114,2828,0,"08DPT0003A",22,"GOCE","INCAPACIDAD MEDICA"]
[null,"CHIHUAHUA","JUAL910425AZ8","JUAL910425MCHRLL09","LILIAN JURADO ALVAREZ","8310110010156L5XCBI18.00",83101,1001,"01","56","L5XCBI","18.0",0,20171016,20171220,12726,0,"08DPT0003A",14,"GOCE","INCAPACIDAD MEDICA"]
[null,"CHIHUAHUA","GASK830623VE8","GASK830623MCHRNR06","KARLA GARZA SANDOVAL","8310110010207L5XC17.00",83101,1001,"02","07","L5XC","17.0",0,20170830,20180131,0,0,"08DPT0007X",16,"SIN GOCE","SIN GOCE DE SUELDO"]
[null,"CHIHUAHUA","PESD840502CP3","PESD840502HCHRCG00","DIEGO ALEJANDRO PEREZ SAUCEDO","8310110010207L5XATEC15.00",83101,1001,"02","07","L5XATEC","15.0",0,20170901,20180131,0,0,"08DPT0007X",16,"SIN GOCE","SIN GOCE DE SUELDO"]
[null,"CHIHUAHUA","POSL680327222","POSL680327MCHRLL05","LILIA VERﾓNICA PORRAS SALAZAR","8310110010207L5XCBI17.00",83101,1001,"02","07","L5XCBI","17.0",0,20170801,20180131,0,0,"08DPT0007X",16,"SIN GOCE","SIN GOCE DE SUELDO"]
[null,"CHIHUAHUA","AATG900815VD7","AATG900815MCHLRL09","GLORIA YARALDY ALVARADO TARANGO","8310110010207L5XCBI18.00",83101,1001,"02","07","L5XCBI","18.0",0,20171211,20180310,4721.03,0,"08DPT0007X",25,"GOCE","POR GRAVIDEZ"]
[null,"CHIHUAHUA","ROAA691008HF2","ROAA691008HNLDLD05","ADRIAN DESIDERIO RODRﾍGUEZ ALMAGUER","8310110030207CF3320600.014112",83101,1003,"02","07","CF33206","00.0",14112,20161223,20171115,0,0,"08DPT0007X",16,"SIN GOCE","SIN GOCE DE SUELDO"]
[null,"CHIHUAHUA","EACL8412183L3","EACL841218MCHSRR08","LAURA VERONICA ESTRADA CARRILLO","8310110010207L5XC15.00",83101,1001,"02","07","L5XC","15.0",0,20171122,20180219,14135,0,"08DPT0007X",25,"GOCE","POR GRAVIDEZ"]
[null,"CHIHUAHUA","HEOA9003177A9","HEOA900317MCHRGN09","ANGELICA LIZETTE HERRERA OGAZ","8310110010207L5XCBI18.00",83101,1001,"02","07","L5XCBI","18.0",0,20171106,20180203,28487.49,0,"08DPT0007X",25,"GOCE","POR GRAVIDEZ"]
[null,"CHIHUAHUA","GASA8103319V2","GASA810331MCHRRD08","ADRIANA GARDEA SERRANO","8310110010208L5XCBI20.00",83101,1001,"02","08","L5XCBI","20.0",0,20170814,20171111,8837.5,0,"08DPT0008W",25,"GOCE","POR GRAVIDEZ"]
[null,"CHIHUAHUA","MIRA630916H43","MIRA630916HCHRJN07","ANTONIO MIRANDA ROJO","8310110030208CF3320600.013383",83101,1003,"02","08","CF33206","00.0",13383,20170801,20171031,42193.91,0,"08DPT0008W",26,"GOCE","PREPENSIONARIA"]
[null,"CHIHUAHUA","MAGZ860917JB4","MAGZ860917MCHLLL02","ZULEYKA MARIELA MALDONADO GIL","8310110010218L5XC20.00",83101,1001,"02","18","L5XC","20.0",0,20170817,20171104,9171,0,"08DPT0012I",25,"GOCE","POR GRAVIDEZ"]
[null,"CHIHUAHUA","UIST6008045JA","UIST600804HDGRMM07","TOMAS URBINA SIMENTAL","8310110030218CF1820300.00",83101,1003,"02","18","CF18203","00.0",0,20170928,20171220,43391.07,0,"08DPT0012I",22,"GOCE","INCAPACIDAD MEDICA"]
[null,"CHIHUAHUA","PICM810405PX1","PICM810405MCHRRR02","PRIETO CARRASCO MARIANA","8310110030219S0120100.09723",83101,1003,"02","19","S01201","00.0",9723,20171001,20171231,35760.86,0,"08DPT0011J",14,"GOCE","INCAPACIDAD MEDICA"]
[null,"Total Personas : ",33,null,null,null,null,null,null,null,"Total Plazas : ",null,11,"Total Pto. Federal",null,{"$f":"SUBTOTAL(109,Tabla3[Percepciones pagadas en el Periodo de la Licencia con Presupuesto Federal*])","v":1013075.01}]
[]
[null,null,null,null,null,null,null,null,null,null,null,null,null,"Total Ppto. Otras Fuentes",null,null,0]
[]
[null,"*Total de Percepciones reportadas por la Entidad Federativa como pagadas al trabajador durante la Licencia."]
[null,"Fuente : Información proporcionada por las Entidades Federativas."]

{"sheet":"B)","index":4,"n_rows":26,"n_cols":19,"rows_kept":26,"cut":false,"hidden":false,"merged":[[12,18,13,18],[12,12,13,12],[12,13,13,13],[12,14,13,14],[12,15,12,16],[12,17,13,17],[9,1,9,10],[12,1,13,1],[12,2,13,2],[12,3,13,3],[12,4,13,4],[12,5,12,11]]}
[]
[]
[]
[]
[]
[]
[]
[]
[null,"Formato: Registro Federal de Contribuyentes de Trabajadores con Pagos Retroactivos con un Periodo Mayor a 45 días"]
[null,{"$f":"IF('1'!D22=\"Elige el Periodo…\",\"\",'1'!D22)","v":"Fondo de Aportaciones para la Educación Tecnológica y de Adultos/Colegio Nacional de Educación Profesional Técnica (FAETA/CONALEP)"},null,null,null,null,null,null,null,null,null,null,null,null,null,null,null,"4to. Trimestre 2017"]
[]
[]
[null,"Entidad Federativa","RFC","CURP","Nombre","Clave Presupuestal",null,null,null,null,null,null,"Clave de Centro de Trabajo","Fecha de emisión de pago","Motivo del Pago Retroactivo","Periodo pagado",null,"Días transcurridos para el pago","Percepciones pagadas en el periodo reportado *"]
[null,null,null,null,null,"Partida Presupuestal","Código de Pago","Clave de Unidad","Clave de Sub Unidad","Clave de Categoría","Horas Semana Mes ","Número de Plaza",null,null,null,"Desde","Hasta"]
[]
[null,"Entidad Federativa","RFC","CURP","Nombre","Partida Presupuestal","Código de Pago","Clave de Unidad","Clave de Sub Unidad","Clave de Categoría","Horas semana mes","Número de plaza","Clave de Centro de Trabajo","Fecha de emisión de pago","Motivo del Pago Retroactivo","Periodo pagado\nDesde","Periodo pagado\nHasta","Días transcurridos para el pago","Percepciones pagadas en el periodo reportado *"]
[]
[]
[]
[]
[null,"Total Personas : ",null,null,null,null,null,null,null,null,"Total Plazas : ",null,null,null,null,"Total Percepciones Pagadas:"]
[]
[]
[]
[null,"*Total de Percepciones reportadas por la Entidad Federativa como pagadas en el periodo "]
[null,"Fuente : Información proporcionada por las Entidades Federativas"]

{"sheet":"II B) Y 1","index":5,"n_rows":773,"n_cols":25,"rows_kept":773,"cut":false,"hidden":false,"merged":[[12,4,14,4],[12,3,14,3],[12,2,14,2],[9,1,9,9],[770,21,770,23],[12,1,14,1],[12,5,14,5],[12,24,14,24],[13,6,13,8],[13,9,13,11],[13,12,13,14],[13,15,13,17],[13,18,13,20],[12,6,12,20],[12,21,14,21],[12,22,14,22],[12,23,14,23]]}
[]
[]
[]
[]
[]
[]
[]
[]
[null,"Formato: Plaza / Función"]
[null,{"$f":"IF('1'!D22=\"Elige el Periodo…\",\"\",'1'!D22)","v":"Fondo de Aportaciones para la Educación Tecnológica y de Adultos/Colegio Nacional de Educación Profesional Técnica (FAETA/CONALEP)"},null,null,null,null,null,null,null,null,null,null,null,null,null,null,null,null,null,null,null,null,null,"4to. Trimestre 2017"]
[]
[]
[null,"Entidad Federativa","RFC","CURP","Nombre","Centros de Trabajo","Plazas por tipo de función",null,null,null,null,null,null,null,null,null,null,null,null,null,null,"Total plazas Jornada","Total \nHSM","Total de Honorarios","Total de recursos presupuestales ejercidos en servicios personales en el periodo\n(2)"]
[null,null,null,null,null,null,"Apoyo a la labor educativa",null,null,"Administrativo y de servicio",null,null,"Docente y Apoyo Técnico Pedagógico",null,null,"Directivos y Supervisión",null,null,"Mandos medios y superiores"]
[null,null,null,null,null,null,"Jornada","HSM","Honorarios","Jornada","HSM","Honorarios","Jornada","HSM","Honorarios","Jornada","HSM","Honorarios","Jornada","HSM","Honorarios"]
[]
[null,"Columna1","Columna2","Columna3","Columna4","Columna5","Columna6","Columna7","Columna8","Columna9","Columna10","Columna11","Columna12","Columna13","Columna14","Columna15","Columna16","Columna17","Columna18","Columna19","Columna20","Columna21","Columna22","Columna23","Columna24"]
[null,"CHIHUAHUA","AOML571117Q19","AOML571117MCHCRZ09","LUZ DEL CARMEN ACOSTA MARTINEZ","08DPT0001C",null,null,null,1,0,0,null,null,null,null,null,null,null,null,null,1,0,0,64177.41]
[null,"CHIHUAHUA","AEEF700614J96","AEEF700614HCHLNR00","JOSE FRANCISCO ALDERETE ENRIQUEZ","08DPT0001C",null,null,null,1,0,0,null,null,null,null,null,null,null,null,null,1,0,0,151109.78]
[null,"CHIHUAHUA","BAPF541102CN1","BAPF541102HCHCRR00","FRANCISCO ALBERTO BACA PEREZ","08DPT0001C",null,null,null,1,0,0,null,null,null,null,null,null,null,null,null,1,0,0,59532.7]
[null,"CHIHUAHUA","DIAM641007C15","DIAM641007HCHZCN00","MANUEL DIAZ ACOSTA","08DPT0001C",null,null,null,1,0,0,null,null,null,null,null,null,null,null,null,1,0,0,44594.19]
[null,"CHIHUAHUA","EIDM611216HY9","EIDM611216MCHSMY09","MYRNA LETICIA ESPINOZA DOMINGUEZ","08DPT0001C",null,null,null,1,0,0,null,null,null,null,null,null,null,null,null,1,0,0,75512.75]
[null,"CHIHUAHUA","FEPH590719P2A","FEPH590719MCHRRR08","HORTENSIA FERNANDEZ PARGA","08DPT0001C",null,null,null,1,0,0,null,null,null,null,null,null,null,null,null,1,0,0,45260.41]
[null,"CHIHUAHUA","GADE730513AY2","GADE730513HCHRZL06","ELIAS GARCIA DIAZ","08DPT0001C",null,null,null,1,0,0,null,null,null,null,null,null,null,null,null,1,0,0,53025.85]
[null,"CHIHUAHUA","GAVL610223PM1","GAVL610223MGTRLN08","LEONOR GARZON VALDEZ","08DPT0001C",null,null,null,null,null,null,null,null,null,null,null,null,1,0,0,1,0,0,107549.64]
[null,"CHIHUAHUA","GOBS630722GU7","GOBS630720MCHNLL02","SILVIA CECILIA GONZALEZ BALDERRAMA","08DPT0001C",null,null,null,1,0,0,null,null,null,null,null,null,null,null,null,1,0,0,37809.870000000003]
[null,"CHIHUAHUA","GUSL800307M72","GUSL800307MCHTNL01","LILIANA GUTIERREZ SANDOVAL","08DPT0001C",null,null,null,1,0,0,null,null,null,null,null,null,null,null,null,1,0,0,42169.82]
[null,"CHIHUAHUA","HEFA581028JT6","HEFA581028HSRRLR03","ARISTEO HERNANDEZ FLORES","08DPT0001C",null,null,null,1,0,0,null,null,null,null,null,null,null,null,null,1,0,0,37899.980000000003]
[null,"CHIHUAHUA","HEMM670602FX4","HEMM670602HCHRRL08","MELCHOR HERNANDEZ MORALES","08DPT0001C",null,null,null,1,0,0,null,null,null,null,null,null,null,null,null,1,0,0,152224.31]
[null,"CHIHUAHUA","JUVD951202BR4","JUVD951202HCHRLN06","DANIEL FRANCISCO JUAREZ VILLALOBOS","08DPT0001C",null,null,null,1,0,0,null,null,null,null,null,null,null,null,null,1,0,0,37790.18]
[null,"CHIHUAHUA","LOCS740722BY1","LOCS740722MCHYSN03","SANDRA LOYA CASTAÑEDA","08DPT0001C",null,null,null,1,0,0,null,null,null,null,null,null,null,null,null,1,0,0,59836.53]
[null,"CHIHUAHUA","LOLG6105041CI","LOLG610504HCHZPR03","GERARDO LOZANO LOPEZ","08DPT0001C",null,null,null,1,0,0,null,null,null,null,null,null,null,null,null,1,0,0,52546.69]
[null,"CHIHUAHUA","MASS920625T67","MASS920625MCHNTT05","STEPHANIE MANCHA SOTO","08DPT0001C",null,null,null,1,0,0,null,null,null,null,null,null,null,null,null,1,0,0,40173.01]
[null,"CHIHUAHUA","MACN5607036J8","MACN560703MCHRHR01","NORMA MARGARITA MARRUFO CHAPARRO","08DPT0001C",null,null,null,1,0,0,null,null,null,null,null,null,null,null,null,1,0,0,143443.60999999999]
[null,"CHIHUAHUA","MERA640505HY3","MERA640505HCHNYR01","ARMANDO MENDEZ REYES","08DPT0001C",null,null,null,1,0,0,null,null,null,null,null,null,null,null,null,1,0,0,23058.87]
[null,"CHIHUAHUA","MOAP8701294I4","MOAP870129MCHLCT09","PATRICIA ARALI MOLINA ACOSTA","08DPT0001C",null,null,null,1,0,0,null,null,null,null,null,null,null,null,null,1,0,0,78659.62]
[null,"CHIHUAHUA","MOTJ521007RU5","MOTJ521007HCHRRS02","JESUS ALBERTO MORENO TORRES","08DPT0001C",null,null,null,1,0,0,null,null,null,null,null,null,null,null,null,1,0,0,57180.31]
[null,"CHIHUAHUA","NASP6305126A9","NASP630512HCHJLD06","PEDRO GERARDO NAJERA SILVA","08DPT0001C",null,null,null,1,0,0,null,null,null,null,null,null,null,null,null,1,0,0,144068.37]
[null,"CHIHUAHUA","NAOG680625QA5","NAOG680625HCHRRL00","GUILLERMO NICOLAS NARVAEZ ORDAZ","08DPT0001C",null,null,null,1,0,0,null,null,null,null,null,null,null,null,null,1,0,0,58679.78]
[null,"CHIHUAHUA","NAWA860622JI6","NAWA860622HCHVGL05","ALEJANDRO MAURICIO NAVARRO WAGNER","08DPT0001C",null,null,null,null,null,null,null,null,null,null,null,null,1,0,0,1,0,0,84502.13]
[null,"CHIHUAHUA","PEZR580319EY1","PEZR580319MCLRVS09","ROSA MARIA PEREZ ZUBIA","08DPT0001C",null,null,null,1,0,0,null,null,null,null,null,null,null,null,null,1,0,0,47267.57]
[null,"CHIHUAHUA","PIRE860510KC2","PIRE860510HCHZBS00","PIZANO RUBIO ESTALI","08DPT0001C",null,null,null,1,0,0,null,null,null,null,null,null,null,null,null,1,0,0,14928.64]
[null,"CHIHUAHUA","PODM630929V60","PODM630929HCHRZG02","MIGUEL PORTILLO DIAZ","08DPT0001C",null,null,null,1,0,0,null,null,null,null,null,null,null,null,null,1,0,0,49438.79]
[null,"CHIHUAHUA","RAGN6608306N3","RAGN660830MCHMMR01","NORMA RAMIREZ GOMEZ","08DPT0001C",null,null,null,1,0,0,null,null,null,null,null,null,null,null,null,1,0,0,59703.69]
[null,"CHIHUAHUA","REVB701115KRA","REVB701115MCHGTH02","BERDINA REGALADO VITELA","08DPT0001C",null,null,null,1,0,0,null,null,null,null,null,null,null,null,null,1,0,0,104713.87]
[null,"CHIHUAHUA","REMV840531384","REMV840531HCHYRC03","VICTOR MANUEL REYES MURILLO","08DPT0001C",null,null,null,1,0,0,null,null,null,null,null,null,null,null,null,1,0,0,85679.01]
[null,"CHIHUAHUA","REOS610731NK2","REOS610731MCHZLL01","SILVIA PATRICIA REZA OLIVAS","08DPT0001C",null,null,null,1,0,0,null,null,null,null,null,null,null,null,null,1,0,0,158740.62]
[null,"CHIHUAHUA","ROCG710423BI2","ROCG710423MCHDNL05","GILDA ALEJANDRINA RODRIGUEZ CANO","08DPT0001C",null,null,null,1,0,0,null,null,null,null,null,null,null,null,null,1,0,0,55286.22]
[null,"CHIHUAHUA","ROVB9202105WA","ROVB920210HCHDLR05","BRYAN ARMANDO RODRIGUEZ VALVERDE","08DPT0001C",null,null,null,1,0,0,null,null,null,null,null,null,null,null,null,1,0,0,34285.040000000001]
[null,"CHIHUAHUA","RUDA711227IH4","RUDA711227HCHLLR08","ARTURO RUELAS DELGADO","08DPT0001C",null,null,null,1,0,0,null,null,null,null,null,null,null,null,null,1,0,0,56606.09]
[null,"CHIHUAHUA","SOPF600927RV3","SOPF600927MCHTRR08","FERNANDA SOTELO PEREZ","08DPT0001C",null,null,null,1,0,0,null,null,null,null,null,null,null,null,null,1,0,0,39235.160000000003]
[null,"CHIHUAHUA","TOEB620314DK2","TOEB620314HCHRNR09","BERNARDO TORRES ENRIQUEZ","08DPT0001C",null,null,null,1,0,0,null,null,null,null,null,null,null,null,null,1,0,0,53185.59]
[null,"CHIHUAHUA","VAAH770519CJ9","VAAH770519HCHZRC04","HECTOR MANUEL VAZQUEZ ARMENDARIZ","08DPT0001C",null,null,null,1,0,0,null,null,null,null,null,null,null,null,null,1,0,0,30334.17]
[null,"CHIHUAHUA","VIRC720302LS1","VIRC720302MCHLVR06","MARIA CRISTINA VILLAGRAN RIVERA","08DPT0001C",null,null,null,1,0,0,null,null,null,null,null,null,null,null,null,1,0,0,59737.87]
[null,"CHIHUAHUA","VIJD921113BZ7","VIJD921113HCHLRG00","DIEGO EMMANUEL VILLALBA JUAREZ","08DPT0001C",null,null,null,1,0,0,null,null,null,null,null,null,null,null,null,1,0,0,76549.37]
[null,"CHIHUAHUA","AOZL821127LL7","AOZL821127HCHCVS03","ACOSTA ZAVALA LUIS ALBERTO","08DPT0001C",null,null,null,null,null,null,0,108,0,null,null,null,null,null,null,0,108,0,15654.14]
[null,"CHIHUAHUA","AUAJ750122ASA","AUAJ750122HCHGGS03","JESUS AGUILAR AGUILAR","08DPT0001C",null,null,null,null,null,null,0,120,0,null,null,null,null,null,null,0,120,0,16512.89]
[null,"CHIHUAHUA","AULE8612293K4","AULE861229MCHGRL05","ELDA EUNICE AGUIRRE LOERA","08DPT0001C",null,null,null,null,null,null,0,180,0,null,null,null,null,null,null,0,180,0,19951.18]
[null,"CHIHUAHUA","AAMF560125R89","AAMF560125HCHLNL07","FLAVIO RAUL ALVAREZ MONTOYA","08DPT0001C",null,null,null,null,null,null,0,180,0,null,null,null,null,null,null,0,180,0,25479.279999999999]
[null,"CHIHUAHUA","AATL801210PB4","AATL801210MCHLNR06","LOURDES ALVAREZ TINTORI","08DPT0001C",null,null,null,null,null,null,0,108,0,null,null,null,null,null,null,0,108,0,15654.14]
[null,"CHIHUAHUA","AIOM820517TC5","AIOM820517MCHVLR08","MARIANA AVILA OLIVAS","08DPT0001C",null,null,null,null,null,null,0,240,0,null,null,null,null,null,null,0,240,0,34574.080000000002]
[null,"CHIHUAHUA","AAGJ821023VC5","AAGJ821023MCHZZS17","JESSICA CORAL AZAETA GUZMAN","08DPT0001C",null,null,null,null,null,null,0,216,0,null,null,null,null,null,null,0,216,0,23415.11]
[null,"CHIHUAHUA","BAFR630210M78","BAFR630210HCHQEC02","RICARDO BAQUERA FRESCAS","08DPT0001C",null,null,null,null,null,null,0,216,0,null,null,null,null,null,null,0,216,0,26931.96]
[null,"CHIHUAHUA","BAAA801202930","BAAA801202HCHRLL09","ALBERTO GUERRERO BARRAZA ALVAREZ","08DPT0001C",null,null,null,null,null,null,0,216,0,null,null,null,null,null,null,0,216,0,31432.82]
[null,"CHIHUAHUA","BURS661015RT6","BURS661015HCHSSL07","SALVADOR BUSTILLOS RASCON","08DPT0001C",null,null,null,null,null,null,0,144,0,null,null,null,null,null,null,0,144,0,20903.36]
[null,"CHIHUAHUA","CAAM640422S63","CAAM640422MSRMRR03","MARTHA LETICIA CAMPOS ARISMEDI","08DPT0001C",null,null,null,null,null,null,0,240,0,null,null,null,null,null,null,0,240,0,43698.34]
[null,"CHIHUAHUA","CARG7105218G9","CARG710521HCHMMR07","GERARDO CAMPOS RAMIREZ","08DPT0001C",null,null,null,null,null,null,0,192,0,null,null,null,null,null,null,0,192,0,27244.54]
[null,"CHIHUAHUA","CASR730827BZ2","CASR730827HCHNTM09","RAMON ARMANDO CANO SOTO","08DPT0001C",null,null,null,null,null,null,0,240,0,null,null,null,null,null,null,0,240,0,29791.96]
[null,"CHIHUAHUA","CABA600225K67","CABA600225MCHRRR09","ARACELI CARRASCO BARRAZA","08DPT0001C",null,null,null,null,null,null,0,240,0,null,null,null,null,null,null,0,240,0,34398.94]
[null,"CHIHUAHUA","CAON860317HL0","CAON860317MCHRCL00","NALLELY YESENIACARRASCO OCHOA","08DPT0001C",null,null,null,null,null,null,0,120,0,null,null,null,null,null,null,0,120,0,17450.48]
[null,"CHIHUAHUA","CAJM671130A58","CAJM671130HCHRRR04","CARRILLO JUAREZ MAURO GERARDO","08DPT0001C",null,null,null,null,null,null,0,120,0,null,null,null,null,null,null,0,120,0,14839.24]
[null,"CHIHUAHUA","CAAI5611206JA","CAAI561120MCHSRD05","IDELIA CASTRO ARMENDARIZ","08DPT0001C",null,null,null,null,null,null,0,192,0,null,null,null,null,null,null,0,192,0,28172.91]
[null,"CHIHUAHUA","CAFL660707EI1","CAFL660707MCHZLY06","LYDIA CAZARES FLORES","08DPT0001C",null,null,null,null,null,null,0,180,0,null,null,null,null,null,null,0,180,0,22914.61]
[null,"CHIHUAHUA","CEBE6809217B0","CEBE680921HCHNCL06","ELEAZAR MATEO CENICEROS BECERRA","08DPT0001C",null,null,null,null,null,null,0,168,0,null,null,null,null,null,null,0,168,0,25179.97]
[null,"CHIHUAHUA","CEMC581222Q78","CEMC581222MCHRLL09","CLARA CERVANTES MELENDEZ","08DPT0001C",null,null,null,null,null,null,0,240,0,null,null,null,null,null,null,0,240,0,34574.080000000002]
[null,"CHIHUAHUA","CAJF670208887","CAJF670208HCHHRR03","FERNANDO CHACON JURADO","08DPT0001C",null,null,null,null,null,null,0,228,0,null,null,null,null,null,null,0,228,0,32715.35]
[null,"CHIHUAHUA","CAGL640918VT9","CAGL640918MCHHMR07","MARIA DE LOURDES CHAVIRA GOMEZ","08DPT0001C",null,null,null,null,null,null,0,216,0,null,null,null,null,null,null,0,216,0,30621.14]
[null,"CHIHUAHUA","DIAF6905309M4","DIAF690530HDGZLR08","DIAZ ALVARADO FRANCISCO ROBERTO","08DPT0001C",null,null,null,null,null,null,0,132,0,null,null,null,null,null,null,0,132,0,16008.15]
[null,"CHIHUAHUA","DOTM560505JB1","DOTM560505MCHMRR05","MARGARITA DOMINGUEZ TREVIZO","08DPT0001C",null,null,null,null,null,null,0,192,0,null,null,null,null,null,null,0,192,0,27439.72]
[null,"CHIHUAHUA","EARE580710TW7","EARE580710MMCRQL06","ELSA AMALIA ERRAQUIN ROQUE","08DPT0001C",null,null,null,null,null,null,0,156,0,null,null,null,null,null,null,0,156,0,22424.66]
[null,"CHIHUAHUA","EOOC700117F69","EOOC700117HCHSRR08","CARLOS ESCOBEDO ORTEGA","08DPT0001C",null,null,null,null,null,null,0,216,0,null,null,null,null,null,null,0,216,0,31489.31]
[null,"CHIHUAHUA","EACM621211KN0","EACM621211HCHSHR04","JOSE MARTIN ESPARZA CHAVEZ","08DPT0001C",null,null,null,null,null,null,0,228,0,null,null,null,null,null,null,0,228,0,32828.339999999997]
[null,"CHIHUAHUA","EADR661019BU0","EADR661019HCHSZM08","ESPARZA DIAZ RAMON","08DPT0001C",null,null,null,null,null,null,0,120,0,null,null,null,null,null,null,0,120,0,13121.47]
[null,"CHIHUAHUA","EILJ680419MG0","EILJ680419HCHSNR05","JORGE ALBERTO ESPINOZA LUNA","08DPT0001C",null,null,null,null,null,null,0,180,0,null,null,null,null,null,null,0,180,0,26862.2]
[null,"CHIHUAHUA","FECA6103137A4","FECA610313HDFRLB09","ABELARDO FERNANDEZ CALDERON","08DPT0001C",null,null,null,null,null,null,0,216,0,null,null,null,null,null,null,0,216,0,26955.51]
[null,"CHIHUAHUA","FOFL641113DP1","FOFL641113HCHLLS06","LUIS FLORES FLORES","08DPT0001C",null,null,null,null,null,null,0,192,0,null,null,null,null,null,null,0,192,0,28291.56]
[null,"CHIHUAHUA","GAMR760920E78","GAMR760920MCHLNT06","RUTH GALLEGOS MONARCA","08DPT0001C",null,null,null,null,null,null,0,240,0,null,null,null,null,null,null,0,240,0,33800.699999999997]
[null,"CHIHUAHUA","GAVF750826SR2","GAVF750826HCHLLR05","FRANCISCO AGUSTIN GALLEGOS VILLASEÑOR","08DPT0001C",null,null,null,null,null,null,0,120,0,null,null,null,null,null,null,0,120,0,17217.72]
[null,"CHIHUAHUA","GALJ810323DN3","GALJ810323HCHRZS03","JESUS RAUL GARCIA LOZANO","08DPT0001C",null,null,null,null,null,null,0,228,0,null,null,null,null,null,null,0,228,0,32427.54]
[null,"CHIHUAHUA","GAMG821026JM8","GAMG821026HDGRRB08","GABINO GARCIA MARRUFO","08DPT0001C",null,null,null,null,null,null,0,240,0,null,null,null,null,null,null,0,240,0,29027.15]
[null,"CHIHUAHUA","GAOM870316CN9","GAOM870316HCHRRG00","JOSE MIGUEL GARCIA ORTIZ","08DPT0001C",null,null,null,null,null,null,0,240,0,null,null,null,null,null,null,0,240,0,29777.54]
[null,"CHIHUAHUA","GAVV7810103M7","GAVV781010MCHRZR06","VERONICA GARDEA VASQUEZ","08DPT0001C",null,null,null,null,null,null,0,180,0,null,null,null,null,null,null,0,180,0,26380.36]
[null,"CHIHUAHUA","GOAC860518J59","GOAC860518HCHMVR06","CARLOS JOEL GOMEZ AVILA","08DPT0001C",null,null,null,null,null,null,0,228,0,null,null,null,null,null,null,0,228,0,27927.88]
[null,"CHIHUAHUA","GOHS731228LU7","GOHS731228HCHNLM00","SIMON GONZALEZ HOLGUIN","08DPT0001C",null,null,null,null,null,null,0,180,0,null,null,null,null,null,null,0,180,0,20210.32]
[null,"CHIHUAHUA","HEAM7409112X6","HEAM740911MCHRRR00","MARCELA HERNANDEZ ARMENDARIZ","08DPT0001C",null,null,null,null,null,null,0,240,0,null,null,null,null,null,null,0,240,0,34254.019999999997]
[null,"CHIHUAHUA","HEEP940626UVI","HEEP940626MCHRSR02","HERNANDEZ ESTUPIÑON PERLA ALEJANDRA","08DPT0001C",null,null,null,null,null,null,0,80,0,null,null,null,null,null,null,0,80,0,7564.39]
[null,"CHIHUAHUA","HERA781214D5A","HERA781214HCHRMR02","AARON TERCERO HERNANDEZ ROMO","08DPT0001C",null,null,null,null,null,null,0,240,0,null,null,null,null,null,null,0,240,0,34195.54]
[null,"CHIHUAHUA","HESM4812033X7","HESM481203HDFRGR09","MARIO HERNANDEZ SEGURA","08DPT0001C",null,null,null,null,null,null,0,180,0,null,null,null,null,null,null,0,180,0,25849.040000000001]
[null,"CHIHUAHUA","HEMB811018BN2","HEMB811018MCHRNT06","BEATRIZ ELENA HERRERA MENDOZA","08DPT0001C",null,null,null,null,null,null,0,216,0,null,null,null,null,null,null,0,216,0,30431.41]
[null,"CHIHUAHUA","JIVG670122BN0","JIVG670122HVZMLD07","GAUDENCIO JIMENEZ VALENTIN","08DPT0001C",null,null,null,null,null,null,0,180,0,null,null,null,null,null,null,0,180,0,25876.15]
[null,"CHIHUAHUA","LESO760401RV1","LESO760401HCHLXM07","OMAR LEAL SEAÑEZ","08DPT0001C",null,null,null,null,null,null,0,96,0,null,null,null,null,null,null,0,96,0,13262.47]
[null,"CHIHUAHUA","LOGM811218IW7","LOGM811218MCHRNY01","MYRNA GUADALUPE LOERA GONZALEZ","08DPT0001C",null,null,null,null,null,null,0,216,0,null,null,null,null,null,null,0,216,0,26471.67]
[null,"CHIHUAHUA","LOMM630709QH3","LOMM630709MCHPRR06","MIRIAM CAROLINA LOPEZ MARQUEZ","08DPT0001C",null,null,null,null,null,null,0,192,0,null,null,null,null,null,null,0,192,0,27607.79]
[null,"CHIHUAHUA","LOCJ610711AFA","LOCJ610711HCHYHV06","JAVIER BENJAMIN LOYA CHAVIRA","08DPT0001C",null,null,null,null,null,null,0,192,0,null,null,null,null,null,null,0,192,0,28404.55]
[null,"CHIHUAHUA","LOHL711219AQ3","LOHL711219MCHYRL02","LILIANA IVONNE LOYA HERNANDEZ","08DPT0001C",null,null,null,null,null,null,0,168,0,null,null,null,null,null,null,0,168,0,24475.14]
[null,"CHIHUAHUA","LORJ800906V2A","LORJ800906HCHYDS03","JESUS ARTURO LOYA RODRIGUEZ","08DPT0001C",null,null,null,null,null,null,0,216,0,null,null,null,null,null,null,0,216,0,26789.88]
[null,"CHIHUAHUA","MAGP631129C83","MAGP631129HCHRNR03","PERFECTO MARQUEZ GONZALEZ","08DPT0001C",null,null,null,null,null,null,0,192,0,null,null,null,null,null,null,0,192,0,24490.18]
[null,"CHIHUAHUA","MACC861013NB9","MACC861013HCHRLR03","CARLOS ISAAC MARRUFO CALDERON","08DPT0001C",null,null,null,null,null,null,0,228,0,null,null,null,null,null,null,0,228,0,32815.120000000003]
[null,"CHIHUAHUA","MEMM770410518","MEMM770410HCHRNN08","MANUEL MERAZ MENDEZ","08DPT0001C",null,null,null,null,null,null,0,192,0,null,null,null,null,null,null,0,192,0,27240.97]
[null,"CHIHUAHUA","MURE810806BI4","MURE810806HCHXJM08","EMMANUEL MUÑOZ ROJAS","08DPT0001C",null,null,null,null,null,null,0,240,0,null,null,null,null,null,null,0,240,0,26496.66]
[null,"CHIHUAHUA","NAME5210109W5","NAME521010HCHVNN03","ENRIQUE NAVARRO MENDOZA","08DPT0001C",null,null,null,null,null,null,0,180,0,null,null,null,null,null,null,0,180,0,25930.36]
[null,"CHIHUAHUA","OIAO791026IM2","OIAO791026HCHLPS00","OSCAR ERNESTO OLIVAS APONTE","08DPT0001C",null,null,null,null,null,null,0,216,0,null,null,null,null,null,null,0,216,0,31489.31]
[null,"CHIHUAHUA","OILR550330775","OILR550330HCHLPG01","ROGELIO ANASTACIO OLIVAS LOPEZ","08DPT0001C",null,null,null,null,null,null,0,228,0,null,null,null,null,null,null,0,228,0,32449.8]
[null,"CHIHUAHUA","OEZH720627D54","OEZH720627HCHRBG04","HUGO SOCORRO ORTEGA ZUBIATE","08DPT0001C",null,null,null,null,null,null,0,168,0,null,null,null,null,null,null,0,168,0,23357.72]
[null,"CHIHUAHUA","PARM520707MY1","PARM520707HPLLCG03","MIGUEL ANGEL PALMA ROCHA","08DPT0001C",null,null,null,null,null,null,0,96,0,null,null,null,null,null,null,0,96,0,11581.02]
[null,"CHIHUAHUA","PAGM7008098P1","PAGM700809HCHRRR01","MAURO RUBEN PARADA GRANADOS","08DPT0001C",null,null,null,null,null,null,0,96,0,null,null,null,null,null,null,0,96,0,13680.61]
[null,"CHIHUAHUA","PARF590815ED3","PARF590815MVZVSL20","FELICITAS PAVON ROSAS","08DPT0001C",null,null,null,null,null,null,0,240,0,null,null,null,null,null,null,0,240,0,29618.14]
[null,"CHIHUAHUA","PAVE830228SH0","PAVE830228HCHZLN00","ENRIQUE PAZOS VALLES","08DPT0001C",null,null,null,null,null,null,0,240,0,null,null,null,null,null,null,0,240,0,29673.06]
[null,"CHIHUAHUA","PERF790621C3A","PERF790621HCHRGB13","ROBERTO AARON PEREA FIGUEROA","08DPT0001C",null,null,null,null,null,null,0,168,0,null,null,null,null,null,null,0,168,0,18182.46]
[null,"CHIHUAHUA","PECA750727I8A","PECA750727HJCRRL03","JOSE ALEJANDRO PEREZ CORTES","08DPT0001C",null,null,null,null,null,null,0,156,0,null,null,null,null,null,null,0,156,0,23783.200000000001]
[null,"CHIHUAHUA","PICN620328PA0","PICN620328HVZNRR07","JOSE NORBERTO PINEDA CRUZ","08DPT0001C",null,null,null,null,null,null,0,144,0,null,null,null,null,null,null,0,144,0,20681.07]
[null,"CHIHUAHUA","PIRL7804262E7","PIRL780426MCHXZZ09","MARIA LIZETH PIÑON RUIZ","08DPT0001C",null,null,null,null,null,null,0,240,0,null,null,null,null,null,null,0,240,0,33873.49]
[null,"CHIHUAHUA","QURM640822CE7","QURM640822MCHNZR02","MARTINA LILIA QUINTANA RUIZ","08DPT0001C",null,null,null,null,null,null,0,180,0,null,null,null,null,null,null,0,180,0,25707.98]
[null,"CHIHUAHUA","RAGG600206G85","RAGG600206MCHMTR04","GRACIELA IMELDA RAMIREZ GUTIERREZ","08DPT0001C",null,null,null,null,null,null,0,144,0,null,null,null,null,null,null,0,144,0,20122.650000000001]
[null,"CHIHUAHUA","RAMA741011N9A","RAMA741011MCHMRN00","ANABEL RAMOS MORALES","08DPT0001C",null,null,null,null,null,null,0,192,0,null,null,null,null,null,null,0,192,0,28319.81]
[null,"CHIHUAHUA","RARN711008BKS","RARN711008MCHSMR09","NORMA PATRICIA RASCON RAMIREZ","08DPT0001C",null,null,null,null,null,null,0,108,0,null,null,null,null,null,null,0,108,0,15784.23]
[null,"CHIHUAHUA","RECN560808KM6","RECN560808MCHYRR00","MARIA NORMA REYES CARREON","08DPT0001C",null,null,null,null,null,null,0,192,0,null,null,null,null,null,null,0,192,0,27439.72]
[null,"CHIHUAHUA","REOL730620M72","REOL730620MCHYRC05","LUCIA REYES ORTIZ","08DPT0001C",null,null,null,null,null,null,0,180,0,null,null,null,null,null,null,0,180,0,26027.22]
[null,"CHIHUAHUA","RIMI820220GQ7","RIMI820220HCHVCV02","IVAN JOEL RIVERA MACIAS","08DPT0001C",null,null,null,null,null,null,0,168,0,null,null,null,null,null,null,0,168,0,17279.669999999998]
[null,"CHIHUAHUA","ROSL660422DP2","ROSL660422HCHDLZ09","MARIA DE LA LUZ RODARTE SOLIS","08DPT0001C",null,null,null,null,null,null,0,228,0,null,null,null,null,null,null,0,228,0,32421.55]
[null,"CHIHUAHUA","ROAA871025FU9","ROAA871025HCHDGL07","ALBERTO RODRIGUEZ AGUIRRE","08DPT0001C",null,null,null,null,null,null,0,216,0,null,null,null,null,null,null,0,216,0,23889.33]
[null,"CHIHUAHUA","ROGJ630120IE0","ROGJ630120MCHDZS08","MA DE JESUS RODRIGUEZ GUZMAN","08DPT0001C",null,null,null,null,null,null,0,180,0,null,null,null,null,null,null,0,180,0,26011.58]
[null,"CHIHUAHUA","ROAL730412EQ6","ROAL730412HCHJRS01","LUIS JAVIER ROJAS ARAGONEZ","08DPT0001C",null,null,null,null,null,null,0,216,0,null,null,null,null,null,null,0,216,0,31257.68]
[null,"CHIHUAHUA","ROPV750812QL5","ROPV750812HCHMCC00","VICTOR MANUEL ROMERO PACHECO","08DPT0001C",null,null,null,null,null,null,0,180,0,null,null,null,null,null,null,0,180,0,22238.18]
[null,"CHIHUAHUA","ROTO850629550","ROTO850629HCHNRS06","OSCAR ARMANDO RONQUILLO TERAN ","08DPT0001C",null,null,null,null,null,null,0,180,0,null,null,null,null,null,null,0,180,0,19195.64]
[null,"CHIHUAHUA","ROVI820310797","ROVI820310HCLNLV07","IVAN RAMON RONQUILLO VILLALBA","08DPT0001C",null,null,null,null,null,null,0,216,0,null,null,null,null,null,null,0,216,0,30732.3]
[null,"CHIHUAHUA","RUNH860818SE6","RUNH860818HCHBJM07","HUMBERTO ALONSO RUBIO NAJERA","08DPT0001C",null,null,null,null,null,null,0,216,0,null,null,null,null,null,null,0,216,0,18387.400000000001]
[null,"CHIHUAHUA","RUMS740226UR4","RUMS740226MCHZRL09","MARIA SOLEDAD RUIZ MARQUEZ","08DPT0001C",null,null,null,null,null,null,0,240,0,null,null,null,null,null,null,0,240,0,34574.080000000002]
[null,"CHIHUAHUA","SAQG720512DU6","SAQG720512MCHNXD07","MARIA GUADALUPE SAENZ QUIÑONEZ","08DPT0001C",null,null,null,null,null,null,0,180,0,null,null,null,null,null,null,0,180,0,26011.59]
[null,"CHIHUAHUA","SEAI880810AV4","SEAI880810MCHRMR02","IRIS ROSALI SERNA AMPARAN","08DPT0001C",null,null,null,null,null,null,0,204,0,null,null,null,null,null,null,0,204,0,25145.09]
[null,"CHIHUAHUA","SIML5803182A8","SIML580318HCHLJS14","JOSE LUIS CARLOS SILVEYRA MEJIA","08DPT0001C",null,null,null,null,null,null,0,240,0,null,null,null,null,null,null,0,240,0,34082.550000000003]
[null,"CHIHUAHUA","TAAD800122GU1","TAAD800122HCHRRL07","DELFINO TARIN ARMENDARIZ","08DPT0001C",null,null,null,null,null,null,0,216,0,null,null,null,null,null,null,0,216,0,30323.85]
[null,"CHIHUAHUA","UIOM9106177H6","UIOM910617MCHRRR04","MARIBEL URIZA ORTIZ","08DPT0001C",null,null,null,null,null,null,0,180,0,null,null,null,null,null,null,0,180,0,22238.18]
[null,"CHIHUAHUA","VACA610212RT2","VACA610212HCHLHD03","ADOLFO VALLES CHAVEZ","08DPT0001C",null,null,null,null,null,null,0,192,0,null,null,null,null,null,null,0,192,0,27998.14]
[null,"CHIHUAHUA","VADS631230CN3","VADS631230MCHLVL06","SILVIA LETICIA VALVERDE DAVILA","08DPT0001C",null,null,null,null,null,null,0,240,0,null,null,null,null,null,null,0,240,0,34574.080000000002]
[null,"CHIHUAHUA","VIRR710926945","VIRR710926HCHLDB12","RUBEN VILLALOBOS RODRIGUEZ","08DPT0001C",null,null,null,null,null,null,0,240,0,null,null,null,null,null,null,0,240,0,34489.339999999997]
[null,"CHIHUAHUA","VIPR570927K44","VIPR570927HCHLYF07","RAFAEL JESUS VILLEGAS PAYAN","08DPT0001C",null,null,null,null,null,null,0,240,0,null,null,null,null,null,null,0,240,0,33420.339999999997]
[null,"CHIHUAHUA","AUPC720823T59","AUPC720823MZSGLL09","CLARA AGÜERO PALACIOS","08DPT0002B",null,null,null,1,0,0,null,null,null,null,null,null,null,null,null,1,0,0,44427.96]
[null,"CHIHUAHUA","AUSL630319SGO","AUSL630319HZSGFC09","JOSE LUCIANO AGUILERA SIFUENTES","08DPT0002B",null,null,null,1,0,0,null,null,null,null,null,null,null,null,null,1,0,0,184352.16999999998]
[null,"CHIHUAHUA","AAAJ9101208M3","AAAJ910120HCHLCS03","JESUS FABIAN ALVARADO  ACOSTA","08DPT0002B",null,null,null,1,0,0,null,null,null,null,null,null,null,null,null,1,0,0,63378.78]
[null,"CHIHUAHUA","AAAN671110TZ0","AAAN671110MCHLCC06","NICOLASA ALVARADO  ACOSTA","08DPT0002B",null,null,null,1,0,0,null,null,null,null,null,null,null,null,null,1,0,0,157866.05000000002]
[null,"CHIHUAHUA","AAEM620508I55","AAEM620508HCLLSG04","MIGUEL ANGEL ALVARADO  ESPARZA","08DPT0002B",null,null,null,1,0,0,null,null,null,null,null,null,null,null,null,1,0,0,73594.41]
[null,"CHIHUAHUA","AISJ790419494","AISJ790419HCHRTN04","JUAN MANUEL ARIAS  SOTELO","08DPT0002B",null,null,null,1,0,0,null,null,null,null,null,null,null,null,null,1,0,0,123173.94999999998]
[null,"CHIHUAHUA","BAML650601B92","BAML650601HDFRLS03","JOSE LUIS  BARRIENTOS MILAN","08DPT0002B",null,null,null,1,0,0,null,null,null,null,null,null,null,null,null,1,0,0,56976.46]
[null,"CHIHUAHUA","BOMA6710214E1","BOMA671021HDFLXR07","ARMANDO BOLAÑOS MUÑOZ","08DPT0002B",null,null,null,1,0,0,null,null,null,null,null,null,null,null,null,1,0,0,151802.12]
[null,"CHIHUAHUA","CAPL820818LQ5","CAPL820818HCHMRS04","LUIS ROBERTO CAMPOS PORTILLO","08DPT0002B",null,null,null,1,0,0,null,null,null,null,null,null,null,null,null,1,0,0,66845.79250000001]
[null,"CHIHUAHUA","CACL731031A17","CACL731031MCHRNR01","LORENA CARRILLO CANO","08DPT0002B",null,null,null,1,0,0,null,null,null,null,null,null,null,null,null,1,0,0,56391.560000000005]
[null,"CHIHUAHUA","CARJ6012178GA","CARJ601217HCHRLS07","JOSE DE JESUS CARRILLO RUELAS","08DPT0002B",null,null,null,1,0,0,null,null,null,null,null,null,null,null,null,1,0,0,73991.330000000016]
[null,"CHIHUAHUA","CARP8408274S7","CARP840827MCHHCR02","PERLA CHAVEZ ROCHA","08DPT0002B",null,null,null,1,0,0,null,null,null,null,null,null,null,null,null,1,0,0,80723.23]
[null,"CHIHUAHUA","CIBA710920FVA","CIBA710920MDGTRL04","ALMA ROSA CITAL BERTAHUD","08DPT0002B",null,null,null,1,0,0,null,null,null,null,null,null,null,null,null,1,0,0,173022.32]
[null,"CHIHUAHUA","COMA6908143J5","COXM690814HCHNXR11","MARIO CONTRERAS N/A","08DPT0002B",null,null,null,1,0,0,null,null,null,null,null,null,null,null,null,1,0,0,87514.52]
[null,"CHIHUAHUA","DEMA661118M56","DEMA661118HCHLRB07","JOSE ABELARDO DELGADO  MORALES","08DPT0002B",null,null,null,1,0,0,null,null,null,null,null,null,null,null,null,1,0,0,137661.41]
[null,"CHIHUAHUA","FACF8611101I7","FACF861110HCHVNR02","FERNANDO FAVELA  CONTRERAS","08DPT0002B",null,null,null,1,0,0,null,null,null,null,null,null,null,null,null,1,0,0,57994.98]
[null,"CHIHUAHUA","FIGS610608SA8","FIGS610608MJCGNL02","SILVIA FIGUEROA GONZALEZ","08DPT0002B",null,null,null,1,0,0,null,null,null,null,null,null,null,null,null,1,0,0,140565.17000000001]
[null,"CHIHUAHUA","FOLC560327T8A","FOLC560327MDFLRR07","MARIA DEL CARMEN FLORES  LARA","08DPT0002B",null,null,null,1,0,0,null,null,null,null,null,null,null,null,null,1,0,0,166561.01999999999]
[null,"CHIHUAHUA","GAMA6609167M4","GAXM660916MCHLXR06","MARIBEL GALLARDO N/A","08DPT0002B",null,null,null,1,0,0,null,null,null,null,null,null,null,null,null,1,0,0,71965.22]
[null,"CHIHUAHUA","GAAD780823GZ6","GAAD780823MCHRLL01","DULCE AURORA DEL CONSUELO GARCIA ALEMAN","08DPT0002B",null,null,null,1,0,0,null,null,null,null,null,null,null,null,null,1,0,0,86767.94]
[null,"CHIHUAHUA","GALE580105G5A","GALE580105HCHRNN03","ENRIQUE GARCIA DE LUNA","08DPT0002B",null,null,null,1,0,0,null,null,null,null,null,null,null,null,null,1,0,0,69719.39]
[null,"CHIHUAHUA","HERO621113HM2","HEXR621113HCHRXG06","ROGELIO HERNANDEZ N/A","08DPT0002B",null,null,null,1,0,0,null,null,null,null,null,null,null,null,null,1,0,0,140198.15]
[null,"CHIHUAHUA","LAGP591112155","LAGP591112HCHRYD07","PEDRO LARES GAYTAN","08DPT0002B",null,null,null,1,0,0,null,null,null,null,null,null,null,null,null,1,0,0,69260.179999999993]
[null,"CHIHUAHUA","LIHJ9107073M0","LIHJ910707HCHRRS09","JASSON RAYMUNDO LIRA HERRERA","08DPT0002B",null,null,null,1,0,0,null,null,null,null,null,null,null,null,null,1,0,0,61113.43]
[null,"CHIHUAHUA","LIMR6608162E8","LIMR660816HZSRNY01","RAYMUNDO LIRA MENDOZA","08DPT0002B",null,null,null,1,0,0,null,null,null,null,null,null,null,null,null,1,0,0,184677.54]
[null,"CHIHUAHUA","LOCJ6307091T8","LOCJ630709HCHPRS08","JESUS MARTIN LOPEZ CARO","08DPT0002B",null,null,null,1,0,0,null,null,null,null,null,null,null,null,null,1,0,0,170813.44255000001]
[null,"CHIHUAHUA","LORE9304089K5","LORE930408HCHYSR01","EARVIN MANUEL LOYA  RIOS","08DPT0002B",null,null,null,1,0,0,null,null,null,null,null,null,null,null,null,1,0,0,53861.55]
[null,"CHIHUAHUA","LOCJ681030V96","LOCJ681030HCHZLS07","JESUS EDUARDO LOZOYA  CALDERON","08DPT0002B",null,null,null,1,0,0,null,null,null,null,null,null,null,null,null,1,0,0,72062.53]
[null,"CHIHUAHUA","MELE5809218Z2","MELE580921MCHDLG09","MARIA EUGENIA  MEDINA LEAL","08DPT0002B",null,null,null,1,0,0,null,null,null,null,null,null,null,null,null,1,0,0,16785.11]
[null,"CHIHUAHUA","MECR611201JJA","MECR611201HCHZRL15","RAUL MEZA CARDONA","08DPT0002B",null,null,null,1,0,0,null,null,null,null,null,null,null,null,null,1,0,0,89082.860000000015]
[null,"CHIHUAHUA","MODC711228F67","MODC711228HCLNRR07","CARLOS EDUARDO MONTANO DURAN","08DPT0002B",null,null,null,null,null,null,null,null,null,null,null,null,1,0,0,1,0,0,127229.55999999998]
[null,"CHIHUAHUA","MOSG761016858","MOSG761016HCLNNR06","GERARDO MONTOYA SANCHEZ","08DPT0002B",null,null,null,1,0,0,null,null,null,null,null,null,null,null,null,1,0,0,68734.490000000005]
[null,"CHIHUAHUA","OOGL660522NA4","OOGL660522HCHCRS08","LUIS FELIX OCHOA GARCIA","08DPT0002B",null,null,null,1,0,0,null,null,null,null,null,null,null,null,null,1,0,0,60189.570000000007]
[null,"CHIHUAHUA","OORE7405071DA","OORE740507MCHRYS00","MARIA ESTHER OROZCO REYES","08DPT0002B",null,null,null,1,0,0,null,null,null,null,null,null,null,null,null,1,0,0,77318.150000000009]
[null,"CHIHUAHUA","RARF8407015TA","RARF840701MCHMML00","FLOR MINERVA RAMIREZ RAMIREZ","08DPT0002B",null,null,null,1,0,0,null,null,null,null,null,null,null,null,null,1,0,0,71571.75]
[null,"CHIHUAHUA","ROGJ6511161S5","ROGJ651116HDGCRN00","JUAN JESUS ROCHA GARCIA","08DPT0002B",null,null,null,1,0,0,null,null,null,null,null,null,null,null,null,1,0,0,70070.899999999994]
[null,"CHIHUAHUA","ROGM631230AD4","ROGM631230MCHMRR18","MARCIA IMELDA ROMERO GARCIA","08DPT0002B",null,null,null,1,0,0,null,null,null,null,null,null,null,null,null,1,0,0,55360.9]
[null,"CHIHUAHUA","ROCS700130LMA","ROCS700130MDGDLL00","SILVIA ESTELA RODRIGUEZ CALVILLO","08DPT0002B",null,null,null,null,null,null,null,null,null,null,null,null,1,0,0,1,0,0,63508.11]
[null,"CHIHUAHUA","SAPP7109042V0","SAPP710904HCHLLD06","PEDRO SALAS PALOMINO","08DPT0002B",null,null,null,1,0,0,null,null,null,null,null,null,null,null,null,1,0,0,137537.49000000002]
[null,"CHIHUAHUA","VASC8109266G6","VASC810926MCHLLL08","CLAUDIA VALVERDE SALAZAR","08DPT0002B",null,null,null,1,0,0,null,null,null,null,null,null,null,null,null,1,0,0,73766.070000000007]
[null,"CHIHUAHUA","VAFM681203S84","VAFM681203MCHZGR05","MARICRUZ VAZQUEZ FIGUEROA","08DPT0002B",null,null,null,1,0,0,null,null,null,null,null,null,null,null,null,1,0,0,126492.94100000002]
[null,"CHIHUAHUA","AARL701222GC6","AARL701222MCHRVB04","LIBIA GABRIELA ARAGON RIVERA","08DPT0002B",null,null,null,null,null,null,0,240,0,null,null,null,null,null,null,0,240,0,47006.879999999997]
[null,"CHIHUAHUA","BAGR640911VB4","BAGR640911HCHRND09","RODOLFO ELI BARONA GONZALEZ","08DPT0002B",null,null,null,null,null,null,0,180,0,null,null,null,null,null,null,0,180,0,25688.5]
[null,"CHIHUAHUA","BEBB870829EY4","BEEBB870829MCHLLR06","BERTHA MARISSA BELTRAN BELTRAN","08DPT0002B",null,null,null,null,null,null,0,144,0,null,null,null,null,null,null,0,144,0,18817.940000000002]
[null,"CHIHUAHUA","BOAI840527A86","BOAI840527MCHRGN00","MARIA INES BORUNDA AGUILAR","08DPT0002B",null,null,null,null,null,null,0,216,0,null,null,null,null,null,null,0,216,0,40889.540000000008]
[null,"CHIHUAHUA","CAVM69042817A","CAVM690428HCHBGR00","MARIO ALBERTO CABALLERO VEGA","08DPT0002B",null,null,null,null,null,null,0,168,0,null,null,null,null,null,null,0,168,0,2985.85]
[null,"CHIHUAHUA","CACS480226NE5","CACS480226HGTMPL06","SALVADOR CAMPOS CAPETILLO","08DPT0002B",null,null,null,null,null,null,0,240,0,null,null,null,null,null,null,0,240,0,46550.18]
[null,"CHIHUAHUA","CAPH630209KZO","CAPH630209MCHRSL06","HILDA MARGARITA CARRASCO POSADA","08DPT0002B",null,null,null,null,null,null,0,240,0,null,null,null,null,null,null,0,240,0,48306.879999999997]
[null,"CHIHUAHUA","COCD901004DB8","COCD901004MCHRHN09","DAINA ROCIO CORTES CHAVEZ","08DPT0002B",null,null,null,null,null,null,0,216,0,null,null,null,null,null,null,0,216,0,38374.589999999997]
[null,"CHIHUAHUA","EABM680229EQ9","EABM680229MCHSDR08","MARTHA GUADALUPE ESCALANTE BADILLO","08DPT0002B",null,null,null,null,null,null,0,240,0,null,null,null,null,null,null,0,240,0,41654.35]
[null,"CHIHUAHUA","EOHA790831RH0","EOHA790831MZSSRN01","MARIA DE LOS ANGELES ESCOBAR DE HARO","08DPT0002B",null,null,null,null,null,null,0,216,0,null,null,null,null,null,null,0,216,0,43771.799999999996]
[null,"CHIHUAHUA","EAML780807EM2","EAML780807MCHSRR05","LAURA LORENA ESTRADA MURILLO","08DPT0002B",null,null,null,null,null,null,0,240,0,null,null,null,null,null,null,0,240,0,32006.879999999997]
[null,"CHIHUAHUA","FAMA641105R5A","FAMA641105MCHVRL07","ALMA ISABEL FAVELA MARTINEZ","08DPT0002B",null,null,null,null,null,null,0,240,0,null,null,null,null,null,null,0,240,0,47514.02]
[null,"CHIHUAHUA","FOLS800726I38","FOLS800726MCHLCN07","SANDYANA FLORES LUCERO","08DPT0002B",null,null,null,null,null,null,0,192,0,null,null,null,null,null,null,0,192,0,39540.839999999997]
[null,"CHIHUAHUA","FONE671109ME3","FONE671109MCHLVS06","ESPERANZA FLORES NAVARRO","08DPT0002B",null,null,null,null,null,null,0,240,0,null,null,null,null,null,null,0,240,0,47850.18]
[null,"CHIHUAHUA","GAAF8909263V9","GAAF890926MCHRLR05","FERNANDA SOFIA GARCIA ALVARADO","08DPT0002B",null,null,null,null,null,null,0,180,0,null,null,null,null,null,null,0,180,0,3554.59]
[null,"CHIHUAHUA","GAGC810607AX3","GAGC810607MCHRRH23","CHRISTIAN BELEN GARCIA GARCIA","08DPT0002B",null,null,null,null,null,null,0,240,0,null,null,null,null,null,null,0,240,0,47389.34]
[null,"CHIHUAHUA","GALJ860302G54","GALJ860302HGTRNV04","JAVIER GARCIA LUNA","08DPT0002B",null,null,null,null,null,null,0,240,0,null,null,null,null,null,null,0,240,0,44195.83]
[null,"CHIHUAHUA","GOAJ891103DFA","GOAJ891103HCHNLR08","JORGE OMAR GONZALEZ ALVIDREZ","08DPT0002B",null,null,null,null,null,null,0,120,0,null,null,null,null,null,null,0,120,0,15906.380000000001]
[null,"CHIHUAHUA","GOCY840110NQ4","GOCY840110MCHNLS07","YSELA GONZALEZ CALDERA","08DPT0002B",null,null,null,null,null,null,0,240,0,null,null,null,null,null,null,0,240,0,33553.730000000003]
[null,"CHIHUAHUA","GOMA851115JC8","GOMA851115HCHNRR07","AARON ROBERTO GONZALEZ MORAN","08DPT0002B",null,null,null,null,null,null,0,240,0,null,null,null,null,null,null,0,240,0,43922.460000000006]
[null,"CHIHUAHUA","GOPS780818LH4","GOPS780818HCHNRR01","SERGIO GONZALEZ PEREZ","08DPT0002B",null,null,null,null,null,null,0,204,0,null,null,null,null,null,null,0,204,0,42667.11]
[null,"CHIHUAHUA","GUFD63111111A","GUFD631111MSLVRN17","DINA YESENIA GUEVARA FIERRO","08DPT0002B",null,null,null,null,null,null,0,240,0,null,null,null,null,null,null,0,240,0,38268.839999999997]
[null,"CHIHUAHUA","HEDC640302NR2","HEDC640302HZSRZR01","CARLOS HERNANDEZ DIAZ","08DPT0002B",null,null,null,null,null,null,0,228,0,null,null,null,null,null,null,0,228,0,48477.859999999993]
[null,"CHIHUAHUA","HERJ6108185C5","HERJ610818HCHRBS03","JESUS ALBERTO HERNANDEZ RUBIO","08DPT0002B",null,null,null,null,null,null,0,90,0,null,null,null,null,null,null,0,90,0,39901.859999999993]
[null,"CHIHUAHUA","HUMA9110245Y2","HUMA911024MNERLN04","ANEL HURTADO MOLINA","08DPT0002B",null,null,null,null,null,null,0,180,0,null,null,null,null,null,null,0,180,0,13799.89]
[null,"CHIHUAHUA","IARL8304031L7","IARL830403HZSBMS09","LUIS ROMAN IBARRA  RAMOS","08DPT0002B",null,null,null,null,null,null,0,168,0,null,null,null,null,null,null,0,168,0,3554.59]
[null,"CHIHUAHUA","JAAZ890626IJ1","JAAZ890626MCHSVM08","ZIMRI DANIEL JASSO AVILA","08DPT0002B",null,null,null,null,null,null,0,180,0,null,null,null,null,null,null,0,180,0,29289.350000000002]
[null,"CHIHUAHUA","LAOE880302RW2","LAOE880302MCHZRL08","ELIZA ARELY LAZALDE ORTIZ","08DPT0002B",null,null,null,null,null,null,0,240,0,null,null,null,null,null,null,0,240,0,28919.430000000004]
[null,"CHIHUAHUA","LEGF590530LW9","LEGF590530HCHNTR00","FERNANDO LEON GUTIERREZ","08DPT0002B",null,null,null,null,null,null,0,240,0,null,null,null,null,null,null,0,240,0,42257.060000000005]
[null,"CHIHUAHUA","LOCA790201FP3","LXCA790201HCHRSD09","ADRIAN FRANCISCO LOERA  CASTRO","08DPT0002B",null,null,null,null,null,null,0,216,0,null,null,null,null,null,null,0,216,0,47178.259999999995]
[null,"CHIHUAHUA","LORF830406762","LORF830406HCHPML02","FELIPE LOPEZ RAMIREZ","08DPT0002B",null,null,null,null,null,null,0,240,0,null,null,null,null,null,null,0,240,0,43908.4]
[null,"CHIHUAHUA","LOCB931112","LOCB931112HCHZSR02","BRAULIO ALEJANDRO LOZANO CASAS","08DPT0002B",null,null,null,null,null,null,0,204,0,null,null,null,null,null,null,0,204,0,40209.439999999995]
[null,"CHIHUAHUA","LUGG880415UKA","LURG880415MCHNVB04","GABRIELA ALEJANDRA LUNA  RIVAS","08DPT0002B",null,null,null,null,null,null,0,240,0,null,null,null,null,null,null,0,240,0,4029.34]
[null,"CHIHUAHUA","MARJ6706253G1","MARJ670625HCHRSN08","JUAN FRANCISCO MARQUEZ DE LA ROSA","08DPT0002B",null,null,null,null,null,null,0,240,0,null,null,null,null,null,null,0,240,0,41721.929999999993]
[null,"CHIHUAHUA","MAHR7303052U1","MAHR730305HCHRRG05","RIGOBERTO MARTINEZ HERNANDEZ","08DPT0002B",null,null,null,null,null,null,0,216,0,null,null,null,null,null,null,0,216,0,41004.35]
[null,"CHIHUAHUA","MARE920423KX8","MARE920423MCHRNR05","ERIKA ELIZABETH MARTINEZ RANGEL","08DPT0002B",null,null,null,null,null,null,0,216,0,null,null,null,null,null,null,0,216,0,37823.21]
[null,"CHIHUAHUA","MAER7001128F3","MAER700112MCHTSQ04","RAQUEL  MATA ESPARZA","08DPT0002B",null,null,null,null,null,null,0,228,0,null,null,null,null,null,null,0,228,0,33106.75]
[null,"CHIHUAHUA","MAMJ7909266H9","MAMJ790926HNLTDV08","JAVIER ISAIAS MATA MEDINA","08DPT0002B",null,null,null,null,null,null,0,240,0,null,null,null,null,null,null,0,240,0,46552.420000000006]
[null,"CHIHUAHUA","MEMA740518TM8","MEMA740518HCHLLL03","ALFONSO NATANAEL MELENDEZ MELENDEZ","08DPT0002B",null,null,null,null,null,null,0,240,0,null,null,null,null,null,null,0,240,0,32144.35]
[null,"CHIHUAHUA","MEPF691219UT3","MEPF691219HCHLRR06","FRANCISCO JAVIER MELENDEZ PEREYRA","08DPT0002B",null,null,null,null,null,null,0,216,0,null,null,null,null,null,null,0,216,0,41607.060000000005]
[null,"CHIHUAHUA","MERE811126DU3","MERE811126MCHLMD02","EDNA MELINA MELERO RAMIREZ","08DPT0002B",null,null,null,null,null,null,0,180,0,null,null,null,null,null,null,0,180,0,42365.71]
[null,"CHIHUAHUA","MEMN800616CH0","MEMN800616MZSNRR04","NORA DE LOURDES MENDEZ MARRUFO","08DPT0002B",null,null,null,null,null,null,0,240,0,null,null,null,null,null,null,0,240,0,36751.9]
[null,"CHIHUAHUA","MEPM521007BW0","MEPM521007MSPNTR05","MARINA MENDOZA PATIÑO","08DPT0002B",null,null,null,null,null,null,0,216,0,null,null,null,null,null,null,0,216,0,47199.970000000008]
[null,"CHIHUAHUA","MEHE771226AK0","MEHE771226MCHZRM07","EMMA MARINA MEZA HERNANDEZ","08DPT0002B",null,null,null,null,null,null,0,228,0,null,null,null,null,null,null,0,228,0,44558.400000000001]
[null,"CHIHUAHUA","MONJ730522LH4","MONJ730522HCHLXN04","JUAN BENJAMIN MOLINA NUÑEZ","08DPT0002B",null,null,null,null,null,null,0,216,0,null,null,null,null,null,null,0,216,0,46204.430000000008]
[null,"CHIHUAHUA","MOMC840319BC5","MOMC840319MCHRRR09","CARMINA SARA MORENO MORALES","08DPT0002B",null,null,null,null,null,null,0,180,0,null,null,null,null,null,null,0,180,0,33446.67]
[null,"CHIHUAHUA","NARE6212101N2","NARE621210HCHVDL15","ELISEO MANUEL NAVA RODRIGUEZ","08DPT0002B",null,null,null,null,null,null,0,168,0,null,null,null,null,null,null,0,168,0,31635.27]
[null,"CHIHUAHUA","NAMR911217QR2","NAMR911217MCHVRY09","REYNA GUADALUPE NAVARRETE MARROQUIN","08DPT0002B",null,null,null,null,null,null,0,216,0,null,null,null,null,null,null,0,216,0,33514.58]
[null,"CHIHUAHUA","OICT7508271I3","OICT750827MCHLRR05","MARIA TERESA OLIVAS  CORONADO","08DPT0002B",null,null,null,null,null,null,0,180,0,null,null,null,null,null,null,0,180,0,34312.189999999995]
[null,"CHIHUAHUA","OEZA770117EH9","OEZA770117HCHRPL04","ALFREDO LORENZO ORTEGA ZEPEDA","08DPT0002B",null,null,null,null,null,null,0,168,0,null,null,null,null,null,null,0,168,0,36054.83]
[null,"CHIHUAHUA","PAVM750409GD9","PAVM750409HCLLRR05","JOSE MARIA PALACIOS VARELA","08DPT0002B",null,null,null,null,null,null,0,80,0,null,null,null,null,null,null,0,80,0,31818.989999999998]
[null,"CHIHUAHUA","PEGF4912049U3","PEGF491204HCHRRR02","FRANCISCO PEREZ GUERRERO","08DPT0002B",null,null,null,null,null,null,0,240,0,null,null,null,null,null,null,0,240,0,16629.41]
[null,"CHIHUAHUA","PELI800928FR2","PELI800928HCHRPG01","JOSE IGNACIO PEREZ LOPEZ","08DPT0002B",null,null,null,null,null,null,0,120,0,null,null,null,null,null,null,0,120,0,47514.02]
[null,"CHIHUAHUA","PEAU670611696","PEAU670611HTSRRB03","ABEL PEREZ URDIERA","08DPT0002B",null,null,null,null,null,null,0,120,0,null,null,null,null,null,null,0,120,0,19803.3]
[null,"CHIHUAHUA","PIMR770113LW6","PIMR770113MCLNXC04","ROCIO PINTO MUÑOZ","08DPT0002B",null,null,null,null,null,null,0,240,0,null,null,null,null,null,null,0,240,0,18059.190000000002]
[null,"CHIHUAHUA","POGH680928E46","POGH680928HCHRTC09","HECTOR MIGUEL PORRAS GUTIERREZ","08DPT0002B",null,null,null,null,null,null,0,180,0,null,null,null,null,null,null,0,180,0,48164.02]
[null,"CHIHUAHUA","QUMJ930605SD1","QUMJ930605HCHZRV04","JAVIER ARTURO QUEZADA MORA","08DPT0002B",null,null,null,null,null,null,0,180,0,null,null,null,null,null,null,0,180,0,32262.400000000001]
[null,"CHIHUAHUA","RABM8107186R9","RAVM810718MCHMRR16","MIRIAM SUSANA RAMIREZ BARRERA","08DPT0002B",null,null,null,null,null,null,0,240,0,null,null,null,null,null,null,0,240,0,3555.3]
[null,"CHIHUAHUA","RACJ670625F74","RACJ670625HCHMRN00","JUAN RAMON RAMIREZ CORRAL","08DPT0002B",null,null,null,null,null,null,0,144,0,null,null,null,null,null,null,0,144,0,47827.859999999993]
[null,"CHIHUAHUA","RALK790326386","RALK790326MCHMPR08","KARINA CECILIA RAMIREZ LOPEZ","08DPT0002B",null,null,null,null,null,null,0,228,0,null,null,null,null,null,null,0,228,0,29943.910000000003]
[null,"CHIHUAHUA","RAVJ750924S61","RAVJ750924HCHMLN06","JUAN GABRIEL RAMIREZ VELA","08DPT0002B",null,null,null,null,null,null,0,204,0,null,null,null,null,null,null,0,204,0,45548.21]
[null,"CHIHUAHUA","REFG8206303T2","REFG820630MCLYLR05","GRISELDA REYES FLORES","08DPT0002B",null,null,null,null,null,null,0,180,0,null,null,null,null,null,null,0,180,0,36859.100000000006]
[null,"CHIHUAHUA","RIOH600504T14","RIOH600504HCHVLC08","HECTOR RAMON RIVERA OLIVAS","08DPT0002B",null,null,null,null,null,null,0,192,0,null,null,null,null,null,null,0,192,0,23185.119999999999]
[null,"CHIHUAHUA","ROAL7201241P5","ROAL720124MCHDVD01","LIDIA ANGELICA RODRIGUEZ AVILA","08DPT0002B",null,null,null,null,null,null,0,228,0,null,null,null,null,null,null,0,228,0,39047.65]
[null,"CHIHUAHUA","ROMM8706134U5","ROMM870613HCHDNN05","MANUEL ANTONIO RODRIGUEZ MONREAL","08DPT0002B",null,null,null,null,null,null,0,180,0,null,null,null,null,null,null,0,180,0,45304.250000000007]
[null,"CHIHUAHUA","ROPE5908038V9","ROPE590803HCHDRL01","ELIGIO RODRIGUEZ PRIETO","08DPT0002B",null,null,null,null,null,null,0,216,0,null,null,null,null,null,null,0,216,0,3555.3]
[null,"CHIHUAHUA","ROVM860804PC7","ROVM860804HCHDLN05","JOSE MANUEL  RODRIGUEZ VILLA","08DPT0002B",null,null,null,null,null,null,0,120,0,null,null,null,null,null,null,0,120,0,37734.07]
[null,"CHIHUAHUA","SAVY820923BCA","SAVY820923MCHLLM00","YAMET VERENICE SALAZAR VELAZQUEZ","08DPT0002B",null,null,null,null,null,null,0,240,0,null,null,null,null,null,null,0,240,0,21198.55]
[null,"CHIHUAHUA","SELV800114DJ4","SELV800114HCHGZC03","VICTOR ANDRES SEGOVIA LOZOYA","08DPT0002B",null,null,null,null,null,null,0,180,0,null,null,null,null,null,null,0,180,0,47533.08]
[null,"CHIHUAHUA","SOOA7210299X8","SOOA721029MCHLLN06","ANA LUISA SOLIS OLIVAS","08DPT0002B",null,null,null,null,null,null,0,240,0,null,null,null,null,null,null,0,240,0,35390.19]
[null,"CHIHUAHUA","TERG520428J43","TERG520428HDFLVL09","GUILLERMO TELLEZ REVILLA","08DPT0002B",null,null,null,null,null,null,0,168,0,null,null,null,null,null,null,0,168,0,46908.68]
[null,"CHIHUAHUA","VAOA630813IE8","VAOA630813MDGLRN07","ANGELA MARIA VALTIERRA  ORTEGA","08DPT0002B",null,null,null,null,null,null,0,204,0,null,null,null,null,null,null,0,204,0,33341.14]
[null,"CHIHUAHUA","GOCE790701I32","GOXC790701MCHNLX06","CELIA BRISA GONZALEZ ","08DPT0002B",null,null,null,null,null,null,0,240,0,null,null,null,null,null,null,0,240,0,41634.969999999994]
[null,"CHIHUAHUA","VEGD970725699","VEGD970725HCHNNN08","DANIEL ARTURO VENZOR GONZALEZ","08DPT0002B",null,null,null,null,null,null,0,120,0,null,null,null,null,null,null,0,120,0,13940.169999999998]
[null,"CHIHUAHUA","YAGC8511285X6","YAGC851128MCHXNY03","CYNTHIA AURORA YAÑEZ GONZALEZ","08DPT0002B",null,null,null,null,null,null,0,240,0,null,null,null,null,null,null,0,240,0,41334.35]
[null,"CHIHUAHUA","AOOC791125GF8","AOOC791125HCHLRR17","ALOR ORTEGA CRISTHIAN OMAR","08DPT0003A",null,null,null,1,0,0,null,null,null,null,null,null,null,null,null,"1",0,0,149338.60999999999]
[null,"CHIHUAHUA","AEHL721013358","AEHL721013MCHRRR04","ARMENDARIZ HUERTA LAURA ELENA","08DPT0003A",null,null,null,1,0,0,null,null,null,null,null,null,null,null,null,1,0,0,73579.64]
[null,"CHIHUAHUA","AOGA850323MS8","AOGA850323MCHRRD09","ARZOLA GARIBAY ADRIANA","08DPT0003A",null,null,null,1,0,0,null,null,null,null,null,null,null,null,null,1,0,0,80270.929999999993]
[null,"CHIHUAHUA","BALJ741015QJ5","BALJ741015HNTCPR09","BACA LOPEZ JORGE GERARDO","08DPT0003A",null,null,null,1,0,0,null,null,null,null,null,null,null,null,null,1,0,0,140468.49]
[null,"CHIHUAHUA","CALS630411D26","CALS630411HCHNSL01","CANO LEOS SALVADOR","08DPT0003A",null,null,null,1,0,0,null,null,null,null,null,null,null,null,null,1,0,0,167245.85999999999]
[null,"CHIHUAHUA","COSC761202AU8","COSC761202MCHRNL00","CORONADO SAENZ CLAUDIA","08DPT0003A",null,null,null,1,0,0,null,null,null,null,null,null,null,null,null,1,0,0,76141.61]
[null,"CHIHUAHUA","CORE740806FH5","CORE740806HCHRYN08","CORRAL REYES ENCARNACION","08DPT0003A",null,null,null,1,0,0,null,null,null,null,null,null,null,null,null,1,0,0,61737.57]
[null,"CHIHUAHUA","EABJ810502G45","EABJ810502HCHSYR08","ESPARZA BAYLON JORGE HUMBERTO","08DPT0003A",null,null,null,1,0,0,null,null,null,null,null,null,null,null,null,1,0,0,60194.17]
[null,"CHIHUAHUA","EIHE740513ST9","EIHE740513MCHSRV03","ESPINOSA HERNANDEZ EVA CELINA","08DPT0003A",null,null,null,1,0,0,null,null,null,null,null,null,null,null,null,1,0,0,132408.75]
[null,"CHIHUAHUA","FAJA861008RA4","FAJA861008MCHRRL05","FRANCO JURADO MARIA ALEJANDRA","08DPT0003A",null,null,null,1,0,0,null,null,null,null,null,null,null,null,null,1,0,0,103495.39]
[null,"CHIHUAHUA","GAFS650908R84","GAFS650908HCHRLR07","GARCIA FLORES SERGIO MARTIN","08DPT0003A",null,null,null,1,0,0,null,null,null,null,null,null,null,null,null,1,0,0,81335.42]
[null,"CHIHUAHUA","GAAG630825HU2","GAAG630825HCHRLR06","GARDEA ALEMAN GREGORIO","08DPT0003A",null,null,null,1,0,0,null,null,null,null,null,null,null,null,null,1,0,0,81356.45]
[null,"CHIHUAHUA","GAAV670716S40","GAAV670716HCHRRC06","GARDEA ARREDONDO VICTOR MANUEL","08DPT0003A",null,null,null,1,0,0,null,null,null,null,null,null,null,null,null,1,0,0,130894.06]
[null,"CHIHUAHUA","GAHA8701284V2  ","GAHA870128HCHRRL07","GARDEA HEREDIA ALVARO","08DPT0003A",null,null,null,1,0,0,null,null,null,null,null,null,null,null,null,1,0,0,55723.5]
[null,"CHIHUAHUA","GODK810903VC5","GODK810903MCHNVN04","GONZALES DAVILA KENNIS","08DPT0003A",null,null,null,1,0,0,null,null,null,null,null,null,null,null,null,1,0,0,96985.919999999998]
[null,"CHIHUAHUA","GOVJ720801R43","GOVJ720801MCHNLD09","GONZALEZ VALLES JUDITH","08DPT0003A",null,null,null,1,0,0,null,null,null,null,null,null,null,null,null,1,0,0,202819.14]
[null,"CHIHUAHUA","HESH611022NF3","HESH611022HCHRNL03","HEREDIA SAENZ HILADRIO","08DPT0003A",null,null,null,1,0,0,null,null,null,null,null,null,null,null,null,1,0,0,71556.88]
[null,"CHIHUAHUA","HEGM7510295L3","HEGM751029MCHRTY07","HERNANDEZ GUTIERREZ MAYRA VERONICA","08DPT0003A",null,null,null,1,0,0,null,null,null,null,null,null,null,null,null,1,0,0,81724.09]
[null,"CHIHUAHUA","MEHP811017GD5","MEHP811017HCHNRL02","MENDEZ HERRERA PAUL ALONSO","08DPT0003A",null,null,null,1,0,0,null,null,null,null,null,null,null,null,null,1,0,0,68812.14]
[null,"CHIHUAHUA","MEMD550401S32","MEMD550401HCHNTL01","MENDEZ MOTA JOSE DOLORES","08DPT0003A",null,null,null,1,0,0,null,null,null,null,null,null,null,null,null,1,0,0,70479.100000000006]
[null,"CHIHUAHUA","MOIR7306072Z5","MOIR730607HCHLBM08","MOLINA IBARRA RAMON HUMBERTO","08DPT0003A",null,null,null,1,0,0,null,null,null,null,null,null,null,null,null,1,0,0,57779]
[null,"CHIHUAHUA","MOAM570729HK3","MOAM570729HCHNRN02","MONTES ARZOLA MANUEL","08DPT0003A",null,null,null,1,0,0,null,null,null,null,null,null,null,null,null,1,0,0,71871.03]
[null,"CHIHUAHUA","MOME800109M88","MOME900109MCHNNS03","MONTES MONTES ESMERALDA JANETH","08DPT0003A",null,null,null,1,0,0,null,null,null,null,null,null,null,null,null,1,0,0,38290.83]
[null,"CHIHUAHUA","MOHR810216267","MOHR810216HCHNLN06","MONTES HOLGUIN RENE GUADALUPE","08DPT0003A",null,null,null,1,0,0,null,null,null,null,null,null,null,null,null,1,0,0,46745.75]
[null,"CHIHUAHUA","MOCY820701FR6","MOCY820701MCHRHS01","ORTIZ CHAVEZ MARTHA ELVIRA","08DPT0003A",null,null,null,1,0,0,null,null,null,null,null,null,null,null,null,1,0,0,102963.99]
[null,"CHIHUAHUA","PECF611129NU5","PECF611129MOCRSL04","PEREZ CASTRO FILOMENA IRMA","08DPT0003A",null,null,null,1,0,0,null,null,null,null,null,null,null,null,null,1,0,0,81376.98]
[null,"CHIHUAHUA","PESB570420393","PESB570420HCHRSN03","PEREZ SOSA BENJAMIN","08DPT0003A",null,null,null,1,0,0,null,null,null,null,null,null,null,null,null,1,0,0,60122.83]
[null,"CHIHUAHUA","QURM641112699","QURM641112HCHXMR08","QUIÑONEZ RAMIREZ MARTIN RENE","08DPT0003A",null,null,null,1,0,0,null,null,null,null,null,null,null,null,null,1,0,0,76633.25]
[null,"CHIHUAHUA","QUYA890925FF7","QUYA890925MCHXXN07","QUIÑONEZ YAÑEZ ANABEL","08DPT0003A",null,null,null,1,0,0,null,null,null,null,null,null,null,null,null,1,0,0,65003.03]
[null,"CHIHUAHUA","RAGH640227EZ9","RAGH640227HCLMTR04","RAMIREZ GUTIERREZ JOSE HORACIO","08DPT0003A",null,null,null,1,0,0,null,null,null,null,null,null,null,null,null,1,0,0,193045.41]
[null,"CHIHUAHUA","SUCM720601QH7","SUCM720601MCHRRY01","SUAREZ CORRAL MYRNA MANUELA","08DPT0003A",null,null,null,1,0,0,null,null,null,null,null,null,null,null,null,1,0,0,135416.20000000001]
[null,"CHIHUAHUA","YADR7710046J3","YADR771004MCHXZS02","YAÑEZ DIAZ ROSA IVONNE","08DPT0003A",null,null,null,1,0,0,null,null,null,null,null,null,null,null,null,1,0,0,111947.69]
[null,"CHIHUAHUA","AOCF7610047IA","AOCF761204HCHCBR06","FRANCISCO ACOSTA CONTRERAS","08DPT0003A",null,null,null,null,null,null,0,192,0,null,null,null,null,null,null,0,192,0,38660.79]
[null,"CHIHUAHUA","AOMM7702115QA","AOMM770211MCHCRD18","MIDIAM LOURDES ACOSTA MERAZ","08DPT0003A",null,null,null,null,null,null,0,240,0,null,null,null,null,null,null,0,240,0,40907.550000000003]
[null,"CHIHUAHUA","AUQN701229GT2","AUQN701229MCHGNR05","NORMA AGUIRRE QUINTANA ","08DPT0003A",null,null,null,null,null,null,0,240,0,null,null,null,null,null,null,0,240,0,41587.279999999999]
[null,"CHIHUAHUA","AAHE730629HA8","AAHE730629HDGLRD05","EDGAR JESUS ALBA HERNANDEZ","08DPT0003A",null,null,null,null,null,null,0,240,0,null,null,null,null,null,null,0,240,0,40767.64]
[null,"CHIHUAHUA","AEOP850816BU5","AEOP850816HCHRLD08","PEDRO RAFAEL ARMENDARIZ OLIVAS","08DPT0003A",null,null,null,null,null,null,0,240,0,null,null,null,null,null,null,0,240,0,45970.98]
[null,"CHIHUAHUA","AERG670801H43","AERG670801HCHRVB09","GABRIEL ARMENDARIZ RIVAS","08DPT0003A",null,null,null,null,null,null,0,192,0,null,null,null,null,null,null,0,192,0,38687.980000000003]
[null,"CHIHUAHUA","BASJ720920637","BASJ720920HCHCMV04","JAVIER BACA SAMPER","08DPT0003A",null,null,null,null,null,null,0,216,0,null,null,null,null,null,null,0,216,0,39182.5]
[null,"CHIHUAHUA","BAMF820909BC1","BAMF820909MCHLRT08","FATIMA DEL CARMEN BALDERAS MORALES","08DPT0003A",null,null,null,null,null,null,0,240,0,null,null,null,null,null,null,0,240,0,48700.81]
[null,"CHIHUAHUA","CACF650131IUA","CACF650131HCHNHL00","FILIBERTO CANO CHAVEZ","08DPT0003A",null,null,null,null,null,null,0,204,0,null,null,null,null,null,null,0,204,0,34227.519999999997]
[null,"CHIHUAHUA","CALA591128150","CALA591128HCHNSB00","ABRAHAM CANO LEOS","08DPT0003A",null,null,null,null,null,null,0,180,0,null,null,null,null,null,null,0,180,0,34356.79]
[null,"CHIHUAHUA","CATI910806HS0","CATI910806HCHRRV03","IVAN DOROTEO CARRERA DE LA TORRE","08DPT0003A",null,null,null,null,null,null,0,240,0,null,null,null,null,null,null,0,240,0,37635.370000000003]
[null,"CHIHUAHUA","CATN8302135X1","CATN830213MCHRRD06","NADIA BEATRIZ CARRERA DE LA TORRE","08DPT0003A",null,null,null,null,null,null,0,240,0,null,null,null,null,null,null,0,240,0,48147.39]
[null,"CHIHUAHUA","CAGG681119QE9","CAGG681119MCHRRB25","MARIA GABRIELA CARRILLO GARDEA","08DPT0003A",null,null,null,null,null,null,0,216,0,null,null,null,null,null,null,0,216,0,48244.31]
[null,"CHIHUAHUA","CATA900830PFA","CATA900830MCHRRL03","ALEJANDRA IVETTE  CARRILLO TRUJILLO","08DPT0003A",null,null,null,null,null,null,0,216,0,null,null,null,null,null,null,0,216,0,34377.67]
[null,"CHIHUAHUA","CATI851219KEA","CATI851219MCHRRR12","IRMA RAQUEL CARRILLO TRUJILLO","08DPT0003A",null,null,null,null,null,null,0,240,0,null,null,null,null,null,null,0,240,0,46736.13]
[null,"CHIHUAHUA","CAGL680404GU5","CAGL680404MCHSTT08","LETICIA CASILLAS GUTIERREZ","08DPT0003A",null,null,null,null,null,null,0,240,0,null,null,null,null,null,null,0,240,0,48867.74]
[null,"CHIHUAHUA","CEBC880121MJ0","CEBC880121MCHBCL06","CLAUDIA INES CEBALLOS BACA","08DPT0003A",null,null,null,null,null,null,0,120,0,null,null,null,null,null,null,0,120,0,26118.799999999999]
[null,"CHIHUAHUA","CEHF701204P69","CEHF701204HDGRRR02","FRANCISCO JAVIER CERENIL HERRERA","08DPT0003A",null,null,null,null,null,null,0,216,0,null,null,null,null,null,null,0,216,0,47893.17]
[null,"CHIHUAHUA","CACJ850309TV6","CACJ850309HCHHHV05","JAVIER ISAAC CHAVEZ CHAVEZ","08DPT0003A",null,null,null,null,null,null,0,120,0,null,null,null,null,null,null,0,120,0,21443.11]
[null,"CHIHUAHUA","CASC781201J96","CASC781201MCHHNR02","CORINA CHAVEZ SANCHEZ","08DPT0003A",null,null,null,null,null,null,0,180,0,null,null,null,null,null,null,0,180,0,39655.46]
[null,"CHIHUAHUA","DERI7801118J5","DEXR780111HCHLXC03","RICARDO DELGADO","08DPT0003A",null,null,null,null,null,null,0,216,0,null,null,null,null,null,null,0,216,0,42719.66]
[null,"CHIHUAHUA","LEPJ860727765","LEPJ860727HCHNRV08","JAVIER EDUVIGES DE LEON PARADA","08DPT0003A",null,null,null,null,null,null,0,192,0,null,null,null,null,null,null,0,192,0,30849.119999999999]
[null,"CHIHUAHUA","EARD8007284EA","EARD800728MCHSCL06","DULCE MARGARITA ELIZABETH ESCALANTE ROCHA","08DPT0003A",null,null,null,null,null,null,0,240,0,null,null,null,null,null,null,0,240,0,48135.91]
[null,"CHIHUAHUA","FEAL8707295J5","DUPB710508MCHRRR02","LUIS RAUL FERNANDEZ ACOSTA","08DPT0003A",null,null,null,null,null,null,0,240,0,null,null,null,null,null,null,0,240,0,48803.13]
[null,"CHIHUAHUA","GAQL770122HI2","GAQL770122MCHLXZ06","LUZ ELIZABETH GALVAN QUIÑONEZ","08DPT0003A",null,null,null,null,null,null,0,216,0,null,null,null,null,null,null,0,216,0,43221.58]
[null,"CHIHUAHUA","GACP590517NU6","GACP590517MCHRHT05","PATRICIA EUGENIA GARCIA CHAVEZ","08DPT0003A",null,null,null,null,null,null,0,240,0,null,null,null,null,null,null,0,240,0,47895.55]
[null,"CHIHUAHUA","GARJ67122131A","GARJ671221HCHRZM09","JAIME GARCIA RUIZ","08DPT0003A",null,null,null,null,null,null,0,240,0,null,null,null,null,null,null,0,240,0,46809.25]
[null,"CHIHUAHUA","GOGA810922999","GOGA810922HCHNRG02","AGUSTIN GONZALEZ GARCIA","08DPT0003A",null,null,null,null,null,null,0,240,0,null,null,null,null,null,null,0,240,0,46080.77]
[null,"CHIHUAHUA","GOGJ8811064X6","GOGJ881106MCHNTS09","JESSICA JANETH GONZALEZ GUTIERREZ","08DPT0003A",null,null,null,null,null,null,0,240,0,null,null,null,null,null,null,0,240,0,42331.7]
[null,"CHIHUAHUA","GOHD580525IP0","GOHD580525HCHNRV01","DAVID GONZALEZ HERNANDEZ","08DPT0003A",null,null,null,null,null,null,0,228,0,null,null,null,null,null,null,0,228,0,35633.730000000003]
[null,"CHIHUAHUA","GUCG610126B56","GUCG610126HCHTNR03","JOSE GERARDO GUTIERREZ CONTRERAS","08DPT0003A",null,null,null,null,null,null,0,120,0,null,null,null,null,null,null,0,120,0,24638.29]
[null,"CHIHUAHUA","HEAV711202QZ8","HEAV711202MCHRGV01","VIVIANA HERNANDEZ AGUILERA","08DPT0003A",null,null,null,null,null,null,0,228,0,null,null,null,null,null,null,0,228,0,45395.92]
[null,"CHIHUAHUA","HEAA900716PY3","HEAA900716HCHRGL00","ALFREDO HERNANDEZ AGUIRRE","08DPT0003A",null,null,null,null,null,null,0,192,0,null,null,null,null,null,null,0,192,0,30366.560000000001]
[null,"CHIHUAHUA","HEAA881029IG6","HEAA881029MCHRNN04","ANGELICA HERNANDEZ ANGEL","08DPT0003A",null,null,null,null,null,null,0,216,0,null,null,null,null,null,null,0,216,0,38898.959999999999]
[null,"CHIHUAHUA","HISE750912LP7","HISE750912MCHNNT05","ETHEL JANETH HINOJOS SANCHEZ","08DPT0003A",null,null,null,null,null,null,0,240,0,null,null,null,null,null,null,0,240,0,40944.07]
[null,"CHIHUAHUA","HOOJ841127R23","HOOJ841127HCHLJS04","JESUS MANUEL HOLGUIN OJEDA","08DPT0003A",null,null,null,null,null,null,0,240,0,null,null,null,null,null,null,0,240,0,47503.13]
[null,"CHIHUAHUA","HOQS841119E44","HOQS841119MCHLNL02","SILVIA HOLGUIN QUINTANA","08DPT0003A",null,null,null,null,null,null,0,120,0,null,null,null,null,null,null,0,120,0,30430.93]
[null,"CHIHUAHUA","IEPA690710861","IEPA690710HZSRRL07","ALEJANDRO IRENE PEREZ","08DPT0003A",null,null,null,null,null,null,0,120,0,null,null,null,null,null,null,0,120,0,47688.85]
[null,"CHIHUAHUA","JUEM870729SW2","JUEM870729MCHRSR04","MARINA JUAREZ ESPARZA","08DPT0003A",null,null,null,null,null,null,0,228,0,null,null,null,null,null,null,0,228,0,25096.12]
[null,"CHIHUAHUA","JUGE790622JJ2","JUGE790622HCHRRD03","EDGAR ELIEL JUAREZ GRAJEDA","08DPT0003A",null,null,null,null,null,null,0,240,0,null,null,null,null,null,null,0,240,0,48153.13]
[null,"CHIHUAHUA","JUAL910425AX8","JUAL910425MCHRLL09","LILIAN JURADO ALVAREZ","08DPT0003A",null,null,null,null,null,null,0,36,0,null,null,null,null,null,null,0,36,0,5721.42]
[null,"CHIHUAHUA","LARJ611212G44","LARJ611212HCHZDL03","JOEL GUADALUPE LAZCANO RODRIGUEZ","08DPT0003A",null,null,null,null,null,null,0,156,0,null,null,null,null,null,null,0,156,0,25796.400000000001]
[null,"CHIHUAHUA","LOGJ770422620","LOGJ770422HCHPRL08","JOEL ALONSO LOPEZ GRANADOS","08DPT0003A",null,null,null,null,null,null,0,240,0,null,null,null,null,null,null,0,240,0,48780.15]
[null,"CHIHUAHUA","LOSS7606157X9","LOSS760615MCHPLL02","SILVIA LOPEZ SALCIDO","08DPT0003A",null,null,null,null,null,null,0,240,0,null,null,null,null,null,null,0,240,0,48740.02]
[null,"CHIHUAHUA","LOCM7912081Q9","LOCM791208MCHYLR09","MARTHA LAURA LOYA CELESTIN","08DPT0003A",null,null,null,null,null,null,0,240,0,null,null,null,null,null,null,0,240,0,48084.59]
[null,"CHIHUAHUA","LUMA890208UY4","LUMA890208HCHNLL06","ALEJANDRO LUNA MOLINA","08DPT0003A",null,null,null,null,null,null,0,228,0,null,null,null,null,null,null,0,228,0,44406.89]
[null,"CHIHUAHUA","MAAK800331I60","MAAK800331MCHCGR00","KAREN LOURDES MACIAS AGUIRRE","08DPT0003A",null,null,null,null,null,null,0,180,0,null,null,null,null,null,null,0,180,0,37637.800000000003]
[null,"CHIHUAHUA","MAMF571028UH3","MAMF571028HCHRCR08","FRANCISCO ROBERTO MARTINEZ MACIAS","08DPT0003A",null,null,null,null,null,null,0,168,0,null,null,null,null,null,null,0,168,0,36833.660000000003]
[null,"CHIHUAHUA","MAMS761009L43","MASS761009HCHRCR04","SERGIO RENE MARTINEZ MACIAS","08DPT0003A",null,null,null,null,null,null,0,168,0,null,null,null,null,null,null,0,168,0,28303.67]
[null,"CHIHUAHUA","MAML781222TP2","MAML781222MCHRNR05","LAURA GABRIELA MARTINEZ MONARREZ","08DPT0003A",null,null,null,null,null,null,0,180,0,null,null,null,null,null,null,0,180,0,36262.78]
[null,"CHIHUAHUA","MAPJ881207NN8","MAPJ881207MCHRRN07","JANETH DERAT MARTINEZ PROSPERO","08DPT0003A",null,null,null,null,null,null,0,240,0,null,null,null,null,null,null,0,240,0,48069.58]
[null,"CHIHUAHUA","MARB780909MG5","MARB780909MCHRSR07","BRENDA SOCORRO MARTINEZ RIOS","08DPT0003A",null,null,null,null,null,null,0,240,0,null,null,null,null,null,null,0,240,0,48153.13]
[null,"CHIHUAHUA","MEMP850117HB8","MEMP850117MCHNNL01","PALOMA DEL CARMEN MENDEZ MENDEZ","08DPT0003A",null,null,null,null,null,null,0,180,0,null,null,null,null,null,null,0,180,0,36816.9]
[null,"CHIHUAHUA","MEHJ820821C9A","MEHJ820821HCHNRN06","JUAN CARLOS MENDIAS HERNANDEZ","08DPT0003A",null,null,null,null,null,null,0,144,0,null,null,null,null,null,null,0,144,0,28897.119999999999]
[null,"CHIHUAHUA","MOHE761219ZR9","MOHE761219HCHNLD06","EDGAR OBEK MONTES HOLGUIN","08DPT0003A",null,null,null,null,null,null,0,120,0,null,null,null,null,null,null,0,120,0,36816.9]
[null,"CHIHUAHUA","MOMA830930QR2","MOMA830930MCHRRN04","ANTONIA MORENO MORALES","08DPT0003A",null,null,null,null,null,null,0,204,0,null,null,null,null,null,null,0,204,0,43489.26]
[null,"CHIHUAHUA","NAMR830722I63","NAMR830722MCHXNB01","REBECA DIANA NANEZ MENDOZA","08DPT0003A",null,null,null,null,null,null,0,240,0,null,null,null,null,null,null,0,240,0,37635.370000000003]
[null,"CHIHUAHUA","PAQR840612BHA","PAQR840612HCHLXM03","JOSE RAMON PALMA QUIÑONEZ","08DPT0003A",null,null,null,null,null,null,0,240,0,null,null,null,null,null,null,0,240,0,37259.230000000003]
[null,"CHIHUAHUA","PAMZ880803S42","PAMZ880803MCHTRM09","ZAMISH GABRIELA PATIÑO MORALES","08DPT0003A",null,null,null,null,null,null,0,240,0,null,null,null,null,null,null,0,240,0,37637.78]
[null,"CHIHUAHUA","PERO820514295","PERO820514HCHRMM06","OMAR ARMANDO PEREZ RAMIREZ","08DPT0003A",null,null,null,null,null,null,0,240,0,null,null,null,null,null,null,0,240,0,48153.13]
[null,"CHIHUAHUA","QUVC860208IX4","QUVC860208MCHNLR06","CRISTINA QUINTANA VILLEGAS","08DPT0003A",null,null,null,null,null,null,0,192,0,null,null,null,null,null,null,0,192,0,29671.37]
[null,"CHIHUAHUA","QUGG830326LY2","QUGG830326MCHXRR05","GEORGINA ALHELI QUIÑONEZ GARCIA","08DPT0003A",null,null,null,null,null,null,0,240,0,null,null,null,null,null,null,0,240,0,48153.13]
[null,"CHIHUAHUA","QUYD9206206GA","QUYD920620MCHXXN07","DANIA ANGELICA QUIÑONEZ YAÑEZ","08DPT0003A",null,null,null,null,null,null,0,240,0,null,null,null,null,null,null,0,240,0,37619.839999999997]
[null,"CHIHUAHUA","RACG650805Q12","RACG650805HSRMNM07","GAMALIEL RAMOS CONTRERAS","08DPT0003A",null,null,null,null,null,null,0,240,0,null,null,null,null,null,null,0,240,0,40976.58]
[null,"CHIHUAHUA","RACA620817IU7","RACA620817HCHSHN09","ANTONIO RASCON CHAVEZ","08DPT0003A",null,null,null,null,null,null,0,216,0,null,null,null,null,null,null,0,216,0,34477.89]
[null,"CHIHUAHUA","RERH8005305SA","RERH800530HCHNDC03","HECTOR RAUL RENTERIA RODRIGUEZ","08DPT0003A",null,null,null,null,null,null,0,240,0,null,null,null,null,null,null,0,240,0,40703.660000000003]
[null,"CHIHUAHUA","RIPS680731I67","RIPS680731HCHCRR07","SERGIO RICO PEREZ","08DPT0003A",null,null,null,null,null,null,0,240,0,null,null,null,null,null,null,0,240,0,34985.51]
[null,"CHIHUAHUA","RIAJ830525SU3","RIAJ830525HCHVCM08","JAIME MICHAEL RIVERA ACOSTA","08DPT0003A",null,null,null,null,null,null,0,240,0,null,null,null,null,null,null,0,240,0,48141.65]
[null,"CHIHUAHUA","ROSL891018R33","ROSL891018HCHDNS03","LUIS ISIDRO RODRIGUEZ SAENZ","08DPT0003A",null,null,null,null,null,null,0,192,0,null,null,null,null,null,null,0,192,0,34339.339999999997]
[null,"CHIHUAHUA","ROSL8112066G9","ROSL811206HCHDFS05","LUIS CARLOS RODRIGUEZ SIFUENTES","08DPT0003A",null,null,null,null,null,null,0,228,0,null,null,null,null,null,null,0,228,0,45516.9]
[null,"CHIHUAHUA","ROMC790529SQ8","ROMC790529HCHJZR03","CARLOS GERMAN ROJAS MEZA","08DPT0003A",null,null,null,null,null,null,0,240,0,null,null,null,null,null,null,0,240,0,48084.59]
[null,"CHIHUAHUA","ROMJ820824341","ROMJ820824HCHMRN09","JUAN PABLO ROMO MARTINEZ","08DPT0003A",null,null,null,null,null,null,0,120,0,null,null,null,null,null,null,0,120,0,23772.63]
[null,"CHIHUAHUA","ROQM800726NK3","ROQM800726MCHNXR09","MARISA JUDITH RONQUILLO QUIÑONEZ","08DPT0003A",null,null,null,null,null,null,0,180,0,null,null,null,null,null,null,0,180,0,28552.15]
[null,"CHIHUAHUA","SARJ830528CW0","SARJ830528HCHLDR12","JORGE ARTURO SALAS RODRIGUEZ","08DPT0003A",null,null,null,null,null,null,0,216,0,null,null,null,null,null,null,0,216,0,34122.01]
[null,"CHIHUAHUA","SADC810906EH7","SADC810906MCHNZR07","MARIA CRISTINA SANCHEZ DIAZ","08DPT0003A",null,null,null,null,null,null,0,216,0,null,null,null,null,null,null,0,216,0,35217.26]
[null,"CHIHUAHUA","SERM730609876","SERM730609MCHPYY01","MYRIAM SEPULVEDA REYES","08DPT0003A",null,null,null,null,null,null,0,240,0,null,null,null,null,null,null,0,240,0,46946.84]
[null,"CHIHUAHUA","TEAR760610A38","TEAR760610HCHRGL01","RAUL FELIPE TERRAZAS AGUIRRE","08DPT0003A",null,null,null,null,null,null,0,120,0,null,null,null,null,null,null,0,120,0,47704.09]
[null,"CHIHUAHUA","TOBT8310246R6","TOBT831024MCHRRH05","THELMA GUADALUPE TORRES BARRETO","08DPT0003A",null,null,null,null,null,null,0,204,0,null,null,null,null,null,null,0,204,0,41055.61]
[null,"CHIHUAHUA","UUAJ8910286B1","UUAJ891028HCHRRL00","JOEL URTUZUASTEGUI ARZOLA","08DPT0003A",null,null,null,null,null,null,0,240,0,null,null,null,null,null,null,0,240,0,42334.36]
[null,"CHIHUAHUA","VASM721005K88","VASM721005HCHLRR06","MARIO ALBERTO VALDEZ SIERRA","08DPT0003A",null,null,null,null,null,null,0,120,0,null,null,null,null,null,null,0,120,0,24717.67]
[null,"CHIHUAHUA","VATE6505053PA","VATE650505HCHLRR02","ERNESTO VALLEJO TERRAZAS","08DPT0003A",null,null,null,null,null,null,0,228,0,null,null,null,null,null,null,0,228,0,46154.69]
[null,"CHIHUAHUA","VAGS580921NS3","VAGS580921MCHZRL04","SOLEDAD VAZQUEZ GARCIA","08DPT0003A",null,null,null,null,null,null,0,180,0,null,null,null,null,null,null,0,180,0,36885.32]
[null,"CHIHUAHUA","VASI870422IA8","VASI870422MCHZVS04","ISIS KRYSTAL VAZQUEZ SAENZ","08DPT0003A",null,null,null,null,null,null,0,180,0,null,null,null,null,null,null,0,180,0,35298.85]
[null,"CHIHUAHUA","VEMA770621BW5","VEMA770621MCHLRN02","ANA ISABEL VELAZQUEZ MARTINEZ","08DPT0003A",null,null,null,null,null,null,0,120,0,null,null,null,null,null,null,0,120,0,27748.69]
[null,"CHIHUAHUA","VEDA870119GY2","VEDA870119MDGRMD03","ADRIANA VERGARA DOMINGUEZ","08DPT0003A",null,null,null,null,null,null,0,192,0,null,null,null,null,null,null,0,192,0,30589]
[null,"CHIHUAHUA","VILJ810613D4A","VILJ810613HCHLRR06","JORGE ANTONIO VILLAR LOERA","08DPT0003A",null,null,null,null,null,null,0,204,0,null,null,null,null,null,null,0,204,0,32892.03]
[null,"CHIHUAHUA","VIGR710609UT2","VIGR710609HCHLRF00","RAFAEL VILLEGAS GARCIA","08DPT0003A",null,null,null,null,null,null,0,240,0,null,null,null,null,null,null,0,240,0,48362.3]
[null,"CHIHUAHUA","AUAC8005203K7","AUAC800520HDGGNS04","CESAR ALEJANDRO AGUILAR ANTUNEZ","08DPT0007X",null,null,null,1,0,0,null,null,null,null,null,null,null,null,null,1,0,0,67672.679999999993]
[null,"CHIHUAHUA","ARRJ7003036F2","AARJ700303MCHNMS07","MARÍA DE JESÚS ANAYA RAMÍREZ","08DPT0007X",null,null,null,1,0,0,null,null,null,null,null,null,null,null,null,1,0,0,111893.07]
[null,"CHIHUAHUA","AIEL6711121J4","AIXE671112MCHRXL03","MARÍA ELIZABETTH ARRIETA","08DPT0007X",null,null,null,1,0,0,null,null,null,null,null,null,null,null,null,1,0,0,41733.870000000003]
[null,"CHIHUAHUA","BELH630930M26","BELH630930HCHNNM06","JOSE HUMBERTO BENITEZ LONGORIA","08DPT0007X",null,null,null,1,0,0,null,null,null,null,null,null,null,null,null,1,0,0,69205.119999999995]
[null,"CHIHUAHUA","CAEA740422SF8","CAEA740422MCHBSL02","ALMA SOFIA CABALLERO ESPARZA","08DPT0007X",null,null,null,1,0,0,null,null,null,null,null,null,null,null,null,1,0,0,133721.97]
[null,"CHIHUAHUA","CADE710915BB6","CADE710915MCHRZL02","ELVIRA CARRASCO DIAZ","08DPT0007X",null,null,null,null,null,null,null,null,null,null,null,null,1,0,0,1,0,0,127229.61]
[null,"CHIHUAHUA","CACI7205151S9","CACI720515HOCHRS01","ISIDRO MANUEL CHAVEZ CARRERA","08DPT0007X",null,null,null,1,0,0,null,null,null,null,null,null,null,null,null,1,0,0,109133.38]
[null,"CHIHUAHUA","DEML700812U65","DEML700812MDGLRR03","LAURA DIANA DELGADO MARRERO","08DPT0007X",null,null,null,1,0,0,null,null,null,null,null,null,null,null,null,1,0,0,66642.539999999994]
[null,"CHIHUAHUA","EALJ731221FM3","EALJ731221HSLSRN06","JUAN DE DIOS ESCALANTE LAUREAN","08DPT0007X",null,null,null,1,0,0,null,null,null,null,null,null,null,null,null,1,0,0,59870.14]
[null,"CHIHUAHUA","EAGK7806257R9","EAGK780625MCHSBR04","KARLA ESPARZA GABALDON","08DPT0007X",null,null,null,1,0,0,null,null,null,null,null,null,null,null,null,1,0,0,134361.34]
[null,"CHIHUAHUA","GAEM680908Q97","GAEC680908MCLLSN03","MA. CONCEPCION GALLARDO ESPARZA","08DPT0007X",null,null,null,1,0,0,null,null,null,null,null,null,null,null,null,1,0,0,53067.3]
[null,"CHIHUAHUA","GADA760726L20","GADA760726MCHRZD02","ADRIANA GARCIA DIAZ","08DPT0007X",null,null,null,1,0,0,null,null,null,null,null,null,null,null,null,1,0,0,64660.14]
[null,"CHIHUAHUA","HEGJ620729F26","HEGJ620729HCHRNV07","JOSE JAVIER HERNANDEZ GONZALEZ","08DPT0007X",null,null,null,1,0,0,null,null,null,null,null,null,null,null,null,1,0,0,102053.96]
[null,"CHIHUAHUA","HEGL611117FN5","HEGL611117MCHRNZ00","LUZ MARIA HERNANDEZ GONZALEZ","08DPT0007X",null,null,null,1,0,0,null,null,null,null,null,null,null,null,null,1,0,0,128360.06]
[null,"CHIHUAHUA","HEPH660312FI8","HEPH660312HCHRRC02","HECTOR HERNANDEZ PEREZ","08DPT0007X",null,null,null,1,0,0,null,null,null,null,null,null,null,null,null,1,0,0,78746.73]
[null,"CHIHUAHUA","MASF580311IY9","MASF580311HDGGCR04","FRANCISCO MAGDALENO SAUCEDO","08DPT0007X",null,null,null,1,0,0,null,null,null,null,null,null,null,null,null,1,0,0,107507.4]
[null,"CHIHUAHUA","MARL701010AR4","MARL701010MCLRBD02","LUDIVINA MARTINEZ REBOLLOSO","08DPT0007X",null,null,null,1,0,0,null,null,null,null,null,null,null,null,null,1,0,0,71156.740000000005]
[null,"CHIHUAHUA","MECL790627CP7","MEXC790627MCHJXL02","CLAUDIA FABIOLA MEJIA","08DPT0007X",null,null,null,1,0,0,null,null,null,null,null,null,null,null,null,1,0,0,67452.5]
[null,"CHIHUAHUA","MONM720514999","MONM720514HCHRXR04","MARCIAL EZEQUIEL MORALES NUÑEZ","08DPT0007X",null,null,null,1,0,0,null,null,null,null,null,null,null,null,null,1,0,0,162186.38]
[null,"CHIHUAHUA","OIPL750706829","OIPL750706HNTRXS09","LUIS ALBERTO ORTIZ PEÑA","08DPT0007X",null,null,null,1,0,0,null,null,null,null,null,null,null,null,null,1,0,0,100270.63]
[null,"CHIHUAHUA","PECG710113QA8","PECG710113MCHRRB06","GABRIELA PEREZ CRUZ","08DPT0007X",null,null,null,1,0,0,null,null,null,null,null,null,null,null,null,1,0,0,59080.06]
[null,"CHIHUAHUA","ROMA711015CL1","ROMA711015MDFDLN06","ANA LUISA RODRIGUEZ MILAN","08DPT0007X",null,null,null,1,0,0,null,null,null,null,null,null,null,null,null,1,0,0,66815.149999999994]
[null,"CHIHUAHUA","ROQM510228824","ROQR510228MCHGZF19","MARIA DEL REFUGIO ROGERO QUEZADA","08DPT0007X",null,null,null,null,null,null,null,null,null,null,null,null,1,0,0,1,0,0,84502.13]
[null,"CHIHUAHUA","ROME6706013EA","ROME670601MDFJLD04","MARIA EDITH ROJAS MELENDEZ","08DPT0007X",null,null,null,1,0,0,null,null,null,null,null,null,null,null,null,1,0,0,64102.559999999998]
[null,"CHIHUAHUA","SOGC711207N65","SOGC711207MCHTRN06","MARIA CONCEPCION SOTO GUERRERO","08DPT0007X",null,null,null,1,0,0,null,null,null,null,null,null,null,null,null,1,0,0,161738.73000000001]
[null,"CHIHUAHUA","SOHJ7805045P4","SOHJ780504HCHTRS02","JOSE DE JESUS SOTO HERNANDEZ","08DPT0007X",null,null,null,1,0,0,null,null,null,null,null,null,null,null,null,1,0,0,63203.31]
[null,"CHIHUAHUA","TULO5510064A6","TULO551006MCHDYL01","TUDA LEYVA OLGA ESPERANZA","08DPT0007X",null,null,null,1,0,0,null,null,null,null,null,null,null,null,null,1,0,0,78301.710000000006]
[null,"CHIHUAHUA","ZAVE920703L47","ZAVE920703HCHVLD09","EDGAR ALEJANDRO ZAVALA VALLES","08DPT0007X",null,null,null,1,0,0,null,null,null,null,null,null,null,null,null,1,0,0,32370.19]
[null,"CHIHUAHUA","AAVJ670109VEA","AAVJ670109HVZBLL08","ABSALON VILLEGAS JULIAN MIGUEL","08DPT0007X",null,null,null,null,null,null,0,204,0,null,null,null,null,null,null,0,204,0,29845.247249415108]
[null,"CHIHUAHUA","AOLJ680721RSA","AOLJ680721MCHCJL09","ACOSTA LUJAN JULIA ROSA","08DPT0007X",null,null,null,null,null,null,0,216,0,null,null,null,null,null,null,0,216,0,36459.438507839994]
[null,"CHIHUAHUA","AUCI871011KK9","AUCI871011MCHGLL16","AGUIRRE CALDERON ILEANA LIZELDY","08DPT0007X",null,null,null,null,null,null,0,216,0,null,null,null,null,null,null,0,216,0,34233.861850975998]
[null,"CHIHUAHUA","AEMV850720NG8","AEMV850720MCHLNR03","ALMEIDA MONTES VIRIDIANA","08DPT0007X",null,null,null,null,null,null,0,216,0,null,null,null,null,null,null,0,216,0,36026.160809839996]
[null,"CHIHUAHUA","AAGP8807274Z4","AAGP880727MMCLLB04","ALVARADO GALICIA PABLOVA","08DPT0007X",null,null,null,null,null,null,0,240,0,null,null,null,null,null,null,0,240,0,40448.19]
[null,"CHIHUAHUA","AASJ7104236Z2","AASJ710423HCHLNR06","ALVARADO SANCHEZ JORGE ADRIAN","08DPT0007X",null,null,null,null,null,null,0,240,0,null,null,null,null,null,null,0,240,0,46493.624397439999]
[null,"CHIHUAHUA","AATG900815VD7","AATG900815MCHLRL09","ALVARADO TARANGO GLORIA YARALDY","08DPT0007X",null,null,null,null,null,null,0,228,0,null,null,null,null,null,null,0,228,0,36724.599999999991]
[null,"CHIHUAHUA","AARP801213GG6","AARP801213HCHVDD14","AVALOS RODARTE PEDRO ALONSO","08DPT0007X",null,null,null,null,null,null,0,216,0,null,null,null,null,null,null,0,216,0,37173.260068479998]
[null,"CHIHUAHUA","BACJ730108BV7","BACJ730108MDFYRH00","BAYARDO CARVAJAL JAHEL","08DPT0007X",null,null,null,null,null,null,0,216,0,null,null,null,null,null,null,0,216,0,34099.993426400004]
[null,"CHIHUAHUA","BECI670819Q93","BECI670819HCHLRV03","BELMONTE CARRILLO IVAN","08DPT0007X",null,null,null,null,null,null,0,240,0,null,null,null,null,null,null,0,240,0,45900.166385215998]
[null,"CHIHUAHUA","BEMY780623E38","BEMY780623MCHRRS01","BERUMEN MARTINEZ YESICA","08DPT0007X",null,null,null,null,null,null,0,240,0,null,null,null,null,null,null,0,240,0,45922.542548992002]
[null,"CHIHUAHUA","BIRG861118GT6","BIRG861118MCHRYR07","BRIONES REYES GEORGINA","08DPT0007X",null,null,null,null,null,null,0,108,0,null,null,null,null,null,null,0,108,0,18101.040496497779]
[null,"CHIHUAHUA","BUEL761105V38","BUEL761105MCHSSR05","BUSTAMANTE ESCOBEDO LAURA ISELA","08DPT0007X",null,null,null,null,null,null,0,240,0,null,null,null,null,null,null,0,240,0,45540.403408716797]
[null,"CHIHUAHUA","CAVM69042817A","CAVM690428HCHBGR00","CABALLERO VEGA MARIO ALBERTO","08DPT0007X",null,null,null,null,null,null,0,120,0,null,null,null,null,null,null,0,120,0,14380.1773227504]
[null,"CHIHUAHUA","CASC9206274E9","CASC920627HCHLNH09","CALDERA SANCHEZ CHRISTIAN ALBERTO","08DPT0007X",null,null,null,null,null,null,0,168,0,null,null,null,null,null,null,0,168,0,18975.159886577778]
[null,"CHIHUAHUA","CAVM6006195R6","CAVM600619HCHLLN01","CALLEROS VILLALOBOS MANUEL ALBERTO ","08DPT0007X",null,null,null,null,null,null,0,240,0,null,null,null,null,null,null,0,240,0,41200.168575360003]
[null,"CHIHUAHUA","CIGJ801220RP4","CIGJ801220HCHSRL09","CISNEROS GARCIA JULIO ALBERTO","08DPT0007X",null,null,null,null,null,null,0,240,0,null,null,null,null,null,null,0,240,0,41200.168575360003]
[null,"CHIHUAHUA","DIAA860226874","DIAA860226MSRZGN04","DIAZ AGUILAR ANA FABIOLA","08DPT0007X",null,null,null,null,null,null,0,228,0,null,null,null,null,null,null,0,228,0,43580.786735820802]
[null,"CHIHUAHUA","DOBG610203LR2","DOBG610203HCHMRL02","DOMINGUEZ BARAY GILBERTO","08DPT0007X",null,null,null,null,null,null,0,204,0,null,null,null,null,null,null,0,204,0,40648.870465024003]
[null,"CHIHUAHUA","EADJ860902I17","EADJ860902HCHSZV01","ESPARZA DIAZ JAVIER EDUARDO","08DPT0007X",null,null,null,null,null,null,0,240,0,null,null,null,null,null,null,0,240,0,46207.879480256001]
[null,"CHIHUAHUA","EACL8412183L3","EACL841218MCHSRR08","ESTRADA CARRILLO LAURA VERONICA","08DPT0007X",null,null,null,null,null,null,0,240,0,null,null,null,null,null,null,0,240,0,46258.736288716798]
[null,"CHIHUAHUA","EAHJ881022RT6","EAHJ881022HCHSRQ05","ESTRADA HERNANDEZ JOAQUIN JOEL","08DPT0007X",null,null,null,null,null,null,0,120,0,null,null,null,null,null,null,0,120,0,25493.094383822223]
[null,"CHIHUAHUA","CARF8005231E2","CARF800523HCHRVD08","ESTRADA SALAYANDIA JOSE ANGEL","08DPT0007X",null,null,null,null,null,null,0,192,0,null,null,null,null,null,null,0,192,0,20393.086655075556]
[null,"CHIHUAHUA","FOCG620409LQ0","FOCG620409HDGLHN03","FLORES CHACON GONZALO","08DPT0007X",null,null,null,null,null,null,0,180,0,null,null,null,null,null,null,0,180,0,29753.751339875558]
[null,"CHIHUAHUA","GAEH711103S52","GAEH711103HCHBNC07","GABALDON ENRÍQUEZ HECTOR GERARDO                  ","08DPT0007X",null,null,null,null,null,null,0,168,0,null,null,null,null,null,null,0,168,0,33885.68692500623]
[null,"CHIHUAHUA","GAJE670908MV9","GAJE670908HDGLRV06","GALVAN JUAREZ EVARISTO","08DPT0007X",null,null,null,null,null,null,0,240,0,null,null,null,null,null,null,0,240,0,39179.869200000001]
[null,"CHIHUAHUA","GAMY7604228L5","GAMY760422MDGLXL00","GALVAN MUÑOZ YOLANDA ALEJANDRA","08DPT0007X",null,null,null,null,null,null,0,240,0,null,null,null,null,null,null,0,240,0,46236.364436940799]
[null,"CHIHUAHUA","GAOR861127BG3","GAOR861127MCHMNQ19","GAMBOA ONTIVEROS RAQUEL","08DPT0007X",null,null,null,null,null,null,0,240,0,null,null,null,null,null,null,0,240,0,46795.651081164804]
[null,"CHIHUAHUA","GAAN631226D5A","GAAN631226MCHNNR03","GANDARA ANGUIANO NORMA","08DPT0007X",null,null,null,null,null,null,0,240,0,null,null,null,null,null,null,0,240,0,39892.102993152002]
[null,"CHIHUAHUA","GARA6105276N5","GARA610527HCHRZL00","GARAY RUIZ JOSE ALFONSO","08DPT0007X",null,null,null,null,null,null,0,228,0,null,null,null,null,null,null,0,228,0,39225.589424799997]
[null,"CHIHUAHUA","GOTD6910121D1","GOTD691012MCHMVY06","GOMEZ TAVARES DEYANIRA","08DPT0007X",null,null,null,null,null,null,0,228,0,null,null,null,null,null,null,0,228,0,44590.549712319997]
[null,"CHIHUAHUA","GONM640214JC7","GONM640214HJCNVG03","GONZÁLEZ NAVA MIGUEL","08DPT0007X",null,null,null,null,null,null,0,216,0,null,null,null,null,null,null,0,216,0,33520.432438975993]
[null,"CHIHUAHUA","HEPR900403KQ2","HEPR900403HCHRRC03","HERNANDEZ PEREZ RICARDO","08DPT0007X",null,null,null,null,null,null,0,228,0,null,null,null,null,null,null,0,228,0,45509.609705983996]
[null,"CHIHUAHUA","HEMA6604046K4","HEMA660404HCHRXN05","HERRERA MUÑOZ JOSE ANGEL","08DPT0007X",null,null,null,null,null,null,0,240,0,null,null,null,null,null,null,0,240,0,47177.790221440002]
[null,"CHIHUAHUA","HEOA9003177A9","HEOA900317MCHRGN09","HERRERA OGAZ ANGELICA LIZETTE","08DPT0007X",null,null,null,null,null,null,0,228,0,null,null,null,null,null,null,0,228,0,38706.895578239993]
[null,"CHIHUAHUA","HEOS840726F25","HEOS840726HCHRGR06","HERRERA OGAZ SERGIO ARTURO","08DPT0007X",null,null,null,null,null,null,0,240,0,null,null,null,null,null,null,0,240,0,39978.43]
[null,"CHIHUAHUA","HOAG621120KT8","HOAG621120MCHLVB08","HOLGUIN AVILA GABRIELA ALEJANDRA","08DPT0007X",null,null,null,null,null,null,0,216,0,null,null,null,null,null,null,0,216,0,36627.731444223995]
[null,"CHIHUAHUA","LOHA840518CS8","LOHA840518HCHPRL07","LOPEZ HERNANDEZ ALBERTO","08DPT0007X",null,null,null,null,null,null,0,216,0,null,null,null,null,null,null,0,216,0,34207.134768639997]
[null,"CHIHUAHUA","MAVA850717159","MAVA850717MCHCLL06","MACÍAS VELAZQUEZ ALEJANDRA","08DPT0007X",null,null,null,null,null,null,0,240,0,null,null,null,null,null,null,0,240,0,45294.918712767998]
[null,"CHIHUAHUA","MAER720708DH1","MAXE720708MCHNXR00","MANCHA ERIKA SELENE","08DPT0007X",null,null,null,null,null,null,0,180,0,null,null,null,null,null,null,0,180,0,33628.638775881605]
[null,"CHIHUAHUA","MARS830130RA7","MARS830130HCHRVR05","MARTINEZ RIVERA SERGIO ALONSO","08DPT0007X",null,null,null,null,null,null,0,204,0,null,null,null,null,null,null,0,204,0,33797.207822912002]
[null,"CHIHUAHUA","MALA850527KR1","MALA850527HTLTCN04","MATUS LECOURTOIS ANDRES ISAAC","08DPT0007X",null,null,null,null,null,null,0,216,0,null,null,null,null,null,null,0,216,0,31612.236688639994]
[null,"CHIHUAHUA","MESO501218RY9","MESO501218HJCNLS04","MENDOZA SALAS OSCAR  IGNAC IO","08DPT0007X",null,null,null,null,null,null,0,180,0,null,null,null,null,null,null,0,180,0,34678.215869404448]
[null,"CHIHUAHUA","MESB8507159W0","MESB850715HCHNRN00","MENDOZA SORIANO BENJAMIN ALEJANDRO","08DPT0007X",null,null,null,null,null,null,0,240,0,null,null,null,null,null,null,0,240,0,40873.242776159997]
[null,"CHIHUAHUA","MOAJ681102IQ0","MOAJ681102HCHNGS07","MONTES AGUILAR JESUS GERARDO","08DPT0007X",null,null,null,null,null,null,0,204,0,null,null,null,null,null,null,0,204,0,30725.281510286219]
[null,"CHIHUAHUA","MOMM791027B8A","MOMM791027MCHRRY08","MORALES MORENO MAYRA MARGARITA","08DPT0007X",null,null,null,null,null,null,0,228,0,null,null,null,null,null,null,0,228,0,41947.091700095996]
[null,"CHIHUAHUA","OEPH7911267A5","OEPH791126HCHRNC09","ORNELAS DEL PINO HECTOR RICARDO","08DPT0007X",null,null,null,null,null,null,0,216,0,null,null,null,null,null,null,0,216,0,36928.244947359999]
[null,"CHIHUAHUA","OIGA8509273I1","OIGA850927HCHRTL04","ORTIZ GUTIERREZ JOSE ALBERTO","08DPT0007X",null,null,null,null,null,null,0,180,0,null,null,null,null,null,null,0,180,0,28719.987689386671]
[null,"CHIHUAHUA","PEME750130UP9","PEME750130HCHRRR00","PEREZ MARTINEZ ERICK DAVID","08DPT0007X",null,null,null,null,null,null,0,216,0,null,null,null,null,null,null,0,216,0,31136.193539999997]
[null,"CHIHUAHUA","PERL8208024K1","PERL820802MCHRMR03","PEREZ RAMOS LAURA ANGELICA","08DPT0007X",null,null,null,null,null,null,0,180,0,null,null,null,null,null,null,0,180,0,35810.511672780805]
[null,"CHIHUAHUA","POMJ860826TB2","POMJ860826HCHRDN05","PORRAS MEDINA JUAN CARLOS","08DPT0007X",null,null,null,null,null,null,0,216,0,null,null,null,null,null,null,0,216,0,35500.495756351993]
[null,"CHIHUAHUA","RIBG810102KB8","RIBG810102MCHVRR02","RIVAS BARRAGAN GRACIELA","08DPT0007X",null,null,null,null,null,null,0,168,0,null,null,null,null,null,null,0,168,0,25705.550180088892]
[null,"CHIHUAHUA","ROMP8008014S4","ROMP800801MCSBZT07","ROBLERO MAZARIEGOS PATRICIA","08DPT0007X",null,null,null,null,null,null,0,240,0,null,null,null,null,null,null,0,240,0,46236.360124940795]
[null,"CHIHUAHUA","ROCG680807P47","ROCG680807MCLLSR09","ROLDAN CASTILLO GRISELDA","08DPT0007X",null,null,null,null,null,null,0,168,0,null,null,null,null,null,null,0,168,0,24782.764099604425]
[null,"CHIHUAHUA","ROMM911224P47","ROMM911224HCHSNR07","ROSALES MENDOZA MARIO","08DPT0007X",null,null,null,null,null,null,0,180,0,null,null,null,null,null,null,0,180,0,24149.310603610196]
[null,"CHIHUAHUA","RUGA7605108F9","RUGA760510MCHVTN01","RUVALCABA GUTIERREZ MARIA ANTONIETA","08DPT0007X",null,null,null,null,null,null,0,216,0,null,null,null,null,null,null,0,216,0,34928.252063324442]
[null,"CHIHUAHUA","SASE940502AY3","SASE940502HCHLLD03","SALAZAR SILVA EDGAR OVED","08DPT0007X",null,null,null,null,null,null,0,132,0,null,null,null,null,null,null,0,132,0,15609.850549766594]
[null,"CHIHUAHUA","SAMD9405148N8","SAMD940514HCHLNN04","SALCEDO MONRREAL DANIEL","08DPT0007X",null,null,null,null,null,null,0,240,0,null,null,null,null,null,null,0,240,0,24401.397638044444]
[null,"CHIHUAHUA","SAFA580219G58","SAFA580219HVZMLL08","SAMARIO FLORES ALVARO","08DPT0007X",null,null,null,null,null,null,0,216,0,null,null,null,null,null,null,0,216,0,43258.487137920005]
[null,"CHIHUAHUA","SAOA880909JJ6","SAOA880909HOCMSL00","SAMARIO OSORIO ALVARO OSCAR","08DPT0007X",null,null,null,null,null,null,0,204,0,null,null,null,null,null,null,0,204,0,30680.624683208887]
[null,"CHIHUAHUA","SEEI760505188","SAOA880909HOCMSL00","SERRATOS ESPARZA ILSE","08DPT0007X",null,null,null,null,null,null,0,192,0,null,null,null,null,null,null,0,192,0,32154.757704480005]
[null,"CHIHUAHUA","TAVY911105KV5","TAVI911105MCHGNS05","TAGLE VENZOR YASSMIN","08DPT0007X",null,null,null,null,null,null,0,228,0,null,null,null,null,null,null,0,228,0,35311.51889781333]
[null,"CHIHUAHUA","TENA800305KZ2","TENA800305HCHJVN00","TEJADA NEVAREZ ANGEL ADRIAN","08DPT0007X",null,null,null,null,null,null,0,228,0,null,null,null,null,null,null,0,228,0,39526.578001919988]
[null,"CHIHUAHUA","TORE8012234Y9","TORE801223HNTPYD08","TOPETE REYES EDGAR","08DPT0007X",null,null,null,null,null,null,0,120,0,null,null,null,null,null,null,0,120,0,22793.094383822223]
[null,"CHIHUAHUA","TOCJ650407CT0","TOCJ650407HVZRNS07","TORRES CANTERO JOSE","08DPT0007X",null,null,null,null,null,null,0,240,0,null,null,null,null,null,null,0,240,0,47177.790221440002]
[null,"CHIHUAHUA","TORN791114PY6","TORN791114MCHRYD07","TORRES REY NADIA MARIA","08DPT0007X",null,null,null,null,null,null,0,192,0,null,null,null,null,null,null,0,192,0,34238.335572246404]
[null,"CHIHUAHUA","TOCA911218IK5","TOCA911218MCLVRL07","TOVAR CRISTIAN ALMA DELIA","08DPT0007X",null,null,null,null,null,null,0,204,0,null,null,null,null,null,null,0,204,0,24148.65381251635]
[null,"CHIHUAHUA","UUAR860131EV3","UUAR860131HCHRRF06","URTUZUASTEGUI ARZOLA RAFAEL","08DPT0007X",null,null,null,null,null,null,0,240,0,null,null,null,null,null,null,0,240,0,47143.624397439999]
[null,"CHIHUAHUA","VAAF840608FK3","VAAF840608HCHZCR03","VAZQUEZ ACEVEDO FERNANDO","08DPT0007X",null,null,null,null,null,null,0,228,0,null,null,null,null,null,null,0,228,0,39672.421311839993]
[null,"CHIHUAHUA","VIAS640217RZ1","VIAS640217HCHLGL08","VILLALOBOS AGUIRRE SAUL","08DPT0007X",null,null,null,null,null,null,0,228,0,null,null,null,null,null,null,0,228,0,34172.881660556799]
[null,"CHIHUAHUA","VIPY930427KI9","VIPY930427MCHLRR02","VILLALOBOS PORRAS YARA VERONICA","08DPT0007X",null,null,null,null,null,null,0,204,0,null,null,null,null,null,null,0,204,0,28101.340615460351]
[null,"CHIHUAHUA","VIGR720403880","VIGR720403HVZLBC14","VILLARAUZ GABINO RICARDO","08DPT0007X",null,null,null,null,null,null,0,216,0,null,null,null,null,null,null,0,216,0,42712.159861529602]
[null,"CHIHUAHUA","AUED570608MR1","AUED570608HZSGSN08","DANIEL AGUILAR ESPARZA","08DPT0008W",null,null,null,1,0,0,null,null,null,null,null,null,null,null,null,1,0,0,64142.98]
[null,"CHIHUAHUA","BESJ800501RQ3","BESJ800501HCLRLL06","JULIO CESAR BERNAL SALAS","08DPT0008W",null,null,null,1,0,0,null,null,null,null,null,null,null,null,null,1,0,0,28762.6]
[null,"CHIHUAHUA","EOCA6608284C4","EOCA660828HCHSRG02","ESCOBAR CERVANTES AGUSTIN","08DPT0008W",null,null,null,1,0,0,null,null,null,null,null,null,null,null,null,1,0,0,41687.11]
[null,"CHIHUAHUA","EOHE660901TLA","EOHE660901MCHSLV04","EVA MARIA ESCOBAR HOLGUIN","08DPT0008W",null,null,null,1,0,0,null,null,null,null,null,null,null,null,null,1,0,0,56975.53]
[null,"CHIHUAHUA","HEGA690525I40","HEGA690525MCHRRL02","ALICIA HERNANDEZ GARCIA","08DPT0008W",null,null,null,1,0,0,null,null,null,null,null,null,null,null,null,1,0,0,61435.21]
[null,"CHIHUAHUA","HEGE6610076VO","HEGE661007MSIRLG06","MARIA EUGENIA HERRERA  GOLARTE","08DPT0008W",null,null,null,1,0,0,null,null,null,null,null,null,null,null,null,1,0,0,143997.69]
[null,"CHIHUAHUA","MAVM680815AT6","MAVM680815HCHRLR01","MARIO ALBERTO MARTINEZ VILLELA","08DPT0008W",null,null,null,1,0,0,null,null,null,null,null,null,null,null,null,1,0,0,146584.60999999999]
[null,"CHIHUAHUA","ROAC671104HB5","MALM890515HCHTCR05","MARIO ALBERTO MATA LICON","08DPT0008W",null,null,null,null,null,null,null,null,null,null,null,null,1,0,0,1,0,0,109593.9]
[null,"CHIHUAHUA","MEMF660302UMO","MEMF660302HCHNLD06","FEDERICO MENDOZA MOLINAR","08DPT0008W",null,null,null,1,0,0,null,null,null,null,null,null,null,null,null,1,0,0,66850.59]
[null,"CHIHUAHUA","MIRA630916H43","MIRA630916HCHRJN07","ANTONIO MIRANDA ROJO","08DPT0008W",null,null,null,1,0,0,null,null,null,null,null,null,null,null,null,1,0,0,42193.91]
[null,"CHIHUAHUA","MOAG600916JW6","MOAG600916HCHYCL04","MOY ACOSTA GUILLERMO","08DPT0008W",null,null,null,null,null,null,null,null,null,null,null,null,1,0,0,1,0,0,82221.740000000005]
[null,"CHIHUAHUA","OOVM6504302T1","OOVM650430HCHRLS07","MOISES OROZCO VALDEZ","08DPT0008W",null,null,null,1,0,0,null,null,null,null,null,null,null,null,null,1,0,0,65527.57]
[null,"CHIHUAHUA","PANA720117JW4","PANA720117HDGLVN01","ANTONIO PALMA NEVAREZ","08DPT0008W",null,null,null,1,0,0,null,null,null,null,null,null,null,null,null,1,0,0,57498.34]
[null,"CHIHUAHUA","PAHA640330KP3","PAHA640330MCHYLR06","ARMIDA IRENE PAYAN HOLGUIN","08DPT0008W",null,null,null,1,0,0,null,null,null,null,null,null,null,null,null,1,0,0,165150.17000000001]
[null,"CHIHUAHUA","POAJ710301PK6","POAJ710301MCHRLS06","MARIA DE JESUS PORTILLO ALARCON","08DPT0008W",null,null,null,1,0,0,null,null,null,null,null,null,null,null,null,1,0,0,44962.45]
[null,"CHIHUAHUA","RIGR710129FB6","RIGR710129MCHVRQ06","RAQUEL ERENDIRA RIVERA GARCIA","08DPT0008W",null,null,null,1,0,0,null,null,null,null,null,null,null,null,null,1,0,0,61055.44]
[null,"CHIHUAHUA","SAMY750404I76","SAML750404MCHNXZ07","SAENZ MUNOZ LUZ MARIA","08DPT0008W",null,null,null,1,0,0,null,null,null,null,null,null,null,null,null,1,0,0,38234.17]
[null,"CHIHUAHUA","SADE650818IV1","SADE650818MCHLRL09","MARIA ELENA SALAZAR DUARTE","08DPT0008W",null,null,null,1,0,0,null,null,null,null,null,null,null,null,null,1,0,0,58568.08]
[null,"CHIHUAHUA","TAHJ7109304KA","TAHJ710930HCHRLV01","JAVIER EUSEBIO TARANGO HOLGUIN","08DPT0008W",null,null,null,1,0,0,null,null,null,null,null,null,null,null,null,1,0,0,146745.53]
[null,"CHIHUAHUA","VARJ610925H36","VARJ610925HCHLSS00","JESUS ANTONIO VALDEZ ROSALES","08DPT0008W",null,null,null,1,0,0,null,null,null,null,null,null,null,null,null,1,0,0,50082.13]
[null,"CHIHUAHUA","VEGR750904UR2","VEGR750904MCHLRS06","ROSALIA MARGARITA VELARDE GARCIA","08DPT0008W",null,null,null,1,0,0,null,null,null,null,null,null,null,null,null,1,0,0,72381.52]
[null,"CHIHUAHUA","VARO691222JA8","VAXR691222MCHLXS07","ROSA MARIA VALENZUELA","08DPT0008W",null,null,null,null,null,null,0,108,0,null,null,null,null,null,null,0,108,0,19810.11]
[null,"CHIHUAHUA","AUMM780328A31","AUMM780328MCHGLN09","MINERVA AGUILAR MOLINAR","08DPT0008W",null,null,null,null,null,null,0,240,0,null,null,null,null,null,null,0,240,0,39699.83]
[null,"CHIHUAHUA","AEGL800105RF6","AEGL800105MCHLNZ06","LIZETTE JOHANNA ALEJANDRO GONZALEZ","08DPT0008W",null,null,null,null,null,null,0,216,0,null,null,null,null,null,null,0,216,0,36315.43]
[null,"CHIHUAHUA","AAGJ670423U8A","AAGJ670423HCHMNR05","JORGE AMPARAN GONZALEZ","08DPT0008W",null,null,null,null,null,null,0,216,0,null,null,null,null,null,null,0,216,0,35395.949999999997]
[null,"CHIHUAHUA","AESS721002N67","AESS721002MCHRTS00","SUSANA ARMENDARIZ SOTO","08DPT0008W",null,null,null,null,null,null,0,240,0,null,null,null,null,null,null,0,240,0,35628.53]
[null,"CHIHUAHUA","BAVM821203FN0","BAVM821203MCHRLN06","MONICA LOURDES BARRAZA VILLALOBOS","08DPT0008W",null,null,null,null,null,null,0,228,0,null,null,null,null,null,null,0,228,0,33584.58]
[null,"CHIHUAHUA","CAVS820702FV1","CAVS820702MCHRRN01","SANDRA ELIZABETH CARDENAS VARGAS","08DPT0008W",null,null,null,null,null,null,0,216,0,null,null,null,null,null,null,0,216,0,31094.33]
[null,"CHIHUAHUA","ROMJ731201675","CANA840815MCHRVN00","ANA ISABEL CARREON NAVA","08DPT0008W",null,null,null,null,null,null,0,240,0,null,null,null,null,null,null,0,240,0,31126.84]
[null,"CHIHUAHUA","MUMP8911284K8","COMR940524HCHNRD00","CONTRERAS MARTINEZ RODOLFO","08DPT0008W",null,null,null,null,null,null,0,120,0,null,null,null,null,null,null,0,120,0,17304]
[null,"CHIHUAHUA","DIHL770620B93","DIHL770620MCHZRZ06","LUZ IMELDA DIAZ HERNANDEZ","08DPT0008W",null,null,null,null,null,null,0,240,0,null,null,null,null,null,null,0,240,0,36516.199999999997]
[null,"CHIHUAHUA","GASJ850822GF7","GASJ850822HCHLNS04","JOSE GALVEZ SANTANA","08DPT0008W",null,null,null,null,null,null,0,240,0,null,null,null,null,null,null,0,240,0,38108.050000000003]
[null,"CHIHUAHUA","GAFM7309188R8","GASA810331MCHRRD08","ADRIANA GARDEA SERRANO","08DPT0008W",null,null,null,null,null,null,0,240,0,null,null,null,null,null,null,0,240,0,28600.5]
[null,"CHIHUAHUA","GULM750313628","GULM750313HCHLNN08","MANUEL ALEJANDRO GULLEN LUNA","08DPT0008W",null,null,null,null,null,null,0,228,0,null,null,null,null,null,null,0,228,0,32709.59]
[null,"CHIHUAHUA","HEAJ8610295N1","HEAJ861029HCHRCN09","JUAN CARLOS HERNANDEZ ACOSTA ","08DPT0008W",null,null,null,null,null,null,0,216,0,null,null,null,null,null,null,0,216,0,36372.199999999997]
[null,"CHIHUAHUA","HEGE760311918","HEGE760311HCHRTF05","EFRAIN ARTURO HERNANDEZ GUTIERREZ","08DPT0008W",null,null,null,null,null,null,0,240,0,null,null,null,null,null,null,0,240,0,23747.08]
[null,"CHIHUAHUA","MAML7703077T7","MALM770307MCHCRS01","LESSLEY MYRLEE MACIAS MARTINEZ","08DPT0008W",null,null,null,null,null,null,0,240,0,null,null,null,null,null,null,0,240,0,39725.9]
[null,"CHIHUAHUA","MAEJ690219AK2","MAEJ690219HCHRSS06","JESUS MARTINEZ ESPARZA","08DPT0008W",null,null,null,null,null,null,0,240,0,null,null,null,null,null,null,0,240,0,40300.879999999997]
[null,"CHIHUAHUA","MECO5508271G3","MECO550827MSLXSL09","MEXIA CASTRO OLGA PATRICIA","08DPT0008W",null,null,null,null,null,null,0,240,0,null,null,null,null,null,null,0,180,0,32414.13]
[null,"CHIHUAHUA","MOGE730414EA4","MOGE730414HCHRRL09","MORENO GARCIA ELISEO","08DPT0008W",null,null,null,null,null,null,0,180,0,null,null,null,null,null,null,0,240,0,18095.560000000001]
[null,"CHIHUAHUA","MUDL850226U70","MUDL850226MCHXLL02","LILIA MUÑOZ DELGADO","08DPT0008W",null,null,null,null,null,null,0,240,0,null,null,null,null,null,null,0,228,0,38548.269999999997]
[null,"CHIHUAHUA","MUMP8911284K8","MUMP891128HCHXXS06","PASCUAL ABRAHAM MUÑOZ MUÑOZ","08DPT0008W",null,null,null,null,null,null,0,228,0,null,null,null,null,null,null,0,240,0,30036.05]
[null,"CHIHUAHUA","NAHJ790815BF0","NAHJ790815HCHVRS00","JESUS MIGUEL NAVARRO HERNANDEZ","08DPT0008W",null,null,null,null,null,null,0,240,0,null,null,null,null,null,null,0,228,0,29356.639999999999]
[null,"CHIHUAHUA","OIGM890424ICI","OIGM890424MCHLRR06","MARTA ALEJANDRA OLIVAS GUERRERO","08DPT0008W",null,null,null,null,null,null,0,228,0,null,null,null,null,null,null,0,240,0,32660.639999999999]
[null,"CHIHUAHUA","OINS5902223YA","OINS590222HMNLXL02","OLIVO NUÑEZ JOSE SALVADOR","08DPT0008W",null,null,null,null,null,null,0,240,0,null,null,null,null,null,null,0,144,0,32137.62]
[null,"CHIHUAHUA","PAVF6602076Y9","PAVF660207MCHLRL06","PALMA VARGAS FLOR","08DPT0008W",null,null,null,null,null,null,0,144,0,null,null,null,null,null,null,0,228,0,14426.24]
[null,"CHIHUAHUA","GORS7911246K4","PAVF661205HCHTRC01","PATENA FIERRO VICTOR MANUEL","08DPT0008W",null,null,null,null,null,null,0,228,0,null,null,null,null,null,null,0,240,0,32814.269999999997]
[null,"CHIHUAHUA","RERP770809FK9","RERP770809HCHDDD04","PEDRO OSWALDO REDE RODRIGUEZ","08DPT0008W",null,null,null,null,null,null,0,240,0,null,null,null,null,null,null,0,240,0,35554.06]
[null,"CHIHUAHUA","REVY780409NT1","REVY780409MCHYLZ05","YASMIN LISSET REYES VALLES","08DPT0008W",null,null,null,null,null,null,0,240,0,null,null,null,null,null,null,0,240,0,31839.59]
[null,"CHIHUAHUA","RIGJ610311956","RIGJ610311HDFVRL08","JOEL RAUL RIVAS GARCIA","08DPT0008W",null,null,null,null,null,null,0,240,0,null,null,null,null,null,null,0,240,0,34539.589999999997]
[null,"CHIHUAHUA","ROGR680108PWA","ROGR680108HCHDRC09","RICARDO RODRIGUEZ GARCIA","08DPT0008W",null,null,null,null,null,null,0,240,0,null,null,null,null,null,null,0,240,0,40748.550000000003]
[null,"CHIHUAHUA","RORF881013FI1","RORF881013MCHDBT02","FATIMA RODRIGUEZ ROBLES","08DPT0008W",null,null,null,null,null,null,0,240,0,null,null,null,null,null,null,0,120,0,31383.1]
[null,"CHIHUAHUA","SADR840831726","SADR840831HCHNZM02","RAMON AGUSTO SANCHEZ DIAZ","08DPT0008W",null,null,null,null,null,null,0,120,0,null,null,null,null,null,null,0,240,0,20719.490000000002]
[null,"CHIHUAHUA","SARJ650111CB4","SARJ650111HCHNVM05","JAIME SANCHEZ RIVERA","08DPT0008W",null,null,null,null,null,null,0,240,0,null,null,null,null,null,null,0,120,0,39675.35]
[null,"CHIHUAHUA","VAVS740521TK5","VAVS740521HCHLLL09","SAUL ARMANDO VALLES VALLE","08DPT0008W",null,null,null,null,null,null,0,120,0,null,null,null,null,null,null,0,240,0,18826.189999999999]
[null,"CHIHUAHUA","VICG5002047Q6","VICG500204HCHTRL01","GILBERTO FELICIANO VITELA CARRASCO","08DPT0008W",null,null,null,null,null,null,0,240,0,null,null,null,null,null,null,0,240,0,39948.550000000003]
[null,"CHIHUAHUA","CAMC8511068L5","CAMC851106MCHRRR00","CARMEN IVONNE CARMONA MURILLO","08DPT0012I",null,null,null,1,0,0,null,null,null,null,null,null,null,null,null,1,0,0,36843.050000000003]
[null,"CHIHUAHUA","CATJ640415MG5","CATJ640415HCHHRN06","JUAN ANTONIO CHAVEZ TERRAZAS","08DPT0012I",null,null,null,1,0,0,null,null,null,null,null,null,null,null,null,1,0,0,163220.60999999999]
[null,"CHIHUAHUA","COVC830703U30","COVC830703MCHRZY01","CYNTHIA ROSARIO CORONADO VAZQUEZ","08DPT0012I",null,null,null,1,0,0,null,null,null,null,null,null,null,null,null,1,0,0,126887.06]
[null,"CHIHUAHUA","EIRL670407TS6","EIRL670407MCHNDT08","LETICIA ENRIQUEZ RODRIGUEZ","08DPT0012I",null,null,null,1,0,0,null,null,null,null,null,null,null,null,null,1,0,0,164652.81]
[null,"CHIHUAHUA","GACI7107098NA","GACI710709MCHRRM01","IMELDA IVONE GARCIA CARMONA","08DPT0012I",null,null,null,1,0,0,null,null,null,null,null,null,null,null,null,1,0,0,66589.69]
[null,"CHIHUAHUA","GOMB690116428","GOMB690116MCHNRL02","BELIA LORENA GONZALEZ  MORENO","08DPT0012I",null,null,null,1,0,0,null,null,null,null,null,null,null,null,null,1,0,0,55732.640000000007]
[null,"CHIHUAHUA","IAMM880831RY4","IAMM880831MCHZRR03","MAR ELISA IZAGUIRRE MARTINEZ","08DPT0012I",null,null,null,1,0,0,null,null,null,null,null,null,null,null,null,1,0,0,50040.560000000005]
[null,"CHIHUAHUA","LECG700827GY1","LECG700827MCHCHL00","GLORIA A LECHUGA CHAVEZ","08DPT0012I",null,null,null,1,0,0,null,null,null,null,null,null,null,null,null,1,0,0,107771.65999999999]
[null,"CHIHUAHUA","LOLJ670726J90","LOLJ670723HCHPZV05","JAVIER LOPEZ LOZANO","08DPT0012I",null,null,null,1,0,0,null,null,null,null,null,null,null,null,null,1,0,0,36843.050000000003]
[null,"CHIHUAHUA","MAAS821018113","MAAS821018HCHRNG05","SIGIFREDO MARQUEZ ANCHONDO","08DPT0012I",null,null,null,1,0,0,null,null,null,null,null,null,null,null,null,1,0,0,56091.850000000006]
[null,"CHIHUAHUA","MAQS651014TH4","MAQS651014HCHRNL03","SAUL MARQUEZ QUINTANA","08DPT0012I",null,null,null,1,0,0,null,null,null,null,null,null,null,null,null,1,0,0,44706.509999999995]
[null,"CHIHUAHUA","PEDR620906HG6","PEDR620906HCHRMM07","RAMON JAVIER PEREZ DOMINGUEZ","08DPT0012I",null,null,null,null,null,null,null,null,null,null,null,null,1,0,0,1,0,0,107437.06]
[null,"CHIHUAHUA","ROCR700830F58","ROCR700830HCHDNC08","RICARDO ANTELMO RODRIGUEZ CANO","08DPT0012I",null,null,null,1,0,0,null,null,null,null,null,null,null,null,null,1,0,0,50271.909999999996]
[null,"CHIHUAHUA","ROTF760823LY5","ROTF760823MCHDRL03","FLOR GUADALUPE RODRIGUEZ TREJO","08DPT0012I",null,null,null,1,0,0,null,null,null,null,null,null,null,null,null,1,0,0,62391.76]
[null,"CHIHUAHUA","SOMD561124TEA","SOMD561124HCHTDV09","DAVID SOTELO MEDRANO","08DPT0012I",null,null,null,1,0,0,null,null,null,null,null,null,null,null,null,1,0,0,59814.09]
[null,"CHIHUAHUA","TERL781019J60","TERL781019HCHNDS08","LUIS CARLOS TENA RODELAS","08DPT0012I",null,null,null,1,0,0,null,null,null,null,null,null,null,null,null,1,0,0,55651.59]
[null,"CHIHUAHUA","UIST6008045JA","UIST600804HDGRMM07","TOMAS URBINA SIMENTAL","08DPT0012I",null,null,null,1,0,0,null,null,null,null,null,null,null,null,null,1,0,0,60417.19]
[null,"CHIHUAHUA","VAGA800112LSA","VAGA800112HCHLTL07","ALBERTO VALENZUELA GUTIERREZ","08DPT0012I",null,null,null,1,0,0,null,null,null,null,null,null,null,null,null,1,0,0,42526.95]
[null,"CHIHUAHUA","VIMD590726DU0","VIMD590726HCHLRN05","DONACIANO VILLALOBOS MORENO","08DPT0012I",null,null,null,1,0,0,null,null,null,null,null,null,null,null,null,1,0,0,162240.50999999998]
[null,"CHIHUAHUA","AARP7710257KA","AARP771025MCHLZL02","PALMA LILIANA ALMANZA RUIZ","08DPT0012I",null,null,null,null,null,null,0,168,0,null,null,null,null,null,null,0,168,0,28066.799999999999]
[null,"CHIHUAHUA","AAOG811026Q47","AAOG811026MCHRRB02","GABRIELA MARIA ARAGON ORTIZ","08DPT0012I",null,null,null,null,null,null,0,240,0,null,null,null,null,null,null,0,240,0,33554.61]
[null,"CHIHUAHUA","CARE8810091J2","CARE881009HCHRMD08","EDGAR ENRIQUE CARREON RAMOS","08DPT0012I",null,null,null,null,null,null,0,216,0,null,null,null,null,null,null,0,216,0,33816.199999999997]
[null,"CHIHUAHUA","CACP850903KT2","CACP850903MCHHHR00","PERLA JAZMIN CHAIREZ CHACON","08DPT0012I",null,null,null,null,null,null,0,204,0,null,null,null,null,null,null,0,204,0,33175.729999999996]
[null,"CHIHUAHUA","CAJG690110UD1","CAJG690110HCHHRN00","GONZALO CHAVEZ JUAREZ","08DPT0012I",null,null,null,null,null,null,0,240,0,null,null,null,null,null,null,0,240,0,39789.130000000005]
[null,"CHIHUAHUA","CAMN760505UE4","CAMN760505MCHHNN03","NANCY LORENA CHAVEZ MONCADA","08DPT0012I",null,null,null,null,null,null,0,192,0,null,null,null,null,null,null,0,192,0,31847.65]
[null,"CHIHUAHUA","PEMC8412061M5","PEMC841206HCHXRR02","CARLOS DE LA PEÑA MERAZ","08DPT0012I",null,null,null,null,null,null,0,120,0,null,null,null,null,null,null,0,120,0,20069.5]
[null,"CHIHUAHUA","DOCE610806AJ3","DOCE610806MCHMMS03","ESPERANZA DOMINGUEZ CAMUÑEZ","08DPT0012I",null,null,null,null,null,null,0,240,0,null,null,null,null,null,null,0,240,0,29674.07]
[null,"CHIHUAHUA","DOCA7712105BA","DOCA771210HCHMSL05","ALVARO DOMINGUEZ CASARES","08DPT0012I",null,null,null,null,null,null,0,240,0,null,null,null,null,null,null,0,240,0,28518.639999999999]
[null,"CHIHUAHUA","DOTW8710023S3","DOTW871002HCHMRL06","WALTER ALEJANDRO DOMINGUEZ TORRES","08DPT0012I",null,null,null,null,null,null,0,192,0,null,null,null,null,null,null,0,192,0,31046.510000000006]
[null,"CHIHUAHUA","DUIA911217JM8","DUIA911217HCHRBR05","ARMANDO ALEXIS DUARTE IBARRA","08DPT0012I",null,null,null,null,null,null,0,180,0,null,null,null,null,null,null,0,180,0,22922.629999999997]
[null,"CHIHUAHUA","EACL761108IA6","EACL761108HCHSHS08","JOSE LUIS ESTRADA CHAVEZ","08DPT0012I",null,null,null,null,null,null,0,156,0,null,null,null,null,null,null,0,156,0,13797.57]
[null,"CHIHUAHUA","FITM7609208P9","FITM760920MCHGVR05","MARISOL FIGUEROA TOVAR","08DPT0012I",null,null,null,null,null,null,0,216,0,null,null,null,null,null,null,0,216,0,35554.81]
[null,"CHIHUAHUA","FORM921019289","FORM921019HCHLDR09","MARCO ANTONIO FLORES RODRIGUEZ","08DPT0012I",null,null,null,null,null,null,0,204,0,null,null,null,null,null,null,0,204,0,26026.989999999998]
[null,"CHIHUAHUA","GAMC820716BJ4","GAMC820716MCHLRR08","MARIA DEL CARMEN GALLEGOS MARTINEZ","08DPT0012I",null,null,null,null,null,null,0,240,0,null,null,null,null,null,null,0,240,0,39348.559999999998]
[null,"CHIHUAHUA","GOCS820528T91","GOCS820528MCHNLN05","SANDRA BERENICE GONZALEZ COLMENERO","08DPT0012I",null,null,null,null,null,null,0,240,0,null,null,null,null,null,null,0,240,0,39149.82]
[null,"CHIHUAHUA","GOGG631226J88","GOGG631226MCHNLL06","GLORIA MARINA GONZALEZ GALLEGOS","08DPT0012I",null,null,null,null,null,null,0,240,0,null,null,null,null,null,null,0,240,0,38598.270000000004]
[null,"CHIHUAHUA","GOQM960413969","GOQM960413HCHNXR03","MARCO ANTONIO GONZALEZ QUIÑONEZ","08DPT0012I",null,null,null,null,null,null,0,108,0,null,null,null,null,null,null,0,108,0,11391.93]
[null,"CHIHUAHUA","GAMO630830H94","GAMO630830MCHRRL07","OLGA CECILIA GRAJEDA  MIRAMONTES","08DPT0012I",null,null,null,null,null,null,0,240,0,null,null,null,null,null,null,0,240,0,39298.559999999998]
[null,"CHIHUAHUA","HEGP741201TCA","HEGP741201MCHRRT03","PATRICIA OLAYA HERRERA GARCIA","08DPT0012I",null,null,null,null,null,null,0,204,0,null,null,null,null,null,null,0,204,0,34019.53]
[null,"CHIHUAHUA","IIOF8012093M1","IIOF801209HCHRLR08","FRANCISCO IRIGOYEN OLIVAS","08DPT0012I",null,null,null,null,null,null,0,240,0,null,null,null,null,null,null,0,240,0,39749.82]
[null,"CHIHUAHUA","IAFR620519979","IAFR620519HSLZRM07","RAMON  IZAGUIRRE FIERRO","08DPT0012I",null,null,null,null,null,null,0,228,0,null,null,null,null,null,null,0,228,0,30852.789999999997]
[null,"CHIHUAHUA","JAAG74101784A","JAAG741017MCHQRL01","GLORIA LINDA JAQUEZ ARBALLO","08DPT0012I",null,null,null,null,null,null,0,240,0,null,null,null,null,null,null,0,240,0,39398.559999999998]
[null,"CHIHUAHUA","LAGL890709J41","LAGL890709MCHZNL07","LLUVIA CRISTINA LAZO GONZALEZ","08DPT0012I",null,null,null,null,null,null,0,228,0,null,null,null,null,null,null,0,228,0,31946.939999999995]
[null,"CHIHUAHUA","MALS840210DM2","MALS840210MCHCYL02","SILVIA ISELA MACIAS LOYA","08DPT0012I",null,null,null,null,null,null,0,120,0,null,null,null,null,null,null,0,120,0,21328.58]
[null,"CHIHUAHUA","MAGZ860917JB4","MAGZ860917MCHLLL02","ZULEYKA MARIELA MALDONADO GIL","08DPT0012I",null,null,null,null,null,null,0,240,0,null,null,null,null,null,null,0,240,0,38449.82]
[null,"CHIHUAHUA","MATM841124GU1","MATM841124MCHRLY00","MAYTEE ABRIL MARQUEZ TELLO","08DPT0012I",null,null,null,null,null,null,0,156,0,null,null,null,null,null,null,0,156,0,26781.99]
[null,"CHIHUAHUA","MAGM880802UR1","MAGM880802MCHRRR08","MARINA ANGELICA MARTINEZ GARCIA","08DPT0012I",null,null,null,null,null,null,0,240,0,null,null,null,null,null,null,0,240,0,38799.050000000003]
[null,"CHIHUAHUA","MEOE6606187C0","MEOE660618HCHLRF02","EFREN MELENDEZ ORTIZ","08DPT0012I",null,null,null,null,null,null,0,180,0,null,null,null,null,null,null,0,180,0,29332.61]
[null,"CHIHUAHUA","MERA900126FD2","MERA900126MCHNMN03","ANA ISABEL MENDOZA RAMOS","08DPT0012I",null,null,null,null,null,null,0,240,0,null,null,null,null,null,null,0,240,0,30063.190000000002]
[null,"CHIHUAHUA","MOEJ8410204P7","MOEJ841020HCHRSS09","JESUS MORENO ESTRADA","08DPT0012I",null,null,null,null,null,null,0,144,0,null,null,null,null,null,null,0,144,0,21899.510000000002]
[null,"CHIHUAHUA","NUMR860506DV4","NUMR860506MCHXRQ03","RAQUEL NUÑEZ MARTINEZ","08DPT0012I",null,null,null,null,null,null,0,240,0,null,null,null,null,null,null,0,240,0,39099.82]
[null,"CHIHUAHUA","OIPC830620AE8","OIPC830620HCHRRR03","CARLOS ALEJANDRO ORTIZ PAREDES","08DPT0012I",null,null,null,null,null,null,0,216,0,null,null,null,null,null,null,0,216,0,35216.199999999997]
[null,"CHIHUAHUA","PAVC680810379","PAVC680810MCHLLR09","CARMEN LORENA PALMA VALVERDE","08DPT0012I",null,null,null,null,null,null,0,192,0,null,null,null,null,null,null,0,192,0,31337.440000000002]
[null,"CHIHUAHUA","PAVK8303143F4","PAVK830314MCHYLR05","KARLA DENISSE PAYAN VALVERDE","08DPT0012I",null,null,null,null,null,null,0,240,0,null,null,null,null,null,null,0,240,0,39099.82]
[null,"CHIHUAHUA","POED8604086S3","POED860408MCHRCN03","DIANA ELIZABETH PORTILLO ECHAVARRIA","08DPT0012I",null,null,null,null,null,null,0,240,0,null,null,null,null,null,null,0,240,0,39049.82]
[null,"CHIHUAHUA","RORH430507A24","RORH430507HDGBMC03","HECTOR ANTONIO ROBALI ROMERO","08DPT0012I",null,null,null,null,null,null,0,240,0,null,null,null,null,null,null,0,240,0,37248.559999999998]
[null,"CHIHUAHUA","ROAN6811104YA","ROAN681110HVZDGX08","JOSE NOE RODRIGUEZ AGUILERA","08DPT0012I",null,null,null,null,null,null,0,156,0,null,null,null,null,null,null,0,156,0,26851.440000000002]
[null,"CHIHUAHUA","ROVC830522ILA","ROVC830522MCHDLR00","CRISTINA RODRIGUEZ VALVERDE","08DPT0012I",null,null,null,null,null,null,0,216,0,null,null,null,null,null,null,0,216,0,26855.55]
[null,"CHIHUAHUA","SAME780216645","SAME780216MCHCLS05","ESMERALDA SAUCEDO MOLINA","08DPT0012I",null,null,null,null,null,null,0,228,0,null,null,null,null,null,null,0,228,0,36883.58]
[null,"CHIHUAHUA","UUGA831111DY9","UUGA831111MCHRND03","ADRIANA ARMINE URQUIZA GONZALEZ","08DPT0012I",null,null,null,null,null,null,0,240,0,null,null,null,null,null,null,0,240,0,38548.270000000004]
[null,"CHIHUAHUA","VATL8403292K8","VATL840329HCHLRS05","LUIS OCTAVIO VALVERDE TORRES","08DPT0012I",null,null,null,null,null,null,0,240,0,null,null,null,null,null,null,0,240,0,33628.53]
[null,"CHIHUAHUA","VACA8309027BA","VXCA830902HCHZHN07","ANDRES VAZQUEZ  CHAVEZ","08DPT0012I",null,null,null,null,null,null,0,228,0,null,null,null,null,null,null,0,228,0,36808.050000000003]
[null,"CHIHUAHUA","VIVR8208282T1","VIVR820828HDGLLB03","ROBERTO RENE VILLALPALDO VILLALPANDO","08DPT0012I",null,null,null,null,null,null,0,228,0,null,null,null,null,null,null,0,228,0,21753.679999999997]
[null,"CHIHUAHUA","AAEJ730109C94","AAEJ730109HCHLSL06","ALVAREZ ESCARCEGA JULIAN ","08DPT0011J",null,null,null,1,0,0,null,null,null,null,null,null,null,null,null,1,0,0,28828.859999999997]
[null,"CHIHUAHUA","AOJS831129TE8","AOJS831129MCHNRL09","ANCHONDO JUAREZ SILVIA GRACIELA","08DPT0011J",null,null,null,1,0,0,null,null,null,null,null,null,null,null,null,"1",0,0,43022.92]
[null,"CHIHUAHUA","AOLY671118ELA","AOLY671118MDGRCZ05","ARROYO LECHUGA YAZMIN","08DPT0011J",null,null,null,1,0,0,null,null,null,null,null,null,null,null,null,1,0,0,148495.32]
[null,"CHIHUAHUA","BARM6606271QA","BARM660627HCHRBR03","MARIO ALBERTO BARBA RUBIO","08DPT0011J",null,null,null,1,0,0,null,null,null,null,null,null,null,null,null,1,0,0,37759.810000000005]
[null,"CHIHUAHUA","CAMF661018JC7","CAMF661018HCHHDR08","FRANCISCO JAVIER CABRERA MEDINA","08DPT0011J",null,null,null,1,0,0,null,null,null,null,null,null,null,null,null,1,0,0,106560.54]
[null,"CHIHUAHUA","EUGM7504107E2","EUGM750410HCHSRR05","ESQUIVEL GUERRERO MAURO EZEQUIEL ","08DPT0011J",null,null,null,1,0,0,null,null,null,null,null,null,null,null,null,1,0,0,40250.85]
[null,"CHIHUAHUA","FACG681029MZ8","FACG681029MCHDRR04","GEORGINA FAUDOA CRUZ","08DPT0011J",null,null,null,1,0,0,null,null,null,null,null,null,null,null,null,1,0,0,60948.649999999994]
[null,"CHIHUAHUA","FEPD840911LH2","FEPD840911MCHRZN04","DENISSE JANETT FERNANDEZ PAEZ","08DPT0011J",null,null,null,1,0,0,null,null,null,null,null,null,null,null,null,1,0,0,85357]
[null,"CHIHUAHUA","FOTL710111DG5","FOTL710111MDFLNL02","LILLIAN KARINA FLOTTE TINOCO ","08DPT0011J",null,null,null,1,0,0,null,null,null,null,null,null,null,null,null,1,0,0,106696.23999999998]
[null,"CHIHUAHUA","GAGJ740328P75","GAGJ740328HCHLNR03","JORGE ARTURO GALLEGOS GONZALEZ","08DPT0011J",null,null,null,1,0,0,null,null,null,null,null,null,null,null,null,1,0,0,56578.5]
[null,"CHIHUAHUA","GOQG650428BVA","GOQG650428MCHNNR07","GEORGINA GONZALEZ QUINTANA","08DPT0011J",null,null,null,1,0,0,null,null,null,null,null,null,null,null,null,1,0,0,52717.09]
[null,"CHIHUAHUA","GURJ541104T10","GURJ541104HCHRMS04","JESUS LUIS GUERRA RAMIREZ","08DPT0011J",null,null,null,1,0,0,null,null,null,null,null,null,null,null,null,1,0,0,54748.72]
[null,"CHIHUAHUA","HENE680323MJ1","HENE680323MCHRRL03","ELIDA HERNANDEZ NORES","08DPT0011J",null,null,null,1,0,0,null,null,null,null,null,null,null,null,null,1,0,0,56301.29]
[null,"CHIHUAHUA","LIGG8206272AA","LIGG820627HCLRRZ15","GIEZI LIRA GARCIA","08DPT0011J",null,null,null,1,0,0,null,null,null,null,null,null,null,null,null,1,0,0,56974.03]
[null,"CHIHUAHUA","LOCJ4605101D2","LOCJ460510HCHPSS06","JESUS LOPEZ CASTRO","08DPT0011J",null,null,null,1,0,0,null,null,null,null,null,null,null,null,null,1,0,0,53842.2]
[null,"CHIHUAHUA","LOPO671113I30","LOPO671113HCHPRS00","OSCAR BENJAMIN LOPEZ PEREZ","08DPT0011J",null,null,null,1,0,0,null,null,null,null,null,null,null,null,null,1,0,0,153529.97]
[null,"CHIHUAHUA","MACE880915VB1","MACE880915HCHRNR04","ERICK MARTELL CONTRERAS ","08DPT0011J",null,null,null,1,0,0,null,null,null,null,null,null,null,null,null,1,0,0,74466.22]
[null,"CHIHUAHUA","MAGI710826BY5","MAGI710826HCHRNV05","IVONNE ARACELI MARTINEZ GONZALEZ","08DPT0011J",null,null,null,1,0,0,null,null,null,null,null,null,null,null,null,1,0,0,100805.42]
[null,"CHIHUAHUA","MAVE810424SY3","MAVE810424MCHRLL08","ELIA ZURASY MARTINEZ VELO","08DPT0011J",null,null,null,1,0,0,null,null,null,null,null,null,null,null,null,1,0,0,40826.68]
[null,"CHIHUAHUA","MEGM480906839","MEGM480906HCHNNG00","MIGUEL ANGEL MENDOZA GONZALEZ","08DPT0011J",null,null,null,1,0,0,null,null,null,null,null,null,null,null,null,1,0,0,41155.340000000004]
[null,"CHIHUAHUA","MOCY820701FR6","MOCY820701MCHRHS01","YESSENIA IVONNE MORENO CHAVEZ ","08DPT0011J",null,null,null,1,0,0,null,null,null,null,null,null,null,null,null,1,0,0,141301.31]
[null,"CHIHUAHUA","OIFL620226A15","OIFL620226MCHLLD03","LIDIA GUADALUPE OLIVAS FLORES","08DPT0011J",null,null,null,1,0,0,null,null,null,null,null,null,null,null,null,1,0,0,78914.7]
[null,"CHIHUAHUA","OESN6905137N5","OESN690513MCHRCR06","NORMA ORTEGA SCOTT","08DPT0011J",null,null,null,1,0,0,null,null,null,null,null,null,null,null,null,1,0,0,107927.87]
[null,"CHIHUAHUA","OIAA580304QJ4","OIAA580304HCHRRB04","ABRAHAM ORTIZ ARMENDARIZ","08DPT0011J",null,null,null,1,0,0,null,null,null,null,null,null,null,null,null,1,0,0,52870.640000000007]
[null,"CHIHUAHUA","PICM810405PX1","PICM810405MCHRRR02","MARIANA PRIETO CARRASCO ","08DPT0011J",null,null,null,1,0,0,null,null,null,null,null,null,null,null,null,1,0,0,35760.86]
[null,"CHIHUAHUA","RUAJ680828NZ1","RUAJ680828HCHZGN01","JUAN CARLOS RUIZ AGUIRRE","08DPT0011J",null,null,null,1,0,0,null,null,null,null,null,null,null,null,null,1,0,0,40189.67]
[null,"CHIHUAHUA","RUGC841213D50","RUGC841213HCHZNS07","CESAR ALEXIS RUIZ GONZALEZ","08DPT0011J",null,null,null,1,0,0,null,null,null,null,null,null,null,null,null,1,0,0,107666.99000000002]
[null,"CHIHUAHUA","SADC620717A78","SADC620717MCHLMR01","CARMEN ESTELA SALAS DOMINGUEZ","08DPT0011J",null,null,null,1,0,0,null,null,null,null,null,null,null,null,null,1,0,0,81832.84]
[null,"CHIHUAHUA","SACG701206260","SACG701206MCHLND02","MARIA GUADALUPE SALAZAR CONTRERAS","08DPT0011J",null,null,null,1,0,0,null,null,null,null,null,null,null,null,null,1,0,0,105484.43999999999]
[null,"CHIHUAHUA","VAAG6312036W2","VAAG631203HTSLVR03","GERARDO VALDEZ AVILA","08DPT0011J",null,null,null,null,null,null,null,null,null,null,null,null,1,0,0,1,0,0,107527.31999999999]
[null,"CHIHUAHUA","VILA590828MZ1","VILA590828HCHLZG06","AGUSTIN VILLAGRAN LOZOYA","08DPT0011J",null,null,null,1,0,0,null,null,null,null,null,null,null,null,null,1,0,0,43378.89]
[null,"CHIHUAHUA","VIDV791004RJO","VIDV791004MCHLRR04","VIRGINIA VILLALBA DURAN","08DPT0011J",null,null,null,1,0,0,null,null,null,null,null,null,null,null,null,1,0,0,54682.53]
[null,"CHIHUAHUA","VIMS620916EH4","VIMS620916MCHLRN00","SANDRA HORTENSIA VILLALOBOS MARIN","08DPT0011J",null,null,null,1,0,0,null,null,null,null,null,null,null,null,null,1,0,0,102139.01]
[null,"CHIHUAHUA","VIYD670220UH2","VIYD670220MCHLXR09","DORA EMMA VILLALOBOS YAÑEZ","08DPT0011J",null,null,null,1,0,0,null,null,null,null,null,null,null,null,null,1,0,0,54604.380000000005]
[null,"CHIHUAHUA","AOAJ720609R46","AOAJ720609MCHCLS06","MARÍA DE JESÚS ACOSTA ÁLVAREZ","08DPT0011J",null,null,null,null,null,null,0,240,0,null,null,null,null,null,null,0,240,0,26383.41]
[null,"CHIHUAHUA","AOPA860917999","AOPA860917MCHCRG05","AGLAE BERENICE ACOSTA PORTILLO","08DPT0011J",null,null,null,null,null,null,0,156,0,null,null,null,null,null,null,0,156,0,17129.580000000002]
[null,"CHIHUAHUA","AORC6607129B3","AORC660712HCHCMS03","CÉSAR RENÉ ACOSTA ROMO","08DPT0011J",null,null,null,null,null,null,0,168,0,null,null,null,null,null,null,0,168,0,20756.68]
[null,"CHIHUAHUA","AUVX671108950","AUVX671108MCHGLC09","XOCHITL MARGARITA AGUILAR VILLALOBOS","08DPT0011J",null,null,null,null,null,null,0,240,0,null,null,null,null,null,null,0,240,0,33592.39]
[null,"CHIHUAHUA","AADF760822JB4","AADF760822MCHLML07","FLOR ANEL ALMANZA DOMÍNGUEZ","08DPT0011J",null,null,null,null,null,null,0,216,0,null,null,null,null,null,null,0,216,0,30688.549999999996]
[null,"CHIHUAHUA","AADF541004UL3","AADF541004HDGLMR07","FRANCISCO ALVARADO DOMÍNGUEZ","08DPT0011J",null,null,null,null,null,null,0,240,0,null,null,null,null,null,null,0,240,0,34222.620000000003]
[null,"CHIHUAHUA","AAGD820816HU2","AAGD820816MCHLTL09","DALYLA ALVARADO GUTIÉRREZ","08DPT0011J",null,null,null,null,null,null,0,240,0,null,null,null,null,null,null,0,240,0,34222.620000000003]
[null,"CHIHUAHUA","AASE930324BT6","AASE930324MCHLLD02","EDITH ALVAREZ SALAZAR","08DPT0011J",null,null,null,null,null,null,0,216,0,null,null,null,null,null,null,0,216,0,17457.45]
[null,"CHIHUAHUA","AAOG691105623","AAOG691105HCHLCS09","GASTÓN ÁLVAREZ OCHOA","08DPT0011J",null,null,null,null,null,null,0,216,0,null,null,null,null,null,null,0,216,0,30800.359999999993]
[null,"CHIHUAHUA","AIRL900105A19","AIRL900105HCHLSS09","JOSÉ LUIS ALVÍDREZ RÍOS","08DPT0011J",null,null,null,null,null,null,0,216,0,null,null,null,null,null,null,0,216,0,26782.21]
[null,"CHIHUAHUA","AALU670310HX2","AAXL670310HCHMXS16","LUIS CARLOS AMAYA X","08DPT0011J",null,null,null,null,null,null,0,240,0,null,null,null,null,null,null,0,240,0,34222.620000000003]
[null,"CHIHUAHUA","AAAM880501","AAAM880501MCHNCL02","MILDRET ARLETTE ANDRADE ACOSTA","08DPT0011J",null,null,null,null,null,null,0,216,0,null,null,null,null,null,null,0,216,0,23507.579999999998]
[null,"CHIHUAHUA","AIDJ6101296Q4","AIDJ610129HCHVLS09","JESÚS HUMBERTO ÁVILA DELGADO","08DPT0011J",null,null,null,null,null,null,0,240,0,null,null,null,null,null,null,0,240,0,34171.67]
[null,"CHIHUAHUA","AIQC690227LQ0","AIQC690227HCHVNS05","CESAR ROGACIANO ÁVILA QUINTANA","08DPT0011J",null,null,null,null,null,null,0,180,0,null,null,null,null,null,null,0,180,0,21384.430000000004]
[null,"CHIHUAHUA","BABR540126HB4","BABR540126HCHZDL02","RAÚL GABRIEL BAEZA BEDOY","08DPT0011J",null,null,null,null,null,null,0,240,0,null,null,null,null,null,null,0,240,0,32962.160000000003]
[null,"CHIHUAHUA","BAGA570401CF3","BAGA570401HCHRNN09","ANDRÉS BARBA GÁNDARA","08DPT0011J",null,null,null,null,null,null,0,0,240,null,null,null,null,null,null,0,0,240,39606.11]
[null,"CHIHUAHUA","BASZ650208NL8","BASZ650208MMCRTH02","ZHENIA PATRICIA BARRAZA STOELTING","08DPT0011J",null,null,null,null,null,null,0,180,0,null,null,null,null,null,null,0,180,0,27788.070000000007]
[null,"CHIHUAHUA","BEAG740617517","BEAG740617MSLJRB00","MARÍA GABIELA BEJARANO ARREDONDO","08DPT0011J",null,null,null,null,null,null,0,240,0,null,null,null,null,null,null,0,240,0,29652.39]
[null,"CHIHUAHUA","BEML730902B28","BEML730902HCHLRS07","JOSÉ LUIS BELTRÁN MÁRQUEZ","08DPT0011J",null,null,null,null,null,null,0,240,0,null,null,null,null,null,null,0,240,0,34222.620000000003]
[null,"CHIHUAHUA","BACJ820811R51","BACJ820811HCHLRN02","JUAN JOSÉ BLANCO CRUZ","08DPT0011J",null,null,null,null,null,null,0,120,0,null,null,null,null,null,null,0,120,0,16989.59]
[null,"CHIHUAHUA","BASH700602N82","BASH700602HCHLNR08","HERNÁN BLANCO SÁENZ","08DPT0011J",null,null,null,null,null,null,0,216,0,null,null,null,null,null,null,0,216,0,31166.419999999995]
[null,"CHIHUAHUA","CAHJ821204323","CAHJ821204HCHBRL07","JOEL ANTONIO CABALLERO HERNÁNDEZ","08DPT0011J",null,null,null,null,null,null,0,216,0,null,null,null,null,null,null,0,216,0,31166.419999999995]
[null,"CHIHUAHUA","CADL780717DQ0","CADL780717HCHMLS06","LUIS MANUEL CAMACHO DELGADO","08DPT0011J",null,null,null,null,null,null,0,240,0,null,null,null,null,null,null,0,240,0,29652.39]
[null,"CHIHUAHUA","CAML770621S57","CAML770621HCHRRS02","LUIS CARMONA MORA","08DPT0011J",null,null,null,null,null,null,0,120,0,null,null,null,null,null,null,0,120,0,17024.669999999998]
[null,"CHIHUAHUA","CAUC820727RA3","CAUC820727MCHRLN05","CINTHYA CARNERO ULLOA","08DPT0011J",null,null,null,null,null,null,0,240,0,null,null,null,null,null,null,0,240,0,29652.39]
[null,"CHIHUAHUA","CAEI831214746","CAEI831214MCHRSV05","IVETH SELENE CARO ESCUDERO","08DPT0011J",null,null,null,null,null,null,0,240,0,null,null,null,null,null,null,0,240,0,28868.81]
[null,"CHIHUAHUA","CAGS5611036P5","CAGS561103MCHRLL06","SILVIA CARRASCO GALVÁN","08DPT0011J",null,null,null,null,null,null,0,240,0,null,null,null,null,null,null,0,240,0,32962.160000000003]
[null,"CHIHUAHUA","CAVJ780821N37","CAVJ780821HCHZLS05","JESÚS MANUEL CAZARES VILLARREAL","08DPT0011J",null,null,null,null,null,null,0,240,0,null,null,null,null,null,null,0,240,0,29652.39]
[null,"CHIHUAHUA","CEPJ5209176A4","CEPJ520917MCLDXS03","MARÍA DE JESÚS CEDILLO PEÑA","08DPT0011J",null,null,null,null,null,null,0,180,0,null,null,null,null,null,null,0,180,0,26582.160000000003]
[null,"CHIHUAHUA","CACL6504048EA","CACL650404HCHHHS06","JOSÉ LUIS CHAVARRÍA CHÁVEZ","08DPT0011J",null,null,null,null,null,null,0,228,0,null,null,null,null,null,null,0,228,0,32694.55]
[null,"CHIHUAHUA","CALM790104KB2","CALM790104HCHHPN06","MANUEL ALBERTO CHAVIRA LÓPEZ","08DPT0011J",null,null,null,null,null,null,0,240,0,null,null,null,null,null,null,0,240,0,34222.620000000003]
[null,"CHIHUAHUA","CORI861010967","CORI861010HCHNVS07","ISAÚL CONTRERAS RIVERA","08DPT0011J",null,null,null,null,null,null,0,240,0,null,null,null,null,null,null,0,240,0,26383.41]
[null,"CHIHUAHUA","COVM710719995","COVM710719HCHRLR08","MARCO ANTONIO CORONADO VILLARREAL","08DPT0011J",null,null,null,null,null,null,0,240,0,null,null,null,null,null,null,0,240,0,32707.41]
[null,"CHIHUAHUA","DIVM670828475","DIVM670828HCHZQN04","MANUEL DÍAZ VAQUERA","08DPT0011J",null,null,null,null,null,null,0,180,0,null,null,null,null,null,null,0,180,0,25601.350000000002]
[null,"CHIHUAHUA","EICP660518T31","EICP660518MCHSRT02","PATRICIA EISSA CARRILLO","08DPT0011J",null,null,null,null,null,null,0,180,0,null,null,null,null,null,null,0,180,0,25667.000000000004]
[null,"CHIHUAHUA","EIAL6904095Y1","EIAL690409MCHSLR06","LORENA MARGARITA ESPINOZA ALCALÁ","08DPT0011J",null,null,null,null,null,null,0,240,0,null,null,null,null,null,null,0,240,0,34222.620000000003]
[null,"CHIHUAHUA","FOSJ7411047Y2","FOSJ741104HCHLLV00","JAVIER ARTURO FLORES SALAS","08DPT0011J",null,null,null,null,null,null,0,180,0,null,null,null,null,null,null,0,180,0,26139.670000000002]
[null,"CHIHUAHUA","GAGJ711007916","GAGJ711007HCHBRL03","JULIÁN GABIRA DE LA GARZA","08DPT0011J",null,null,null,null,null,null,0,228,0,null,null,null,null,null,null,0,228,0,32511.52]
[null,"CHIHUAHUA","GALP860519RL8","GALP860519MCHRCR06","PERLA LILIANA GARCÍA LUCERO","08DPT0011J",null,null,null,null,null,null,0,240,0,null,null,null,null,null,null,0,240,0,29431.67]
[null,"CHIHUAHUA","GAMJ7901211A8","GAMJ790121HCHRDS09","JESÚS ANTONIO GARCÍA MEDINA","08DPT0011J",null,null,null,null,null,null,0,108,0,null,null,null,null,null,null,0,108,0,13298.089999999998]
[null,"CHIHUAHUA","GOCC7107156X6","GOCC710715MCHNHR03","CARMEN GUADALUPE GONZÁLEZ CHACÓN","08DPT0011J",null,null,null,null,null,null,0,216,0,null,null,null,null,null,null,0,216,0,31192.679999999993]
[null,"CHIHUAHUA","GOGJ721103UI4","GOGJ721103HCHNRL03","JULIO CESAR GONZÁLEZ GRANADOS","08DPT0011J",null,null,null,null,null,null,0,240,0,null,null,null,null,null,null,0,240,0,34049.339999999997]
[null,"CHIHUAHUA","GOPS631119234","GOPS631119HCHNZX06","SIXTO HUMBERTO GONZÁLEZ PÁEZ","08DPT0011J",null,null,null,null,null,null,0,240,0,null,null,null,null,null,null,0,240,0,34222.620000000003]
[null,"CHIHUAHUA","GUTM700125H14","GUTM700125MCHRRR03","MARGARITA GUARDADO TORRES","08DPT0011J",null,null,null,null,null,null,0,240,0,null,null,null,null,null,null,0,240,0,34222.620000000003]
[null,"CHIHUAHUA","GUGL640702V28","GUGL640702HCHTRS02","LUIS ROGELIO GUTIÉRREZ GARCÍA","08DPT0011J",null,null,null,null,null,null,0,240,0,null,null,null,null,null,null,0,240,0,33434.83]
[null,"CHIHUAHUA","HECM730118619","HECM730118HCHRDR06","MAURICIO HERNÁNDEZ CAUDILLO","08DPT0011J",null,null,null,null,null,null,0,48,0,null,null,null,null,null,null,0,48,0,6984.2400000000007]
[null,"CHIHUAHUA","HEOD870714Q19","HEOD870714MCLRLN06","DIANA HERNÁNDEZ OLIVARES","08DPT0011J",null,null,null,null,null,null,0,240,0,null,null,null,null,null,null,0,240,0,32610.239999999998]
[null,"CHIHUAHUA","HETC8302175X4","HETC830217MCHRRN07","CINTHIA LIZETH HERNÁNDEZ TREVIÑO","08DPT0011J",null,null,null,null,null,null,0,240,0,null,null,null,null,null,null,0,240,0,33907.5]
[null,"CHIHUAHUA","HEDM761211T33","HEDM761211MCHRZY08","MAYRA GUADALUPE HERRERA DÍAZ","08DPT0011J",null,null,null,null,null,null,0,180,0,null,null,null,null,null,null,0,180,0,26294.870000000003]
[null,"CHIHUAHUA","JASX660321NQ4","JASX660321HZSYTM15","XAMIR JAYDAR SOTO","08DPT0011J",null,null,null,null,null,null,0,240,0,null,null,null,null,null,null,0,240,0,34049.339999999997]
[null,"CHIHUAHUA","JILS7804098R3","JILS780409HCHMZR04","SERGIO ARMANDO JIMÉNEZ LOZANO","08DPT0011J",null,null,null,null,null,null,0,192,0,null,null,null,null,null,null,0,192,0,29652.39]
[null,"CHIHUAHUA","JISR460111595","JISR460111HBCMLY00","REYNALDO JIMÉNEZ SOLÍS","08DPT0011J",null,null,null,null,null,null,0,240,0,null,null,null,null,null,null,0,240,0,28110.230000000003]
[null,"CHIHUAHUA","LEGI810812S76","LEGI810812HCHYNR04","IRVING LEYVA GONZÁLEZ","08DPT0011J",null,null,null,null,null,null,0,240,0,null,null,null,null,null,null,0,240,0,34222.620000000003]
[null,"CHIHUAHUA","LOGE770513D53","LOGE770513MCHPLL01","ELENA DEL ROSARIO LÓPEZ GALAVIZ","08DPT0011J",null,null,null,null,null,null,0,240,0,null,null,null,null,null,null,0,240,0,33854.979999999996]
[null,"CHIHUAHUA","LUCL830421CC7","LUCL830421HCHVNS03","LUIS FERNANDO LUÉVANO CONTRERAS","08DPT0011J",null,null,null,null,null,null,0,240,0,null,null,null,null,null,null,0,240,0,29430.29]
[null,"CHIHUAHUA","LURI7603163W9","LURI760316MCHJDR01","IRMA EMILLIA LUJAN RODRÍGUEZ","08DPT0011J",null,null,null,null,null,null,0,228,0,null,null,null,null,null,null,0,228,0,24955.919999999998]
[null,"CHIHUAHUA","MEFJ6010186V1","MEFJ601018HCHNNS07","JESÚS ALBERTO MENCHACA FUENTES","08DPT0011J",null,null,null,null,null,null,0,216,0,null,null,null,null,null,null,0,216,0,30993.139999999992]
[null,"CHIHUAHUA","MEEJ750705D34","MEEJ750705HCHNSS02","JESÚS MENDOZA ESTEVANÉ","08DPT0011J",null,null,null,null,null,null,0,240,0,null,null,null,null,null,null,0,240,0,33907.5]
[null,"CHIHUAHUA","MOVI660317J46","MOXV660317HCHLXC08","VÍCTOR MANUEL MOLINAR X","08DPT0011J",null,null,null,null,null,null,0,240,0,null,null,null,null,null,null,0,240,0,29528.48]
[null,"CHIHUAHUA","MORR640403339","MORR640403MCHNDS08","ROSARIO FLORENTINA MONTOYA RODRÍGUEZ","08DPT0011J",null,null,null,null,null,null,0,240,0,null,null,null,null,null,null,0,240,0,34049.339999999997]
[null,"CHIHUAHUA","MOEC8307215B7","MOEC830721HCHRSR06","CARLOS DANIEL MORALES ESPINOZA","08DPT0011J",null,null,null,null,null,null,0,240,0,null,null,null,null,null,null,0,240,0,34049.339999999997]
[null,"CHIHUAHUA","MOSV610329FQ0","MOSV610329HCHRTC06","VÍCTOR MORENO SOTO","08DPT0011J",null,null,null,null,null,null,0,240,0,null,null,null,null,null,null,0,240,0,34222.620000000003]
[null,"CHIHUAHUA","MOOL690713831","MOOL690713MCHRSR07","LAURA MAGDALENA MORONES OSUNA","08DPT0011J",null,null,null,null,null,null,0,240,0,null,null,null,null,null,null,0,240,0,34222.620000000003]
[null,"CHIHUAHUA","MORC720201UY4","MORC720201MCHRDL09","CLAUDIA MORONES RODRÍGUEZ","08DPT0011J",null,null,null,null,null,null,0,240,0,null,null,null,null,null,null,0,240,0,34222.620000000003]
[null,"CHIHUAHUA","MUNL690829H48","MUNL690829MCHXTZ04","LUZ EMILIA MUÑOZ NATIVIDAD","08DPT0011J",null,null,null,null,null,null,0,180,0,null,null,null,null,null,null,0,180,0,26582.160000000003]
[null,"CHIHUAHUA","NADJ630505N67","NADJ630505HCHVLN05","JUAN NAVA DELGADO","08DPT0011J",null,null,null,null,null,null,0,240,0,null,null,null,null,null,null,0,240,0,34222.620000000003]
[null,"CHIHUAHUA","NAML740428B29","NAML740428MCHVRR05","LORENA IVONNE NAVA MORALES","08DPT0011J",null,null,null,null,null,null,0,240,0,null,null,null,null,null,null,0,240,0,34222.620000000003]
[null,"CHIHUAHUA","NUGA831209HF9","NUGA831209HSLVZR04","ARTURO GUADALUPE NUEVO GUZMAN","08DPT0011J",null,null,null,null,null,null,0,228,0,null,null,null,null,null,null,0,228,0,24955.919999999998]
[null,"CHIHUAHUA","OOMJ61083051A","OOMJ610830MCHCDN00","JUANA ROSA OCHOA MADRID","08DPT0011J",null,null,null,null,null,null,0,240,0,null,null,null,null,null,null,0,240,0,34222.620000000003]
[null,"CHIHUAHUA","OOGI7603109Y9","OOGI760310HDGRNS08","ISIDRO OROZCO GONZÁLEZ","08DPT0011J",null,null,null,null,null,null,0,240,0,null,null,null,null,null,null,0,240,0,34209.49]
[null,"CHIHUAHUA","OORA820321M63","OORA820321MCHRNY08","AYDE OROZCO RENOVA","08DPT0011J",null,null,null,null,null,null,0,240,0,null,null,null,null,null,null,0,240,0,33524.020000000004]
[null,"CHIHUAHUA","PAMC840828GP8","PAMC840828MCHCRR08","CRISTINA PACHECO MÁRQUEZ","08DPT0011J",null,null,null,null,null,null,0,192,0,null,null,null,null,null,null,0,192,0,26206.400000000001]
[null,"CHIHUAHUA","PAPA6106238L4","PAPA610623HCHLXN04","ANTONIO PALACIO PIÑA","08DPT0011J",null,null,null,null,null,null,0,240,0,null,null,null,null,null,null,0,240,0,34222.620000000003]
[null,"CHIHUAHUA","PEHJ6802298H5","PEHJ680229HCHRRN03","JUAN JOSÉ PÉREZ HERNÁNDEZ","08DPT0011J",null,null,null,null,null,null,0,120,0,null,null,null,null,null,null,0,120,0,18941.64]
[null,"CHIHUAHUA","PERM720917SD7","PERM720917MCHRMR06","MARGARITA PÉREZ RAMÍREZ","08DPT0011J",null,null,null,null,null,null,0,120,0,null,null,null,null,null,null,0,120,0,18678.93]
[null,"CHIHUAHUA","PADM510809525","PADM510809HNTLZG08","MIGUEL ÁNGEL PLASCENCIA DÍAZ","08DPT0011J",null,null,null,null,null,null,0,240,0,null,null,null,null,null,null,0,240,0,34222.620000000003]
[null,"CHIHUAHUA","POSR7405169RO","POSR740516HCHRNB07","JOSÉ ROBERTO PORTILLO SÁENZ","08DPT0011J",null,null,null,null,null,null,0,216,0,null,null,null,null,null,null,0,216,0,30723.929999999993]
[null,"CHIHUAHUA","QUCC800518RJ7","QUCC800518MCHZML03","CLAUDIA ROCÍO QUEZADA CAMPOYA","08DPT0011J",null,null,null,null,null,null,0,180,0,null,null,null,null,null,null,0,180,0,25951.93]
[null,"CHIHUAHUA","QUME830808SH6","QUME830808HCHXRR06","ERIC QUIÑONES MARIÑELARENA","08DPT0011J",null,null,null,null,null,null,0,228,0,null,null,null,null,null,null,0,228,0,32694.55]
[null,"CHIHUAHUA","RARR491119L95","RARR491119HPLMVB06","ROBERTO PONCIANO RAMÍREZ RIVERA","08DPT0011J",null,null,null,null,null,null,0,228,0,null,null,null,null,null,null,0,228,0,32707.68]
[null,"CHIHUAHUA","RAHA780618377","RAHA780618HCHMRD01","ADARIK QUILEO RAMOS HERRERA","08DPT0011J",null,null,null,null,null,null,0,216,0,null,null,null,null,null,null,0,216,0,31192.679999999993]
[null,"CHIHUAHUA","RARL740713SN9","RARL740713MCHSYR08","LOURDES GABRIELA RASCÓN REYES","08DPT0011J",null,null,null,null,null,null,0,240,0,null,null,null,null,null,null,0,240,0,34156.97]
[null,"CHIHUAHUA","REGJ630501KR7","REGJ630501HDFNRN07","JUAN CARLOS RENDÓN GARCÍA","08DPT0011J",null,null,null,null,null,null,0,216,0,null,null,null,null,null,null,0,216,0,30833.679999999993]
[null,"CHIHUAHUA","RILA820506DD4","RILA820506HCHVCN08","ÁNGEL ARMANDO RIVERA LECHUGA","08DPT0011J",null,null,null,null,null,null,0,216,0,null,null,null,null,null,null,0,216,0,25774.41]
[null,"CHIHUAHUA","ROVW790131VE9","ROVW790131HCHJLL05","WILFREDO ROJO VELÁZQUEZ","08DPT0011J",null,null,null,null,null,null,0,240,0,null,null,null,null,null,null,0,240,0,34049.339999999997]
[null,"CHIHUAHUA","ROHE830406P40","ROHE830406MCHMRL03","ELSA SAMANTHA ROMERO HERRERA","08DPT0011J",null,null,null,null,null,null,0,156,0,null,null,null,null,null,null,0,156,0,17605.300000000003]
[null,"CHIHUAHUA","RUHJ7401277YA","RUHJ740127HCHZRR00","JORGE ARTURO RUIZ HEIRAS","08DPT0011J",null,null,null,null,null,null,0,240,0,null,null,null,null,null,null,0,240,0,34222.620000000003]
[null,"CHIHUAHUA","RUBJ910211L87","RUBJ910211HCHZCS01","RUIZ ESPARZA BACASEHUA JOSÉ","08DPT0011J",null,null,null,null,null,null,0,204,0,null,null,null,null,null,null,0,204,0,16639.54]
[null,"CHIHUAHUA","RUCJ590315LP9","RUCJ590315HZSZMS00","JOSÉ RUIZ ESPARZA CAMARENA","08DPT0011J",null,null,null,null,null,null,0,120,0,null,null,null,null,null,null,0,120,0,15046.92]
[null,"CHIHUAHUA","SARC670203156","SARC670203MDGLZR00","MARIA DEL CARMEN SALAS RUIZ","08DPT0011J",null,null,null,null,null,null,0,156,0,null,null,null,null,null,null,0,156,0,23578.48]
[null,"CHIHUAHUA","SACD640228KY5","SACD640228HCHLNN03","DANIEL JAVIER SALAZAR CONTRERAS","08DPT0011J",null,null,null,null,null,null,0,180,0,null,null,null,null,null,null,0,180,0,26884.13]
[null,"CHIHUAHUA","SASL611115CC2","SASL611115HCHMPP00","LEOPOLDO SAMANIEGO SEPÚLVEDA","08DPT0011J",null,null,null,null,null,null,0,240,0,null,null,null,null,null,null,0,240,0,34095.24]
[null,"CHIHUAHUA","SAPJ770502I20","SAPJ770502HCHNRV00","JAVIER SÁNCHEZ PÉREZ","08DPT0011J",null,null,null,null,null,null,0,168,0,null,null,null,null,null,null,0,168,0,23538.819999999996]
[null,"CHIHUAHUA","SEVK920127JG4","SEVK920127MCHGLR02","KAREN JEMIMA SEGOVIA VILLALOBOS","08DPT0011J",null,null,null,null,null,null,0,240,0,null,null,null,null,null,null,0,240,0,29528.48]
[null,"CHIHUAHUA","TORR510819H11","TORR510819HDFLSL04","RAÚL ALBERTO TOLEDO ROSILLO","08DPT0011J",null,null,null,null,null,null,0,240,0,null,null,null,null,null,null,0,240,0,35636.660000000003]
[null,"CHIHUAHUA","TOMG6805124B0","TOMG680512MCHRRB05","GABRIELA TORRES MORENO","08DPT0011J",null,null,null,null,null,null,0,168,0,null,null,null,null,null,null,0,168,0,23137.859999999997]
[null,"CHIHUAHUA","TOPD7211138C2","TOPD721113MCHRRL03","DELIA ARMIDA TORRES PORTILLO","08DPT0011J",null,null,null,null,null,null,0,240,0,null,null,null,null,null,null,0,240,0,34222.620000000003]
[null,"CHIHUAHUA","TORJ640811CX6","TORJ640811HCHVVS02","JOSÉ TOVAR RIVERO","08DPT0011J",null,null,null,null,null,null,0,228,0,null,null,null,null,null,null,0,228,0,32511.52]
[null,"CHIHUAHUA","UUIL8212152F2","UUIL821215HCHRBS02","LUIS ALBERTO URQUIDI IBARBOL","08DPT0011J",null,null,null,null,null,null,0,240,0,null,null,null,null,null,null,0,240,0,29261.03]
[null,"CHIHUAHUA","VAPD660401U61","VAPD660401HCHLRN00","DANIEL VALADEZ PORTILLO","08DPT0011J",null,null,null,null,null,null,0,240,0,null,null,null,null,null,null,0,240,0,34049.339999999997]
[null,"CHIHUAHUA","VAGB5901245Z9","VAGB590124MCHLNL07","VALDERRABANO GONZÁLEZ BLANCA ESTELA ","08DPT0011J",null,null,null,null,null,null,0,216,0,null,null,null,null,null,null,0,216,0,30800.359999999993]
[null,"CHIHUAHUA","VAHJ690910EY0","VAHJ690910HCHLRM02","JAIME VALENZUELA HERNÁNDEZ","08DPT0011J",null,null,null,null,null,null,0,240,0,null,null,null,null,null,null,0,240,0,34222.620000000003]
[null,"CHIHUAHUA","VAGJ670203PVA","VAGJ670203HCLLVS03","JOSÉ VALLEJO GUEVARA","08DPT0011J",null,null,null,null,null,null,0,228,0,null,null,null,null,null,null,0,228,0,28015.279999999999]
[null,"CHIHUAHUA","VEDL620727PL3","VEDL620727MCHGRR05","LORETO VEGA DURAN","08DPT0011J",null,null,null,null,null,null,0,240,0,null,null,null,null,null,null,0,240,0,34222.620000000003]
[null,"CHIHUAHUA","VEMA551027JGA","VEMA551027HCHGRR06","ARIEL VEGA MIRANDA","08DPT0011J",null,null,null,null,null,null,0,204,0,null,null,null,null,null,null,0,204,0,29151.539999999997]
[null,"CHIHUAHUA","VIPT690222Q18","VIPT690222MCHLXR04","MARIA TERESA VILLARREAL PIÑÓN","08DPT0011J",null,null,null,null,null,null,0,240,0,null,null,null,null,null,null,0,240,0,33907.5]
[null,"CHIHUAHUA","LIAL810304JK3","LIAL810304MCHCRL00","LILIANA LICON ARAGONEZ","00XXX0000X",null,null,null,null,null,null,null,null,null,null,null,null,1,0,0,1,0,0,127345.83]
[null,"CHIHUAHUA","CATC7205274V8","CATC720527HCHNRR09","CARLOS CANO TORRES","00XXX0000X",null,null,null,1,0,0,null,null,null,null,null,null,null,null,null,1,0,0,118152.38]
[null,"CHIHUAHUA","EATH590728P67","EATH590728HCHSRG00","HUGO ESNAYRA TRISTAN","00XXX0000X",null,null,null,null,null,null,null,null,null,null,null,null,1,0,0,1,0,0,84502.13]
[null,"CHIHUAHUA","GOMD671113QD6","GOMD671113HCHMRG03","DIEGO RAUL GOMEZ MARTINEZ","00XXX0000X",null,null,null,1,0,0,null,null,null,null,null,null,null,null,null,1,0,0,117904.54]
[null,"CHIHUAHUA","MONL710121CT7","MONL710121MSLGVR08","LORENA INES MOGUEL NOVELO","00XXX0000X",null,null,null,null,null,null,null,null,null,null,null,null,1,0,0,1,0,0,84502.13]
[null,"CHIHUAHUA","MOHB751008K98","MOHB751008MMNNRL03","BLANCA ESTELA MONTAÑEZ HERNANDEZ","00XXX0000X",null,null,null,1,0,0,null,null,null,null,null,null,null,null,null,1,0,0,99523.5]
[null,"CHIHUAHUA","PALU750621U84","PAXL750621HCHLXS05","LUIS ENRIQUE PALACIOS","00XXX0000X",null,null,null,1,0,0,null,null,null,null,null,null,null,null,null,1,0,0,109994.8]
[null,"CHIHUAHUA","PELV7211011F2","PELV721101MCHRYR06","VERONICA PERALES LEYVA","00XXX0000X",null,null,null,null,null,null,null,null,null,null,null,null,1,0,0,1,0,0,10338.25]
[null,"CHIHUAHUA","QUEG630216GA8","QUEG630216MCHXSR02","GRACIELA QUIÑONEZ ESTRADA","00XXX0000X",null,null,null,null,null,null,null,null,null,null,null,null,1,0,0,1,0,0,58530.83]
[null,"CHIHUAHUA","SAWV80120227A","SAWV801202MCLNLV05","VIVIANA SANCHEZ WILLIAMS","00XXX0000X",null,null,null,null,null,null,null,null,null,null,null,null,1,0,0,1,0,0,84502.13]
[null,"CHIHUAHUA","VARM7910137D6","VARM791013MCHLMR03","MARISOL VALLES RAMOS","00XXX0000X",null,null,null,1,0,0,null,null,null,null,null,null,null,null,null,1,0,0,104051.21]
[null,"CHIHUAHUA","AOCF590913PU5","AOCF590913HCHCNL08","FLAVIO FILOMENO ACOSTA CANO DE LOS RIOS","00XXX0000X",null,null,null,null,null,null,null,null,null,null,null,null,1,0,0,1,0,0,305035.04000000004]
[null,"CHIHUAHUA","AAGE900717365","AAGE900717MCHZZL09","ELIZABETH AZAETA GUZMAN","00XXX0000X",null,null,null,1,0,0,null,null,null,null,null,null,null,null,null,1,0,0,46387.659999999996]
[null,"CHIHUAHUA","CAMH8103197WA","CAMH810319HCHRRG06","HUGO ALBERTO CARMONA MORA","00XXX0000X",null,null,null,null,null,null,null,null,null,null,null,null,1,0,0,1,0,0,95755.799999999988]
[null,"CHIHUAHUA","DEMS680803PI5","DEMS680803MCHLXN06","SANDRA DELGADO MUÑOZ","00XXX0000X",null,null,null,1,0,0,null,null,null,null,null,null,null,null,null,1,0,0,110460.47]
[null,"CHIHUAHUA","DUCD810810J24","DUCD810810MCHRRN06","DANISSA DURAN CARO","00XXX0000X",null,null,null,1,0,0,null,null,null,null,null,null,null,null,null,1,0,0,121504.9]
[null,"CHIHUAHUA","GACS670112I53","GACS670112MCHRHN02","SANDRA MARGARITA GARCIA CHAVEZ","00XXX0000X",null,null,null,1,0,0,null,null,null,null,null,null,null,null,null,1,0,0,145697.20000000001]
[null,"CHIHUAHUA","GARG760607HY8","GARG760607HCHSMS07","GUSTAVO ALONSO GASCA RAMIREZ ","00XXX0000X",null,null,null,null,null,null,null,null,null,null,null,null,1,0,0,1,0,0,95518.64999999998]
[null,"CHIHUAHUA","LAAC860420JE7","LAAC860420MCHBPL04","CLAUDIA PATRICIA LABRADO APARICIO","00XXX0000X",null,null,null,1,0,0,null,null,null,null,null,null,null,null,null,1,0,0,76752.53]
[null,"CHIHUAHUA","MOSF7009259L5","MOSF700925HCHRTR02","FERNANDO ALBERTO MORA SOTO","00XXX0000X",null,null,null,1,0,0,null,null,null,null,null,null,null,null,null,1,0,0,151955.59]
[null,"CHIHUAHUA","PAMA800623I22","PAMA800623MDGDRL02","PADILLA MARQUEZ ALICIA","00XXX0000X",null,null,null,1,0,0,null,null,null,null,null,null,null,null,null,1,0,0,87321.81]
[null,"CHIHUAHUA","PEGC7811144HZ3","PEGC781114HCHRRS06","CESAR VALENTE PEREA GARCIA ","00XXX0000X",null,null,null,1,0,0,null,null,null,null,null,null,null,null,null,1,0,0,45573.950000000004]
[null,"CHIHUAHUA","RAMJ770419E96","RAMJ770419HSPMRS01","JESUS ALFONSO RAMIREZ MARRUFO","00XXX0000X",null,null,null,1,0,0,null,null,null,null,null,null,null,null,null,1,0,0,93844.65]
[null,"CHIHUAHUA","RAPE620309J41","RAPE620309HCHYRN08","ENRIQUE RAY PORTILLO","00XXX0000X",null,null,null,null,null,null,null,null,null,null,null,null,1,0,0,1,0,0,95492.069999999992]
[null,"CHIHUAHUA","ROMF8411116Z4","ROMF841111MCHJXR01","FARINA ROJAS MUÑOZ","00XXX0000X",null,null,null,1,0,0,null,null,null,null,null,null,null,null,null,"1",0,0,25325.1]
[null,"CHIHUAHUA","SACP740829IP4","SACP740829MCHLNL05","PILAR ALICIA SALAZAR CONTRERAS","00XXX0000X",null,null,null,1,0,0,null,null,null,null,null,null,null,null,null,1,0,0,62200.920000000006]
[null,"CHIHUAHUA","SIRS640927FF8","SIRS640927MCHLDL09","SILVIA SILVA RODRIGUEZ ","00XXX0000X",null,null,null,1,0,0,null,null,null,null,null,null,null,null,null,1,0,0,162780.38999999998]
[null,"CHIHUAHUA","VARS761230AZ5","VARS761230MCHLML03","VALENZUELA RAMIREZ SILVIA CAROLINA","00XXX0000X",null,null,null,1,0,0,null,null,null,null,null,null,null,null,null,1,0,0,62760.37000000001]
[null,"CHIHUAHUA","VAGP6007013D4","VAGP600701MCHLNT09","PATRICIA RAQUEL VALVERDE GONZALEZ","00XXX0000X",null,null,null,1,0,0,null,null,null,null,null,null,null,null,null,1,0,0,142738.92000000001]
[null,"Total Personas : ",753,null,null,null,null,null,null,null,null,null,null,null,null,null,null,null,null,null,null,"Total Recursos Ejercidos:",null,null,{"$f":"SUBTOTAL(109,Tabla11[Columna24])","v":37140120.173822962}]
[]
[null,"Fuente : Información proporcionada por las Entidades Federativas."]

{"sheet":"II C y 1_","index":6,"n_rows":774,"n_cols":22,"rows_kept":774,"cut":false,"hidden":false,"merged":[[8,1,8,8],[768,18,768,19],[11,21,12,21],[11,8,12,8],[11,9,11,15],[11,16,12,16],[11,17,12,17],[11,20,12,20],[11,18,11,19],[11,2,12,2],[11,1,12,1],[11,7,12,7],[11,6,12,6],[11,5,12,5],[11,4,12,4],[11,3,12,3]]}
[]
[]
[]
[]
[]
[]
[]
[null,"Formato: Personal Federalizado por Registro Federal de Contribuyentes"]
[null,{"$f":"IF('1'!D22=\"Elige el Periodo…\",\"\",'1'!D22)","v":"Fondo de Aportaciones para la Educación Tecnológica y de Adultos/Colegio Nacional de Educación Profesional Técnica (FAETA/CONALEP)"},null,null,null,null,null,null,null,null,null,null,null,null,null,null,null,null,null,null,"4to. Trimestre 2017"]
[]
[]
[null,"Entidad Federativa","Clave CT","Turno","RFC","CURP","Nombre","Funcion Real","Horas que labora en el Centro de Trabajo","Clave Presupuestal",null,null,null,null,null,null,"Tipo de Categoría","Identificador de Contrato de Honorarios","Periodo de efecto de pago en el trimestre",null,"Percepciones pagadas en el Periodo de Comisión con Presupuesto Federal*","Percepciones pagadas en el Periodo de Comisión con Presupuesto de otra fuente*"]
[null,null,null,null,null,null,null,null,null,"Partida Presupuestal","Código de Pago","Clave de Unidad","Clave de Sub Unidad","Clave de Categoría","Horas Semana Mes ","Número de Plaza",null,null,"Inicial","Termino"]
[]
[null,"Columna1","Columna2","Columna3","Columna4","Columna5","Columna6","Columna7","Columna8","Columna9","Columna10","Columna11","Columna12","Columna13","Columna14","Columna15","Columna16","Columna17","Columna18","Columna19","Columna20","Columna21"]
[null,"CHIHUAHUA","08DPT0001C",120,"AOML571117Q19","AOML571117MCHCRZ09","LUZ DEL CARMEN ACOSTA MARTINEZ","20212",480,83101,1003,"00",25,"CF33202",0,2367,2,null,20171001,20171231,64177.41,0]
[null,"CHIHUAHUA","08DPT0001C",120,"AEEF700614J96","AEEF700614HCHLNR00","JOSE FRANCISCO ALDERETE ENRIQUEZ","20108",480,83101,1003,"00",25,"CF33206",0,13641,2,null,20171001,20171231,151109.78,0]
[null,"CHIHUAHUA","08DPT0001C",120,"BAPF541102CN1","BAPF541102HCHCRR00","FRANCISCO ALBERTO BACA PEREZ","20212",480,83101,1003,"00",25,"CF34201",0,2376,2,null,20171001,20171231,59532.7,0]
[null,"CHIHUAHUA","08DPT0001C",120,"DIAM641007C15","DIAM641007HCHZCN00","MANUEL DIAZ ACOSTA","20402",480,83101,1003,"00",25,"CF18201",0,2389,2,null,20171001,20171231,44594.19,0]
[null,"CHIHUAHUA","08DPT0001C",120,"EIDM611216HY9","EIDM611216MCHSMY09","MYRNA LETICIA ESPINOZA DOMINGUEZ","20305",480,83101,1003,"00",25,"CF18203",0,2397,2,null,20171001,20171231,75512.75,0]
[null,"CHIHUAHUA","08DPT0001C",120,"FEPH590719P2A","FEPH590719MCHRRR08","HORTENSIA FERNANDEZ PARGA","20401",480,83101,1003,"00",25,"S01202",0,2401,2,null,20171001,20171231,45260.41,0]
[null,"CHIHUAHUA","08DPT0001C",120,"GADE730513AY2","GADE730513HCHRZL06","ELIAS GARCIA DIAZ","20401",480,83101,1003,"00",25,"S01201",0,10161,2,null,20171001,20171231,53025.85,0]
[null,"CHIHUAHUA","08DPT0001C",120,"GAVL610223PM1","GAVL610223MGTRLN08","LEONOR GARZON VALDEZ","50401",480,83101,1003,"00",25,"CF02103",0,12557,2,null,20171001,20171231,107549.64,0]
[null,"CHIHUAHUA","08DPT0001C",120,"GOBS630722GU7","GOBS630720MCHNLL02","SILVIA CECILIA GONZALEZ BALDERRAMA","20401",480,83101,1003,"00",25,"S01201",0,2378,2,null,20171001,20171231,37809.870000000003,0]
[null,"CHIHUAHUA","08DPT0001C",120,"GUSL800307M72","GUSL800307MCHTNL01","LILIANA GUTIERREZ SANDOVAL","20401",480,83101,1003,"00",25,"S01201",0,2391,2,null,20171001,20171231,42169.82,0]
[null,"CHIHUAHUA","08DPT0001C",200,"HEFA581028JT6","HEFA581028HSRRLR03","ARISTEO HERNANDEZ FLORES","20401",480,83101,1003,"00",25,"S01201",0,2398,2,null,20171001,20171231,37899.980000000003,0]
[null,"CHIHUAHUA","08DPT0001C",120,"HEMM670602FX4","HEMM670602HCHRRL08","MELCHOR HERNANDEZ MORALES",20108,480,83101,1003,"00",25,"CF33206",0,13189,2,null,20171001,20171231,152224.31,0]
[null,"CHIHUAHUA","08DPT0001C",200,"JUVD951202BR4","JUVD951202HCHRLN06","DANIEL FRANCISCO JUAREZ VILLALOBOS","20402",480,83101,1003,"00",25,"CF18201",0,11868,2,null,20171001,20171231,37790.18,0]
[null,"CHIHUAHUA","08DPT0001C",120,"LOCS740722BY1","LOCS740722MCHYSN03","SANDRA LOYA CASTAÑEDA","20215",480,83101,1003,"00",25,"CF04201",0,5255,2,null,20171001,20171231,59836.53,0]
[null,"CHIHUAHUA","08DPT0001C",120,"LOLG6105041CI","LOLG610504HCHZPR03","GERARDO LOZANO LOPEZ","20216",480,83101,1003,"00",25,"CF34202",0,2415,2,null,20171001,20171231,52546.69,0]
[null,"CHIHUAHUA","08DPT0001C",120,"MASS920625T67","MASS920625MCHNTT05","STEPHANIE MANCHA SOTO",20401,480,83101,1003,"00",25,"S01201",0,7502,2,null,20171001,20171231,40173.01,0]
[null,"CHIHUAHUA","08DPT0001C",120,"MACN5607036J8","MACN560703MCHRHR01","NORMA MARGARITA MARRUFO CHAPARRO","20105",480,83101,1003,"00",25,"CF33206",0,13187,2,null,20171001,20171231,143443.60999999999,0]
[null,"CHIHUAHUA","08DPT0001C",120,"MERA640505HY3","MERA640505HCHNYR01","ARMANDO MENDEZ REYES",20401,480,83101,1003,"00",25,"CF34202",0,2389,2,null,20171001,20171231,23058.87,0]
[null,"CHIHUAHUA","08DPT0001C",120,"MOAP8701294I4","MOAP870129MCHLCT09","PATRICIA ARALI MOLINA ACOSTA","20401",480,83101,1003,"00",25,"CF33204",0,2392,2,null,20171001,20171231,78659.62,0]
[null,"CHIHUAHUA","08DPT0001C",120,"MOTJ521007RU5","MOTJ521007HCHRRS02","JESUS ALBERTO MORENO TORRES","20215",480,83101,1003,"00",25,"A03202",0,2373,2,null,20171001,20171231,57180.31,0]
[null,"CHIHUAHUA","08DPT0001C",120,"NASP6305126A9","NASP630512HCHJLD06","PEDRO GERARDO NAJERA SILVA","20105",480,83101,1003,"00",25,"CF33206",0,2385,2,null,20171001,20171231,144068.37,0]
[null,"CHIHUAHUA","08DPT0001C",200,"NAOG680625QA5","NAOG680625HCHRRL00","GUILLERMO NICOLAS NARVAEZ ORDAZ","20212",480,83101,1003,"00",25,"T08201",0,10784,2,null,20171001,20171231,58679.78,0]
[null,"CHIHUAHUA","08DPT0001C",120,"NAWA860622JI6","NAWA860622HCHVGL05","ALEJANDRO MAURICIO NAVARRO WAGNER","20105",480,83101,1003,"00",25,"CF02105",0,12821,2,null,20171001,20171231,84502.13,0]
[null,"CHIHUAHUA","08DPT0001C",120,"PEZR580319EY1","PEZR580319MCLRVS09","ROSA MARIA PEREZ ZUBIA","20401",480,83101,1003,"00",25,"S01201",0,2410,2,null,20171001,20171231,47267.57,0]
[null,"CHIHUAHUA","08DPT0001C",200,"PIRE860510KC2","PIRE860510HCHZBS00","PIZANO RUBIO ESTALI",20401,320,83101,1003,"00",25,"S01201",0,7502,2,null,20171101,20171231,14928.64,0]
[null,"CHIHUAHUA","08DPT0001C",200,"PODM630929V60","PODM630929HCHRZG02","MIGUEL PORTILLO DIAZ","20104",480,83101,1003,"00",25,"CF33204",0,2405,2,null,20171001,20171231,49438.79,0]
[null,"CHIHUAHUA","08DPT0001C",120,"RAGN6608306N3","RAGN660830MCHMMR01","NORMA RAMIREZ GOMEZ","20206",480,83101,1003,"00",25,"CF19201",0,2416,2,null,20171001,20171231,59703.69,0]
[null,"CHIHUAHUA","08DPT0001C",120,"REVB701115KRA","REVB701115MCHGTH02","BERDINA REGALADO VITELA","20216",480,83101,1003,"00",25,"CF33204",0,9333,2,null,20171001,20171231,104713.87,0]
[null,"CHIHUAHUA","08DPT0001C",120,"REMV840531384","REMV840531HCHYRC03","VICTOR MANUEL REYES MURILLO","20104",480,83101,1003,"00",25,"CF33204",0,2384,2,null,20171001,20171231,85679.01,0]
[null,"CHIHUAHUA","08DPT0001C",120,"REOS610731NK2","REOS610731MCHZLL01","SILVIA PATRICIA REZA OLIVAS","20102",480,83101,1003,"00",25,"CF33206",0,13184,2,null,20171001,20171231,158740.62,0]
[null,"CHIHUAHUA","08DPT0001C",120,"ROCG710423BI2","ROCG710423MCHDNL05","GILDA ALEJANDRINA RODRIGUEZ CANO","20215",480,83101,1003,"00",25,"A03202",0,2375,2,null,20171001,20171231,55286.22,0]
[null,"CHIHUAHUA","08DPT0001C",200,"ROVB9202105WA","ROVB920210HCHDLR05","BRYAN ARMANDO RODRIGUEZ VALVERDE","20401",480,83101,1003,"00",25,"S01201",0,2394,2,null,20171001,20171231,34285.040000000001,0]
[null,"CHIHUAHUA","08DPT0001C",120,"RUDA711227IH4","RUDA711227HCHLLR08","ARTURO RUELAS DELGADO",20108,480,83101,1003,"00",25,"CF33206",0,14134,2,null,20171001,20171231,56606.09,0]
[null,"CHIHUAHUA","08DPT0001C",120,"SOPF600927RV3","SOPF600927MCHTRR08","FERNANDA SOTELO PEREZ","20402",480,83101,1003,"00",25,"CF18201",0,2370,2,null,20171001,20171231,39235.160000000003,0]
[null,"CHIHUAHUA","08DPT0001C",120,"TOEB620314DK2","TOEB620314HCHRNR09","BERNARDO TORRES ENRIQUEZ","20401",480,83101,1003,"00",25,"S01202",0,2374,2,null,20171001,20171231,53185.59,0]
[null,"CHIHUAHUA","08DPT0001C",200,"VAAH770519CJ9","VAAH770519HCHZRC04","HECTOR MANUEL VAZQUEZ ARMENDARIZ","20401",480,83101,1003,"00",25,"S01201",0,2374,2,null,20171001,20171231,30334.17,0]
[null,"CHIHUAHUA","08DPT0001C",120,"VIRC720302LS1","VIRC720302MCHLVR06","MARIA CRISTINA VILLAGRAN RIVERA","20215",480,83101,1003,"00",25,"A03202",0,10169,5,null,20171001,20171231,59737.87,0]
[null,"CHIHUAHUA","08DPT0001C",120,"VIJD921113BZ7","VIJD921113HCHLRG00","DIEGO EMMANUEL VILLALBA JUAREZ","20105",480,83101,1003,"00",25,"CF33204",0,2385,2,null,20171001,20171231,76549.37,0]
[null,"CHIHUAHUA","08DPT0001C",100,"AOZL821127LL7","AOZL821127HCHCVS03","LUIS ALBERTO ACOSTA ZAVALA",30102,108,83101,1001,"00",25,"L5XC","9.0",1,3,null,20171001,20171231,15654.14,0]
[null,"CHIHUAHUA","08DPT0001C",200,"AUAJ750122ASA","AUAJ750122HCHGGS03","JESUS AGUILAR AGUILAR",30102,60,83101,1001,"00",25,"L5XC",10,1,3,null,20171001,20171231,16512.89,0]
[null,"CHIHUAHUA","08DPT0001C",100,"AULE8612293K4","AULE861229MCHGRL05","AGUIRRE LOERA ELDA EUNICE",30102,120,83101,1001,"00",25,"L5XATEC",15,1,3,null,20171001,20171231,19951.18,0]
[null,"CHIHUAHUA","08DPT0001C",200,"AAMF560125R89","AAMF560125HCHLNL07","FLAVIO RAUL  ALVAREZ MONTOYA",30102,120,83101,1001,"00",25,"L5XC",15,1,3,null,20171001,20171231,25479.279999999999,0]
[null,"CHIHUAHUA","08DPT0001C",100,"AATL801210PB4","AATL801210MCHLNR06","LOURDES ADRIANA ALVAREZ TINTTORI",30102,108,83101,1001,"00",25,"L5XC",9,1,3,null,20171001,20171231,15654.14,0]
[null,"CHIHUAHUA","08DPT0001C",100,"AIOM820517TC5","AIOM820517MCHVLR08","MARIANA AVILA  OLIVAS",30102,240,83101,1001,"00",25,"L5XC",20,1,3,null,20171001,20171231,34574.080000000002,0]
[null,"CHIHUAHUA","08DPT0001C",100,"AAGJ821023VC5","AAGJ821023MCHZZS17","JESSICA CORAL AZAETA GUZMAN",30102,180,83101,1001,"00",25,"L5XATEC",18,1,3,null,20171001,20171231,23415.11,0]
[null,"CHIHUAHUA","08DPT0001C",120,"BAFR630210M78","BAFR630210HCHQRC02","RICARDO BAQUERA  FRESCAS",30102,228,83101,1001,"00",25,"L5XCBI",18,1,3,null,20171001,20171231,26931.96,0]
[null,"CHIHUAHUA","08DPT0001C",100,"BAAA801202930","BAAA801202HCHRLL09","ALBERTO GUERRERO BARRAZA ALVAREZ",30102,216,83101,1001,"00",25,"L5XC","18.0",1,3,null,20171001,20171231,31432.82,0]
[null,"CHIHUAHUA","08DPT0001C",100,"BURS661015RT6","BURS661015HCHSSL07","SALVADOR  BUSTILLOS RASCON",30102,168,83101,1001,"00",25,"L5XC",12,1,3,null,20171001,20171231,20903.36,0]
[null,"CHIHUAHUA","08DPT0001C",100,"CAAM640422S63","CAAM640422MCHMRR08","MARTHA LETICIA CAMPOS ARISMENDI",30102,240,83101,1001,"00",25,"L5XC","20.0",1,3,null,20171001,20171231,43698.34,0]
[null,"CHIHUAHUA","08DPT0001C",200,"CARG7105218G9","CARG710521HCHMMR07","GERARDO CAMPOS RAMIREZ",30102,180,83101,1001,"00",25,"L5XC",16,1,3,null,20171001,20171231,27244.54,0]
[null,"CHIHUAHUA","08DPT0001C",100,"CASR730827BZ2","CASR730827HCHNTM09","RAMON ARMANDO CANO SOTO",30102,180,83101,1001,"00",25,"L5XCBI",20,1,3,null,20171001,20171231,29791.96,0]
[null,"CHIHUAHUA","08DPT0001C",100,"CABA600225K67","CABA600225MCHRRR09","ARACELI CARRASCO BARRAZA",30102,240,83101,1001,"00",25,"L5XC",20,1,3,null,20171001,20171231,34398.94,0]
[null,"CHIHUAHUA","08DPT0001C",100,"CAON860317HL0","CAON860317MCHRCL00","NALLELY  YESENIA CARRASCO OCHOA",30102,120,83101,1001,"00",25,"L5XCBI","10.0",1,3,null,20171001,20171231,17450.48,0]
[null,"CHIHUAHUA","08DPT0001C",120,"CAJM671130A58","CAJM671130HCHRRR04","MAURO GERARDO CARRILLO JUAREZ",30102,120,83101,1001,"00",25,"L5XATEC","10.0",1,3,null,20171001,20171231,14839.24,0]
[null,"CHIHUAHUA","08DPT0001C",120,"CAAI5611206JA","CAAI561120MCHSRD05","IDELIA CASTRO ARMENDARIZ",30102,216,83101,1001,"00",25,"L5XC",16,1,3,null,20171001,20171231,28172.91,0]
[null,"CHIHUAHUA","08DPT0001C",200,"CAFL660707EI1","CAFL660707MCHZLY06","LYDIA CAZARES  FLORES",30102,216,83101,1001,"00",25,"L5XCBI",15,1,3,null,20171001,20171231,22914.61,0]
[null,"CHIHUAHUA","08DPT0001C",200,"CEBE6809217B0","CEBE680921HCHNCL06","ELEAZAR  MATEO CENICEROS  BECERRA",30102,240,83101,1001,"00",25,"L5XC",14,1,3,null,20171001,20171231,25179.97,0]
[null,"CHIHUAHUA","08DPT0001C",200,"CEMC581222Q78","CEMC581222MCHRLL09","CLARA CERVANTES  MELENDEZ",30102,240,83101,1001,"00",25,"L5XC","20.0",1,3,null,20171001,20171231,34574.080000000002,0]
[null,"CHIHUAHUA","08DPT0001C",200,"CAJF670208887","CAJF670208HCHHRR03","FERNANDO CHACON JURADO",30102,180,83101,1001,"00",25,"L5XC",19,1,3,null,20171001,20171231,32715.35,0]
[null,"CHIHUAHUA","08DPT0001C",100,"CAGL640918VT9","CAGL640918MCHHMR07","MARIA DE LOURDES CHAVIRA GOMEZ",30102,240,83101,1001,"00",25,"L5XC",18,1,3,null,20171001,20171231,30621.14,0]
[null,"CHIHUAHUA","08DPT0001C",100,"DIAF6905309M4","DIAF690530HDGZLR08","FRANCISCO ROBERTO DIAZ  ALVARADO",30102,108,83101,1001,"00",25,"L5XATEC",11,1,3,null,20171001,20171231,16008.15,0]
[null,"CHIHUAHUA","08DPT0001C",100,"DOTM560505JB1","DOTM560505MCHMRR05","MARGARITA DOMINGUEZ  TREVIZO",30102,192,83101,1001,"00",25,"L5XC","16.0",1,3,null,20171001,20171231,27439.72,0]
[null,"CHIHUAHUA","08DPT0001C",200,"EARE580710TW7","EARE580710MMCRQL06","ELSA AMALIA ERRASQUIN  ROQUE",30102,180,83101,1001,"00",25,"L5XC",13,1,3,null,20171001,20171231,22424.66,0]
[null,"CHIHUAHUA","08DPT0001C",100,"EOOC700117F69","EOOC700117HCHSRR08","CARLOS ESCOBEDO ORTEGA",30102,240,83101,1001,"00",25,"L5XC",18,1,3,null,20171001,20171231,31489.31,0]
[null,"CHIHUAHUA","08DPT0001C",100,"EACM621211KN0","EACM621211HCHSHR04","MARTIN ESPARZA  CHAVEZ",30102,228,83101,1001,"00",25,"L5XATEC",19,1,3,null,20171001,20171231,32828.339999999997,0]
[null,"CHIHUAHUA","08DPT0001C",100,"EADR661019BU0","EADR661019HCHSZM08","ESPARZA DIAZ RAMON",30102,120,83101,1001,"00",25,"L5XC",10,1,3,null,20171001,20171231,13121.47,0]
[null,"CHIHUAHUA","08DPT0001C",200,"EILJ680419MG0","EILJ680419HCHSNR05","JORGE ALBERTO  ESPINOZA  LUNA",30102,240,83101,1001,"00",25,"L5XC",15,1,3,null,20171001,20171231,26862.2,0]
[null,"CHIHUAHUA","08DPT0001C",200,"FECA6103137A4","FECA610313HDFRLB09","ABELARDO FERNANDEZ  CALDERON",30102,240,83101,1001,"00",25,"L5XCBI",18,1,3,null,20171001,20171231,26955.51,0]
[null,"CHIHUAHUA","08DPT0001C",200,"FOFL641113DP1","FOFL641113HCHLLS06","LUIS ALBERTO FLORES  FLORES",30102,192,83101,1001,"00",25,"L5XC",16,1,3,null,20171001,20171231,28291.56,0]
[null,"CHIHUAHUA","08DPT0001C",100,"GAMR760920E78","GAMR760920MCHLNT06","RUTH GALLEGOS  MONARCA",30102,240,83101,1001,"00",25,"L5XC",20,1,3,null,20171001,20171231,33800.699999999997,0]
[null,"CHIHUAHUA","08DPT0001C",200,"GAVF750826SR2","GAVF750826HCHLLR05","FRANCISCO AGUSTIN GALLEGOS  VILLASEÑOR",30102,120,83101,1001,"00",25,"L5XC",10,1,3,null,20171001,20171231,17217.72,0]
[null,"CHIHUAHUA","08DPT0001C",120,"GALJ810323DN3","GALJ810323HCHRZS03","JESUS SAUL GARCIA  LOZANO",30102,204,83101,1001,"00",25,"L5XCBI",10,1,3,null,20171001,20171231,32427.54,0]
[null,"CHIHUAHUA","08DPT0001C",200,"GAMG821026JM8","GAMG821026HDGRRB08","GABINO GARCIA  MARRUFO",30102,216,83101,1001,"00",25,"L5XATEC",19,1,3,null,20171001,20171231,29027.15,0]
[null,"CHIHUAHUA","08DPT0001C",120,"GAOM870316CN9","GAOM870316HCHRRG00","JOSE MIGUEL GARCIA ORTIZ",30102,240,83101,1001,"00",25,"L5XATEC","20.0",1,3,null,20171001,20171231,29777.54,0]
[null,"CHIHUAHUA","08DPT0001C",100,"GAVV7810103M7","GAVV781010MCHRZR06","VERONICA GARDEA  VAZQUEZ",30102,180,83101,1001,"00",25,"L5XCBl",15,1,3,null,20171001,20171231,26380.36,0]
[null,"CHIHUAHUA","08DPT0001C",200,"GOAC860518J59","GOAC860518HCHMVR06","CARLOS JOEL GOMEZ AVILA",30102,180,83101,1001,"00",25,"L5XCBI",19,1,3,null,20171001,20171231,27927.88,0]
[null,"CHIHUAHUA","08DPT0001C",120,"GOHS731228LU7","GOHS731228HCHNLM00","GONZALEZ HOLGUIN SIMON",30102,216,83101,1001,"00",25,"L5XATEC",15,1,3,null,20171001,20171231,20210.32,0]
[null,"CHIHUAHUA","08DPT0001C",120,"HEAM7409112X6","HEAM740911MCHRRR00","MARCELA HERNANDEZ ARMENDARIZ",30102,216,83101,1001,"00",25,"L5XC",20,1,3,null,20171001,20171231,34254.019999999997,0]
[null,"CHIHUAHUA","08DPT0001C",120,"HEEP940626UV1","HEEP940626MCHRSR02","PERLA ALEJANDRA HERNANDEZ ESTUPIÑON",30102,80,83101,1001,"00",25,"L5XATEC",8,1,3,null,20171001,20171231,7564.39,0]
[null,"CHIHUAHUA","08DPT0001C",100,"HERA781214D5A","HERA781214HCHRMR02","AARON TERCERO HERNANDEZ ROMO",30102,228,83101,1001,"00",25,"L5XC",20,1,3,null,20171001,20171231,34195.54,0]
[null,"CHIHUAHUA","08DPT0001C",120,"HESM4812033X7","HESM481206HDFRGR09","MARIO HERNANDEZ SEGURA",30102,168,83101,1001,"00",25,"L5XC",15,1,3,null,20171001,20171231,25849.040000000001,0]
[null,"CHIHUAHUA","08DPT0001C",120,"HEMB811018BN2","HEMB811018MCHRNT06","BEATRIZ ELENA HERRERA  MENDOZA",30102,156,83101,1001,"00",25,"L5XC",18,1,3,null,20171001,20171231,30431.41,0]
[null,"CHIHUAHUA","08DPT0001C",100,"JIVG670122BN0","JIVG670122HCHMLD01","GAUDENCIO JIMENEZ VALENTIN",30102,180,83101,1001,"00",25,"L5XCBI",15,1,3,null,20171001,20171231,25876.15,0]
[null,"CHIHUAHUA","08DPT0001C",120,"LESO760401RV1","LESO760401HCHLXM07","OMAR LEAL SEAÑEZ",30102,60,83101,1001,"00",25,"L5XCBI",8,1,3,null,20171001,20171231,13262.47,0]
[null,"CHIHUAHUA","08DPT0001C",120,"LOGM811218IW7","LOGM811218MCHRNY01","MYRNA GUADALUPE LOERA GONZALEZ",30102,216,83101,1001,"00",25,"L5XC",18,1,3,null,20171001,20171231,26471.67,0]
[null,"CHIHUAHUA","08DPT0001C",200,"LOMM630709QH3","LOMM630709MCHPRR06","MIRIAM LOPEZ  MARQUEZ",30102,192,83101,1001,"00",25,"L5XC",16,1,3,null,20171001,20171231,27607.79,0]
[null,"CHIHUAHUA","08DPT0001C",200,"LOCJ610711AFA","LOCJ610711HCHYHV06","JAVIER LOYA  CHAVIRA",30102,240,83101,1001,"00",25,"L5XC",16,1,3,null,20171001,20171231,28404.55,0]
[null,"CHIHUAHUA","08DPT0001C",200,"LOHL711219AQ3","LOHL711219MCHYRL02","LILIANA IVONNE LOYA  HERNANDEZ",30102,240,83101,1001,"00",25,"L5XATEC",14,1,3,null,20171001,20171231,24475.14,0]
[null,"CHIHUAHUA","08DPT0001C",100,"LORJ800906V2A","LORJ800906HCHYDS03","JESUS ARTURO LOYA RODRIGUEZ",30102,216,83101,1001,"00",25,"L5XCBI",18,1,3,null,20171001,20171231,26789.88,0]
[null,"CHIHUAHUA","08DPT0001C",100,"MAGP631129C83","MAGP631129HCHRNR03","PERFECTO MARQUEZ GONZALEZ",30102,192,83101,1001,"00",25,"L5XCBI",16,1,3,null,20171001,20171231,24490.18,0]
[null,"CHIHUAHUA","08DPT0001C",200,"MACC861013NB9","MACC861013HCHRLR03","CARLOS ISAAC MARRUFO CALDERON",30102,228,83101,1001,"00",25,"L5XCBI",19,1,3,null,20171001,20171231,32815.120000000003,0]
[null,"CHIHUAHUA","08DPT0001C",200,"MEMM770410518","MEMM770410HCHRNN08","MANUEL MERAZ MENDEZ",30102,180,83101,1001,"00",25,"L5XATEC",16,1,3,null,20171001,20171231,27240.97,0]
[null,"CHIHUAHUA","08DPT0001C",100,"MURE810806BI4","MURE810806HCHXJM09","MUÑOZ ROJAS EMMANUEL",30102,180,83101,1001,"00",25,"L5XC",20,1,3,null,20171001,20171231,26496.66,0]
[null,"CHIHUAHUA","08DPT0001C",100,"NAME5210109W5","NAME521010HCHVNN03","ENRIQUE NAVARRO MENDOZA",30102,204,83101,1001,"00",25,"L5XC",15,1,3,null,20171001,20171231,25930.36,0]
[null,"CHIHUAHUA","08DPT0001C",200,"OIAO791026IM2","OIAO791026HCHLPS00","OSCAR ERNESTO OLIVAS APONTE",30102,240,83101,1001,"00",25,"L5XC","18.0",1,3,null,20171001,20171231,31489.31,0]
[null,"CHIHUAHUA","08DPT0001C",100,"OILR550330775","OILR550330HCHLPG01","ROGELIO OLIVAS LOPEZ",30102,216,83101,1001,"00",25,"L5XC",19,1,3,null,20171001,20171231,32449.8,0]
[null,"CHIHUAHUA","08DPT0001C",120,"OEZH720627D54","OEZH720627HCHRBG04","HUGO ORTEGA ZUBIATE",30102,120,83101,1001,"00",25,"L5XATEC",14,1,3,null,20171001,20171231,23357.72,0]
[null,"CHIHUAHUA","08DPT0001C",200,"PARM520707MY1","PARM520707HPLLCG03","MIGUEL ANGEL PALMA ROCHA",30102,96,83101,1001,"00",25,"L5XCBI",8,1,3,null,20171001,20171231,11581.02,0]
[null,"CHIHUAHUA","08DPT0001C",100,"PAGM7008098P1","PAGM700809HCHRRR01","MAURO RUBEN PARADA GRANADOS",30102,96,83101,1001,"00",25,"L5XCBI",8,1,3,null,20171001,20171231,13680.61,0]
[null,"CHIHUAHUA","08DPT0001C",120,"PARF590815ED3","PARF590815MVZVSL20","FELICITAS  PAVON ROSAS",30102,240,83101,1001,"00",25,"L5XATEC",20,1,3,null,20171001,20171231,29618.14,0]
[null,"CHIHUAHUA","08DPT0001C",100,"PAVE830228SH0","PAVE830228HCHZLN00","ENRIQUE PAZOS VALLES",30102,180,83101,1001,"00",25,"L5XC",20,1,3,null,20171001,20171231,29673.06,0]
[null,"CHIHUAHUA","08DPT0001C",200,"PERF790621C3A","PERF790621HCHRGB13","ROBERTO AARON PEREA FIGUEROA",30102,144,83101,1001,"00",25,"L5XC",14,1,3,null,20171001,20171231,18182.46,0]
[null,"CHIHUAHUA","08DPT0001C",200,"PECA750727I8A","PECA750727HJCRRL03","ALEJANDRO PEREZ CORTES",30102,180,83101,1001,"00",25,"L5XC",13,1,3,null,20171001,20171231,23783.200000000001,0]
[null,"CHIHUAHUA","08DPT0001C",200,"PICN620328PA0","PICN620328HVZNRR07","JOSE NORBERTO PINEDA CRUZ",30102,144,83101,1001,"00",25,"L5XC",12,1,3,null,20171001,20171231,20681.07,0]
[null,"CHIHUAHUA","08DPT0001C",100,"PIRL7804262E7","PIRL780426MCHXZZ09","MARIA LIZETH PIÑON RUIZ",30102,240,83101,1001,"00",25,"L5XC",20,1,3,null,20171001,20171231,33873.49,0]
[null,"CHIHUAHUA","08DPT0001C",200,"QURM640822CE7","QURM640822MCHNZR02","MARTINA LILIA QUINTANA  RUIZ",30102,180,83101,1001,"00",25,"L5XC",15,1,3,null,20171001,20171231,25707.98,0]
[null,"CHIHUAHUA","08DPT0001C",200,"RAGG600206G85","RAGG600206MCHMTR04","GRACIELA RAMIREZ  GUTIERREZ",30102,120,83101,1001,"00",25,"L5XC",12,1,3,null,20171001,20171231,20122.650000000001,0]
[null,"CHIHUAHUA","08DPT0001C",120,"RAMA741011N9A","RAMA741011MCHMRN00","ANABEL RAMOS  MORALES",30102,120,83101,1001,"00",25,"L5XC",16,1,3,null,20171001,20171231,28319.81,0]
[null,"CHIHUAHUA","08DPT0001C",200,"RARN711008BKS","RARN711008MCHSMR09","NORMA PATRICIA RASCON RAMIREZ",30102,204,83101,1001,"00",25,"L5XC",9,1,3,null,20171001,20171231,15784.23,0]
[null,"CHIHUAHUA","08DPT0001C",100,"RECN560808KM6","RECN560808MCHYRR00","MARIA NORMA REYES CARREON",30102,120,83101,1001,"00",25,"L5XC","16.0",1,3,null,20171001,20171231,27439.72,0]
[null,"CHIHUAHUA","08DPT0001C",100,"REOL730620M72","REOL730620MCHYRC05","LUCIA REYES ORTIZ",30102,192,83101,1001,"00",25,"L5XATEC",15,1,3,null,20171001,20171231,26027.22,0]
[null,"CHIHUAHUA","08DPT0001C",200,"RIMI820220GQ7","RIMI820220HCHVCV02","RIVERA MACIAS IVAN JOEL",30102,216,83101,1001,"00",25,"L5XC",14,1,3,null,20171001,20171231,17279.669999999998,0]
[null,"CHIHUAHUA","08DPT0001C",100,"ROSL660422DP2","ROSL660422HCHDLZ09","MARIA DE LA LUZ  RODARTE  SOLIS",30102,108,83101,1001,"00",25,"L5XATEC",19,1,3,null,20171001,20171231,32421.55,0]
[null,"CHIHUAHUA","08DPT0001C",100,"ROAA871025FU9","ROAA871025HCHDGL07","ALBERTO RODRIGUEZ AGUIRRE",30102,204,83101,1001,"00",25,"L5XC",18,1,3,null,20171001,20171231,23889.33,0]
[null,"CHIHUAHUA","08DPT0001C",120,"ROGJ630120IE0","ROGJ630120MCHDZS08","MARIA DE JESUS RODRIGUEZ GUZMAN",30102,192,83101,1001,"00",25,"L5XC",15,1,3,null,20171001,20171231,26011.58,0]
[null,"CHIHUAHUA","08DPT0001C",100,"ROAL730412EQ6","ROAL730412HCHJRS01","LUIS JAVIER ROJAS ARAGONEZ",30102,240,83101,1001,"00",25,"L5XCBI","18.0",1,3,null,20171001,20171231,31257.68,0]
[null,"CHIHUAHUA","08DPT0001C",200,"ROPV750812QL5","ROPV750812HCHMCC00","VICTOR MANUEL ROMERO PACHECO",30102,216,83101,1001,"00",25,"L5XATEC ",15,1,3,null,20171001,20171231,22238.18,0]
[null,"CHIHUAHUA","08DPT0001C",200,"ROTO850629550","ROTO850629HCHNRS06","OSCAR ARMANDO RONQUILLO TERAN ",30102,228,83101,1001,"00",25,"L5XATEC ",15,1,3,null,20171001,20171231,19195.64,0]
[null,"CHIHUAHUA","08DPT0001C",120,"ROVI820310797","ROVI820310MCLNLV07","IVAN RAMON RONQUILLO VILLALBA",30102,120,83101,1001,"00",25,"L5XC",18,1,3,null,20171001,20171231,30732.3,0]
[null,"CHIHUAHUA","08DPT0001C",120,"RUNH860818SE6","RUNH860818HCHBJM07","HUMBERTO ALONSO RUBIO NAJERA",30102,216,83101,1001,"00",25,"L5XATEC",18,1,3,null,20171001,20171231,18387.400000000001,0]
[null,"CHIHUAHUA","08DPT0001C",100,"RUMS740226UR4","RUMS740226MCHZRL09","MARIA SOLEDAD RUIZ MARQUEZ",30102,216,83101,1001,"00",25,"L5XC",20,1,3,null,20171001,20171231,34574.080000000002,0]
[null,"CHIHUAHUA","08DPT0001C",100,"SAQG720512DU6","SAQG720512MCHNXD07","GUADALUPE   SAENZ  QUIÑONEZ",30102,240,83101,1001,"00",25,"L5XC",15,1,3,null,20171001,20171231,26011.59,0]
[null,"CHIHUAHUA","08DPT0001C",200,"SEAI880810AV4","SEAI880810MCHRMR02","IRIS ROSALI SERNA AMPARAN",30102,240,83101,1001,"00",25,"L5XCBI",17,1,3,null,20171001,20171231,25145.09,0]
[null,"CHIHUAHUA","08DPT0001C",120,"SIML5803182A8","SIML580318HCHLJS14","JOSE LUIS CARLOS SILVEYRA MEJIA",30102,144,83101,1001,"00",25,"L5XC",20,1,3,null,20171001,20171231,34082.550000000003,0]
[null,"CHIHUAHUA","08DPT0001C",200,"TAAD800122GU1","TAAD800122HCHRRL07","DELFINO TARIN ARMENDARIZ",30102,180,83101,1001,"00",25,"L5XCBI",18,1,3,null,20171001,20171231,30323.85,0]
[null,"CHIHUAHUA","08DPT0001C",100,"UIOM9106177H6","UIOM910617MCHRRR00","URIZA ORTIZ MARIBEL",30102,168,83101,1001,"00",25,"L5XCBI",15,1,3,null,20171001,20171231,22238.18,0]
[null,"CHIHUAHUA","08DPT0001C",200,"VACA610212RT2","VACA610212HCHLHD01","ADOLFO VALLES  CHAVEZ",30102,168,83101,1001,"00",25,"L5XC",16,1,3,null,20171001,20171231,27998.14,0]
[null,"CHIHUAHUA","08DPT0001C",100,"VADS631230CN3","VADS631230MCHLVL06","SILVIA LETICIA VALVERDE DAVILA",30102,216,83101,1001,"00",25,"L5XC",20,1,3,null,20171001,20171231,34574.080000000002,0]
[null,"CHIHUAHUA","08DPT0001C",100,"VIRR710926945","VIRR710926HCHLDB12","RUBEN   VILLALOBOS RODRIGUEZ",30102,240,83101,1001,"00",25,"L5XC","20.0",1,3,null,20171001,20171231,34489.339999999997,0]
[null,"CHIHUAHUA","08DPT0001C",200,"VIPR570927K44","VIPR570927HCHLYF07","RAFAEL JESUS VILLEGAS PAYAN",30102,204,83101,1001,"00",25,"L5XCBI",20,1,3,null,20171001,20171231,33420.339999999997,0]
[null,"CHIHUAHUA","08DPT0002B",200,"AARL701222GC6","AARL701222MCHRVB04","LIBIA GABRIELA ARAGON RIVERA",30102,240,83101,1001,"00",26,"L5XC",20,1,3,null,20171001,20171231,47006.879999999997,0]
[null,"CHIHUAHUA","08DPT0002B",200,"BAGR640911VB4","BAGR640911HCHRND09","RODOLFO ELI BARONA GONZALEZ",30102,180,83101,1001,"00",26,"L5XATEC",15,1,3,null,20171001,20171231,25688.5,0]
[null,"CHIHUAHUA","08DPT0002B",200,"BEBB870829EY4","BEEBB870829MCHLLR06","BERTHA MARISSA BELTRAN BELTRAN",30102,144,83101,1001,"00",26,"L5XATEC",12,1,3,null,20171001,20171231,18817.940000000002,0]
[null,"CHIHUAHUA","08DPT0002B",120,"BOAI840527A86","BOAI840527MCHRGN00","MARIA INES BORUNDA AGUILAR",30102,216,83101,1001,"00",26,"L5XC","18.0",1,3,null,20171001,20171231,40889.540000000008,0]
[null,"CHIHUAHUA","08DPT0002B",200,"CAVM69042817A","CAVM690428HCHBGR00","MARIO ALBERTO CABALLERO VEGA",30102,168,83101,1001,"00",26,"L5XATEC",14,1,3,null,20171001,20171231,2985.85]
[null,"CHIHUAHUA","08DPT0002B",200,"CACS480226NE5","CACS480226HGTMPL06","SALVADOR CAMPOS CAPETILLO",30102,240,83101,1001,"00",26,"L5XC",20,1,3,null,20171001,20171231,46550.18,0]
[null,"CHIHUAHUA","08DPT0002B",100,"CAPH630209KZO","CAPH630209MCHRSL06","HILDA MARGARITA CARRASCO POSADA",30102,240,83101,1001,"00",26,"L5XC","20.0",1,3,null,20171001,20171231,48306.879999999997,0]
[null,"CHIHUAHUA","08DPT0002B",100,"COCD901004DB8","COCD901004MCHRHN09","DAINA ROCIO CORTES CHAVEZ",30102,216,83101,1001,"00",26,"L5XCBII","18.0",1,3,null,20171001,20171231,38374.589999999997,0]
[null,"CHIHUAHUA","08DPT0002B",200,"EABM680229EQ9","EABM680229MCHSDR08","MARTHA GUADALUPE ESCALANTE BADILLO",30102,240,83101,1001,"00",26,"L5XCBII","20.0",1,3,null,20171001,20171231,41654.35,0]
[null,"CHIHUAHUA","08DPT0002B",200,"EOHA790831RH0","EOHA790831MZSSRN01","MARIA DE LOS ANGELES ESCOBAR DE HARO",30102,216,83101,1001,"00",26,"L5XC","18.0",1,3,null,20171001,20171231,43771.799999999996,0]
[null,"CHIHUAHUA","08DPT0002B",200,"EAML780807EM2","EAML780807MCHSRR05","LAURA LORENA ESTRADA MURILLO",30102,240,83101,1001,"00",26,"L5XATEC","20.0",1,3,null,20171001,20171231,32006.879999999997,0]
[null,"CHIHUAHUA","08DPT0002B",100,"FAMA641105R5A","FAMA641105MCHVRL07","ALMA ISABEL FAVELA MARTINEZ",30102,240,83101,1001,"00",26,"L5XC","20.0",1,3,null,20171001,20171231,47514.02,0]
[null,"CHIHUAHUA","08DPT0002B",100,"FOLS800726I38","FOLS800726MCHLCN07","SANDYANA FLORES LUCERO",30102,192,83101,1001,"00",26,"L5XC","16.0",1,3,null,20171001,20171231,39540.839999999997,0]
[null,"CHIHUAHUA","08DPT0002B",100,"FONE671109ME3","FONE671109MCHLVS06","ESPERANZA FLORES NAVARRO",30102,240,83101,1001,"00",26,"L5XC","20.0",1,3,null,20171001,20171231,47850.18,0]
[null,"CHIHUAHUA","08DPT0002B",200,"GAAF8909263V9","GAAF890926MCHRLR05","FERNANDA SOFIA GARCIA ALVARADO",30102,180,83101,1001,"00",26,"L5XATEC",15,1,3,null,20171001,20171231,3554.59]
[null,"CHIHUAHUA","08DPT0002B",200,"GAGC810607AX3","GAGC810607MCHRRH23","CHRISTIAN BELEN GARCIA GARCIA",30102,240,83101,1001,"00",26,"L5XC","20.0",1,3,null,20171001,20171231,47389.34,0]
[null,"CHIHUAHUA","08DPT0002B",200,"GALJ860302G54","GALJ860302HGTRNV04","JAVIER GARCIA LUNA",30102,240,83101,1001,"00",26,"L5XC","20.0",1,3,null,20171001,20171231,44195.83,0]
[null,"CHIHUAHUA","08DPT0002B",100,"GOAJ891103DFA","GOAJ891103HCHNLR08","JORGE OMAR GONZALEZ ALVIDREZ",30102,120,83101,1001,"00",26,"L5XATEC","10.0",1,3,null,20171001,20171231,15906.380000000001,0]
[null,"CHIHUAHUA","08DPT0002B",200,"GOCY840110NQ4","GOCY840110MCHNLS07","YSELA GONZALEZ CALDERA",30102,240,83101,1001,"00",26,"L5XCBII","20.0",1,3,null,20171001,20171231,33553.730000000003,0]
[null,"CHIHUAHUA","08DPT0002B",200,"GOMA851115JC8","GOMA851115HCHNRR07","AARON ROBERTO GONZALEZ MORAN",30102,240,83101,1001,"00",26,"L5XC","20.0",1,3,null,20171001,20171231,43922.460000000006,0]
[null,"CHIHUAHUA","08DPT0002B",100,"GOPS780818LH4","GOPS780818HCHNRR01","SERGIO GONZALEZ PEREZ",30102,204,83101,1001,"00",26,"L5XC","17.0",1,3,null,20171001,20171231,42667.11,0]
[null,"CHIHUAHUA","08DPT0002B",100,"GOCE790701I32","GOXC790701MCHNLX06","CELIA BRISA GONZALEZ ",30102,240,83101,1001,"00",26,"L5XCBII","20.0",1,3,null,20171001,20171231,38268.839999999997,0]
[null,"CHIHUAHUA","08DPT0002B",100,"GUFD63111111A","GUFD631111MSLVRN17","DINA YESENIA GUEVARA FIERRO",30102,240,83101,1001,"00",26,"L5XC","20.0",1,3,null,20171001,20171231,48477.859999999993,0]
[null,"CHIHUAHUA","08DPT0002B",100,"HEDC640302NR2","HEDC640302HZSRZR01","CARLOS HERNANDEZ DIAZ",30102,228,83101,1001,"00",26,"L5XCBII","19.0",1,3,null,20171001,20171231,39901.859999999993,0]
[null,"CHIHUAHUA","08DPT0002B",200,"HERJ6108185C5","HERJ610818HCHRBS03","JESUS ALBERTO HERNANDEZ RUBIO",30102,90,83101,1001,"00",26,"L5XATEC","9.0",1,3,null,20171001,20171231,13799.89,0]
[null,"CHIHUAHUA","08DPT0002B",200,"HUMA9110245Y2","HUMA911024MNERLN04","ANEL HURTADO MOLINA",30102,180,83101,1001,"00",26,"L5XATEC","15.0",1,3,null,20171001,20171231,3554.59]
[null,"CHIHUAHUA","08DPT0002B",200,"IARL8304031L7","IARL830403HZSBMS09","LUIS ROMAN IBARRA  RAMOS",30102,168,83101,1001,"00",26,"L5XCBII","14.0",1,3,null,20171001,20171231,29289.350000000002,0]
[null,"CHIHUAHUA","08DPT0002B",200,"JAAZ890626IJ1","JAAZ890626MCHSVM08","ZIMRI DANIEL JASSO AVILA",30102,180,83101,1001,"00",26,"L5XATEC","15.0",1,3,null,20171001,20171231,28919.430000000004,0]
[null,"CHIHUAHUA","08DPT0002B",100,"LAOE880302RW2","LAOE880302MCHZRL08","ELIZA ARELY LAZALDE ORTIZ",30102,240,83101,1001,"00",26,"L5XCBII","20.0",1,3,null,20171001,20171231,42257.060000000005,0]
[null,"CHIHUAHUA","08DPT0002B",200,"LEGF590530LW9","LEGF590530HCHNTR00","FERNANDO LEON GUTIERREZ",30102,240,83101,1001,"00",26,"L5XC","20.0",1,3,null,20171001,20171231,47178.259999999995,0]
[null,"CHIHUAHUA","08DPT0002B",120,"LOCA790201FP3","LXCA790201HCHRSD09","ADRIAN FRANCISCO LOERA  CASTRO",30102,216,83101,1001,"00",26,"L5XC","18.0",1,3,null,20171001,20171231,43908.4,0]
[null,"CHIHUAHUA","08DPT0002B",200,"LORF830406762","LORF830406HCHPML02","FELIPE LOPEZ RAMIREZ",30102,240,83101,1001,"00",26,"L5XCBII","20.0",1,3,null,20171001,20171231,40209.439999999995,0]
[null,"CHIHUAHUA","08DPT0002B",200,"LOCB9311128T4","LOCB931112HCHZSR02","BRAULIO ALEJANDRO LOZANO CASAS",30102,204,83101,1001,"00",26,"L5XATEC","17.0",1,3,null,20171001,20171231,4029.34]
[null,"CHIHUAHUA","08DPT0002B",100,"LUGG880415UKA","LURG880415MCHNVB04","GABRIELA ALEJANDRA LUNA  RIVAS",30102,240,83101,1001,"00",26,"L5XCBII","20.0",1,3,null,20171001,20171231,41721.929999999993,0]
[null,"CHIHUAHUA","08DPT0002B",200,"MARJ6706253G1","MARJ670625HCHRSN08","JUAN FRANCISCO MARQUEZ DE LA ROSA",30102,240,83101,1001,"00",26,"L5XCBII","20.0",1,3,null,20171001,20171231,41004.35,0]
[null,"CHIHUAHUA","08DPT0002B",200,"MAHR7303052U1","MAHR730305HCHRRG05","RIGOBERTO MARTINEZ HERNANDEZ",30102,216,83101,1001,"00",26,"L5XCBII","18.0",1,3,null,20171001,20171231,37823.21,0]
[null,"CHIHUAHUA","08DPT0002B",200,"MARE920423KX8","MARE920423MCHRNR05","ERIKA ELIZABETH MARTINEZ RANGEL",30102,216,83101,1001,"00",26,"L5XATEC","18.0",1,3,null,20171001,20171231,33106.75,0]
[null,"CHIHUAHUA","08DPT0002B",100,"MAER7001128F3","MAER700112MCHTSQ04","RAQUEL  MATA ESPARZA",30102,228,83101,1001,"00",26,"L5XC","19.0",1,3,null,20171001,20171231,46552.420000000006,0]
[null,"CHIHUAHUA","08DPT0002B",100,"MAMJ7909266H9","MAMJ790926HNLTDV08","JAVIER ISAIAS MATA MEDINA",30102,240,83101,1001,"00",26,"L5XATEC","20.0",1,3,null,20171001,20171231,32144.35,0]
[null,"CHIHUAHUA","08DPT0002B",120,"MEMA740518TM8","MEMA740518HCHLLL03","ALFONSO NATANAEL MELENDEZ MELENDEZ",30102,240,83101,1001,"00",26,"L5XCBII","20.0",1,3,null,20171001,20171231,41607.060000000005,0]
[null,"CHIHUAHUA","08DPT0002B",200,"MEPF691219UT3","MEPF691219HCHLRR06","FRANCISCO JAVIER MELENDEZ PEREYRA",30102,216,83101,1001,"00",26,"L5XC","18.0",1,3,null,20171001,20171231,42365.71,0]
[null,"CHIHUAHUA","08DPT0002B",200,"MERE811126DU3","MERE811126MCHLMD02","EDNA MELINA MELERO RAMIREZ",30102,180,83101,1001,"00",26,"L5XC","15.0",1,3,null,20171001,20171231,36751.9,0]
[null,"CHIHUAHUA","08DPT0002B",120,"MEMN800616CH0","MEMN800616MZSNRR04","NORA DE LOURDES MENDEZ MARRUFO",30102,240,83101,1001,"00",26,"L5XC","20.0",1,3,null,20171001,20171231,47199.970000000008,0]
[null,"CHIHUAHUA","08DPT0002B",100,"MEPM521007BW0","MEPM521007MSPNTR05","MARINA MENDOZA PATIÑO",30102,216,83101,1001,"00",26,"L5XC","18.0",1,3,null,20171001,20171231,44558.400000000001,0]
[null,"CHIHUAHUA","08DPT0002B",100,"MEHE771226AK0","MEHE771226MCHZRM07","EMMA MARINA MEZA HERNANDEZ",30102,228,83101,1001,"00",26,"L5XC","19.0",1,3,null,20171001,20171231,46204.430000000008,0]
[null,"CHIHUAHUA","08DPT0002B",100,"MONJ730522LH4","MONJ730522HCHLXN04","JUAN BENJAMIN MOLINA NUÑEZ",30102,216,83101,1001,"00",26,"L5XCBI","18.0",1,3,null,20171001,20171231,33446.67,0]
[null,"CHIHUAHUA","08DPT0002B",200,"MOMC840319BC5","MOMC840319MCHRRR09","CARMINA SARA MORENO MORALES",30102,180,83101,1001,"00",26,"L5XCBII","15.0",1,3,null,20171001,20171231,31635.27,0]
[null,"CHIHUAHUA","08DPT0002B",200,"NARE6212101N2","NARE621210HCHVDL15","ELISEO MANUEL NAVA RODRIGUEZ",30102,168,83101,1001,"00",26,"L5XC","14.0",1,3,null,20171001,20171231,33514.58,0]
[null,"CHIHUAHUA","08DPT0002B",100,"NAMR911217QR2","NAMR911217MCHVRY09","REYNA GUADALUPE NAVARRETE MARROQUIN",30102,216,83101,1001,"00",26,"L5XATEC","18.0",1,3,null,20171001,20171231,34312.189999999995,0]
[null,"CHIHUAHUA","08DPT0002B",100,"OICT7508271I3","OICT750827MCHLRR05","MARIA TERESA OLIVAS  CORONADO",30102,180,83101,1001,"00",26,"L5XC","15.0",1,3,null,20171001,20171231,36054.83,0]
[null,"CHIHUAHUA","08DPT0002B",200,"OEZA770117EH9","OEZA770117HCHRPL04","ALFREDO LORENZO ORTEGA ZEPEDA",30102,168,83101,1001,"00",26,"L5XCBII","14.0",1,3,null,20171001,20171231,31818.989999999998,0]
[null,"CHIHUAHUA","08DPT0002B",200,"PAVM750409GD9","PAVM750409HCLLRR05","JOSE MARIA PALACIOS VARELA",30102,80,83101,1001,"00",26,"L5XCBI",10,1,3,null,20171001,20171231,16629.41]
[null,"CHIHUAHUA","08DPT0002B",120,"PEGF4912049U3","PEGF491204HCHRRR02","FRANCISCO PEREZ GUERRERO",30102,240,83101,1001,"00",26,"L5XC","20.0",1,3,null,20171001,20171231,47514.02,0]
[null,"CHIHUAHUA","08DPT0002B",200,"PELI800928FR2","PELI800928HCHRPG01","JOSE IGNACIO PEREZ LOPEZ",30102,120,83101,1001,"00",26,"LX5ATEC","10.0",1,3,null,20171001,20171231,19803.3,0]
[null,"CHIHUAHUA","08DPT0002B",100,"PEAU670611696","PEAU670611HTSRRB03","ABEL PEREZ URDIERA",30102,120,83101,1001,"00",26,"L5XATEC","10.0",1,3,null,20171001,20171231,18059.190000000002,0]
[null,"CHIHUAHUA","08DPT0002B",100,"PIMR770113LW6","PIMR770113MCLNXC04","ROCIO PINTO MUÑOZ",30102,240,83101,1001,"00",26,"L5XC","20.0",1,3,null,20171001,20171231,48164.02,0]
[null,"CHIHUAHUA","08DPT0002B",200,"POGH680928E46","POGH680928HCHRTC09","HECTOR MIGUEL PORRAS GUTIERREZ",30102,180,83101,1001,"00",26,"L5XCBII","15.0",1,3,null,20171001,20171231,32262.400000000001,0]
[null,"CHIHUAHUA","08DPT0002B",100,"QUMJ930605SD1","QUMJ930605HCHZRV04","JAVIER ARTURO QUEZADA MORA",30102,180,83101,1001,"00",26,"L5XATEC","15.0",1,3,null,20171001,20171231,3555.3]
[null,"CHIHUAHUA","08DPT0002B",100,"RABM8107186R9","RAVM810718MCHMRR16","MIRIAM SUSANA RAMIREZ BARRERA",30102,240,83101,1001,"00",26,"L5XC","20.0",1,3,null,20171001,20171231,47827.859999999993,0]
[null,"CHIHUAHUA","08DPT0002B",200,"RACJ670625F74","RACJ670625HCHMRN00","JUAN RAMON RAMIREZ CORRAL",30102,144,83101,1001,"00",26,"L5XC","12.0",1,3,null,20171001,20171231,29943.910000000003,0]
[null,"CHIHUAHUA","08DPT0002B",200,"RALK790326386","RALK790326MCHMPR08","KARINA CECILIA RAMIREZ LOPEZ",30102,228,83101,1001,"00",26,"L5XC","19.0",1,3,null,20171001,20171231,45548.21,0]
[null,"CHIHUAHUA","08DPT0002B",100,"RAVJ750924S61","RAVJ750924HCHMLN06","JUAN GABRIEL RAMIREZ VELA",30102,204,83101,1001,"00",26,"L5XCBII","17.0",1,3,null,20171001,20171231,36859.100000000006,0]
[null,"CHIHUAHUA","08DPT0002B",100,"REFG8206303T2","REFG820630MCLYLR05","GRISELDA REYES FLORES",30102,180,83101,1001,"00",26,"L5XATEC","15.0",1,3,null,20171001,20171231,23185.119999999999,0]
[null,"CHIHUAHUA","08DPT0002B",100,"RIOH600504T14","RIOH600504HCHVLC08","HECTOR RAMON RIVERA OLIVAS",30102,192,83101,1001,"00",26,"L5XC","16.0",1,3,null,20171001,20171231,39047.65,0]
[null,"CHIHUAHUA","08DPT0002B",100,"ROAL7201241P5","ROAL720124MCHDVD01","LIDIA ANGELICA RODRIGUEZ AVILA",30102,228,83101,1001,"00",26,"L5XC","19.0",1,3,null,20171001,20171231,45304.250000000007,0]
[null,"CHIHUAHUA","08DPT0002B",200,"ROMM8706134U5","ROMM870613HCHDNN05","MANUEL ANTONIO RODRIGUEZ MONREAL",30102,180,83101,1001,"00",26,"L5XATEC","15.0",1,3,null,20171001,20171231,3555.3]
[null,"CHIHUAHUA","08DPT0002B",100,"ROPE5908038V9","ROPE590803HCHDRL01","ELIGIO RODRIGUEZ PRIETO",30102,216,83101,1001,"00",26,"L5XCBII","18.0",1,3,null,20171001,20171231,37734.07,0]
[null,"CHIHUAHUA","08DPT0002B",200,"ROVM860804PC7","ROVM860804HCHDLN05","JOSE MANUEL  RODRIGUEZ VILLA",30102,120,83101,1001,"00",26,"L5XCBII","10.0",1,3,null,20171001,20171231,21198.55,0]
[null,"CHIHUAHUA","08DPT0002B",200,"SAVY820923BCA","SAVY820923MCHLLM00","YAMET VERENICE SALAZAR VELAZQUEZ",30102,240,83101,1001,"00",26,"L5XC","20.0",1,3,null,20171001,20171231,47533.08,0]
[null,"CHIHUAHUA","08DPT0002B",200,"SELV800114DJ4","SELV800114HCHGZC03","VICTOR ANDRES SEGOVIA LOZOYA",30102,180,83101,1001,"00",26,"L5XC","15.0",1,3,null,20171001,20171231,35390.19,0]
[null,"CHIHUAHUA","08DPT0002B",100,"SOOA7210299X8","SOOA721029MCHLLN06","ANA LUISA SOLIS OLIVAS",30102,240,83101,1001,"00",26,"L5XC","20.0",1,3,null,20171001,20171231,46908.68,0]
[null,"CHIHUAHUA","08DPT0002B",100,"TERG520428J43","TERG520428HDFLVL09","GUILLERMO TELLEZ REVILLA",30102,168,83101,1001,"00",26,"L5XC","14.0",1,3,null,20171001,20171231,33341.14,0]
[null,"CHIHUAHUA","08DPT0002B",100,"VAOA630813IE8","VAOA630813MDGLRN07","ANGELA MARIA VALTIERRA  ORTEGA",30102,204,83101,1001,"00",26,"L5XC","17.0",1,3,null,20171001,20171231,41634.969999999994,0]
[null,"CHIHUAHUA","08DPT0002B",100,"VEGD970725699","VEGD970725HCHNNN08","DANIEL ARTURO VENZOR GONZALEZ",30102,120,83101,1001,"00",26,"L5XCBI","10.0",1,3,null,20171001,20171231,13940.169999999998,0]
[null,"CHIHUAHUA","08DPT0002B",200,"YAGC8511285X6","YAGC851128MCHXNY03","CYNTHIA AURORA YAÑEZ GONZALEZ",30102,240,83101,1001,"00",26,"L5XCBII","20.0",1,3,null,20171001,20171231,41334.35,0]
[null,"CHIHUAHUA","08DPT0002B",200,"AUPC720823T59","AUPC720823MZSGLL09","CLARA AGÜERO PALACIOS","20211",480,83101,1003,"00",26,"S01202",0,2434,2,null,20171001,20171231,44427.96,0]
[null,"CHIHUAHUA","08DPT0002B",120,"AUSL630319SGO","AUSL630319HZSGFC09","JOSE LUCIANO AGUILERA SIFUENTES","20101",480,83101,1003,"00",26,"CF33206",0,13754,2,null,20171001,20171231,184352.16999999998,0]
[null,"CHIHUAHUA","08DPT0002B",100,"AAAJ9101208M3","AAAJ910120HCHLCS03","JESUS FABIAN ALVARADO  ACOSTA","20401",480,83101,1003,"00",26,"S01201",0,2431,2,null,20171001,20171231,63378.78,0]
[null,"CHIHUAHUA","08DPT0002B",100,"AAAN671110TZ0","AAAN671110MCHLCC06","NICOLASA ALVARADO  ACOSTA","20201",480,83101,1003,"00",26,"CF33204",0,9182,2,null,20171001,20171231,157866.05000000002,0]
[null,"CHIHUAHUA","08DPT0002B",100,"AAEM620508I55","AAEM620508HCLLSG04","MIGUEL ANGEL ALVARADO  ESPARZA","20401",480,83101,1003,"00",26,"CF19201",0,2447,2,null,20171001,20171231,73594.41,0]
[null,"CHIHUAHUA","08DPT0002B",120,"AISJ790419494","AISJ790419HCHRTN04","JUAN MANUEL ARIAS  SOTELO","20206",480,83101,1003,"00",26,"CF33204",0,2435,2,null,20171001,20171231,123173.94999999998,0]
[null,"CHIHUAHUA","08DPT0002B",100,"BAML650601B92","BAML650601HDFRLS03","JOSE LUIS  BARRIENTOS MILAN","20401",480,83101,1003,"00",26,"CF18201",0,2422,2,null,20171001,20171231,56976.46,0]
[null,"CHIHUAHUA","08DPT0002B",200,"BOMA6710214E1","BOMA671021HDFLXR07","ARMANDO BOLAÑOS MUÑOZ","20205",480,83101,1003,"00",26,"CF33204",0,2432,2,null,20171001,20171231,151802.12,0]
[null,"CHIHUAHUA","08DPT0002B",100,"CAPL820818LQ5","CAPL820818HCHMRS04","LUIS ROBERTO CAMPOS PORTILLO","20206",480,83101,1003,"00",26,"S01202",0,10590,2,null,20171001,20171231,66845.79250000001,0]
[null,"CHIHUAHUA","08DPT0002B",100,"CACL731031A17","CACL731031MCHRNR01","LORENA CARRILLO CANO","20215",480,83101,1003,"00",26,"S01202",0,2426,2,null,20171001,20171231,56391.560000000005,0]
[null,"CHIHUAHUA","08DPT0002B",100,"CARJ6012178GA","CARJ601217HCHRLS07","JOSE DE JESUS CARRILLO RUELAS","20401",480,83101,1003,"00",26,"S01202",0,2434,2,null,20171001,20171231,73991.330000000016,0]
[null,"CHIHUAHUA","08DPT0002B",100,"CARP8408274S7","CARP840827MCHHCR02","PERLA CHAVEZ ROCHA","20206",480,83101,1003,"00",26,"CF04201",0,2418,2,null,20171001,20171231,80723.23,0]
[null,"CHIHUAHUA","08DPT0002B",120,"CIBA710920FVA","CIBA710920MDGTRL04","ALMA ROSA CITAL BERTAHUD","20101",480,83101,1003,"00",26,"CF33206",0,14304,2,null,20171001,20171231,173022.32,0]
[null,"CHIHUAHUA","08DPT0002B",200,"COMA6908143J5","COXM690814HCHNXR11","MARIO CONTRERAS N/A","20206",480,83101,1003,"00",26,"CF18203",0,2420,2,null,20171001,20171231,87514.52,0]
[null,"CHIHUAHUA","08DPT0002B",100,"DEMA661118M56","DEMA661118HCHLRB07","JOSE ABELARDO DELGADO  MORALES","20205",480,83101,1003,"00",26,"CF33204",0,2429,2,null,20171001,20171231,137661.41,0]
[null,"CHIHUAHUA","08DPT0002B",200,"FACF8611101I7","FACF861110HCHVNR02","FERNANDO FAVELA  CONTRERAS","20401",480,83101,1003,"00",26,"S01201",0,2444,2,null,20171001,20171231,57994.98,0]
[null,"CHIHUAHUA","08DPT0002B",100,"FIGS610608SA8","FIGS610608MJCGNL02","SILVIA FIGUEROA GONZALEZ","20206",480,83101,1003,"00",26,"CF33204",0,2433,2,null,20171001,20171231,140565.17000000001,0]
[null,"CHIHUAHUA","08DPT0002B",120,"FOLC560327T8A","FOLC560327MDFLRR07","MARIA DEL CARMEN FLORES  LARA","20101",480,83101,1003,"00",26,"CF33206",0,9278,2,null,20171001,20171231,166561.01999999999,0]
[null,"CHIHUAHUA","08DPT0002B",200,"GAMA6609167M4","GAXM660916MCHLXR06","MARIBEL GALLARDO N/A","20216",480,83101,1003,"00",26,"CF34201",0,11119,2,null,20171001,20171231,71965.22,0]
[null,"CHIHUAHUA","08DPT0002B",100,"GAAD780823GZ6","GAAD780823MCHRLL01","DULCE AURORA DEL CONSUELO GARCIA ALEMAN",20214,480,83101,1003,"00",26,"CF33204",0,10007,2,null,20171001,20171231,86767.94,0]
[null,"CHIHUAHUA","08DPT0002B",100,"GALE580105G5A","GALE580105HCHRNN03","ENRIQUE GARCIA DE LUNA","20302",480,83101,1003,"00",26,"S01202",0,2421,2,null,20171001,20171231,69719.39,0]
[null,"CHIHUAHUA","08DPT0002B",100,"HERO621113HM2","HEXR621113HCHRXG06","ROGELIO HERNANDEZ N/A","20202",480,83101,1003,"00",26,"CF33204",0,2450,2,null,20171001,20171231,140198.15,0]
[null,"CHIHUAHUA","08DPT0002B",100,"LAGP591112155","LAGP591112HCHRYD07","PEDRO LARES GAYTAN","20302",480,83101,1003,"00",26,"S01202",0,2455,2,null,20171001,20171231,69260.179999999993,0]
[null,"CHIHUAHUA","08DPT0002B",100,"LIHJ9107073M0","LIHJ910707HCHRRS09","JASSON RAYMUNDO LIRA HERRERA","20211",480,83101,1003,"00",26,"S01201",0,2428,2,null,20171001,20171231,61113.43,0]
[null,"CHIHUAHUA","08DPT0002B",120,"LIMR6608162E8","LIMR660816HZSRNY01","RAYMUNDO LIRA MENDOZA","20108",480,83101,1003,"00",26,"CF33206",0,13756,2,null,20171001,20171231,184677.54,0]
[null,"CHIHUAHUA","08DPT0002B",100,"LOCJ6307091T8","LOCJ630709HCHPRS08","JESUS MARTIN LOPEZ CARO","20102",480,83101,1003,"00",26,"CF33206",0,13757,2,null,20171001,20171231,170813.44255000001,0]
[null,"CHIHUAHUA","08DPT0002B",100,"LORE9304089K5","LORE930408HCHYSR01","EARVIN MANUEL LOYA  RIOS","20205",480,83101,1003,"00",26,"CF18201",0,2453,2,null,20171001,20171231,53861.55,0]
[null,"CHIHUAHUA","08DPT0002B",200,"LOCJ681030V96","LOCJ681030HCHZLS07","JESUS EDUARDO LOZOYA  CALDERON","20302",480,83101,1003,"00",26,"A03202",0,2419,2,null,20171001,20171231,72062.53,0]
[null,"CHIHUAHUA","08DPT0002B",100,"MELE5809218Z2","MELE580921MCHDLG09","MARIA EUGENIA  MEDINA LEAL","20216",480,83101,1003,"00",26,"CF33206",0,2441,2,null,20171001,20171231,16785.11,0]
[null,"CHIHUAHUA","08DPT0002B",200,"MECR611201JJA","MECR611201HCHZRL15","RAUL MEZA CARDONA","20305",480,83101,1003,"00",26,"CF18203",0,2442,2,null,20171001,20171231,89082.860000000015,0]
[null,"CHIHUAHUA","08DPT0002B",100,"MODC711228F67","MODC711228HCLNRR07","CARLOS EDUARDO MONTANO DURAN",50201,480,83101,1003,"00",26,"CF02103",0,12681,5,null,20171001,20171231,127229.55999999998,0]
[null,"CHIHUAHUA","08DPT0002B",100,"MOSG761016858","MOSG761016HCLNNR06","GERARDO MONTOYA SANCHEZ","20401",480,83101,1003,"00",26,"S01201",0,2440,2,null,20171001,20171231,68734.490000000005,0]
[null,"CHIHUAHUA","08DPT0002B",100,"OOGL660522NA4","OOGL660522HCHCRS08","LUIS FELIX OCHOA GARCIA","20401",480,83101,1003,"00",26,"CF19201",0,2451,2,null,20171001,20171231,60189.570000000007,0]
[null,"CHIHUAHUA","08DPT0002B",100,"OORE7405071DA","OORE740507MCHRYS00","MARIA ESTHER OROZCO REYES","20211",480,83101,1003,"00",26,"ED01201",0,2424,2,null,20171001,20171231,77318.150000000009,0]
[null,"CHIHUAHUA","08DPT0002B",100,"RARF8407015TA","RARF840701MCHMML00","FLOR MINERVA RAMIREZ RAMIREZ","20214",480,83101,1003,"00",26,"CF34202",0,2457,2,null,20171001,20171231,71571.75,0]
[null,"CHIHUAHUA","08DPT0002B",200,"ROGJ6511161S5","ROGJ651116HDGCRN00","JUAN JESUS ROCHA GARCIA","20301",480,83101,1003,"00",26,"CF18203",0,2436,2,null,20171001,20171231,70070.899999999994,0]
[null,"CHIHUAHUA","08DPT0002B",100,"ROGM631230AD4","ROGM631230MCHMRR18","MARCIA IMELDA ROMERO GARCIA","20406",480,83101,1003,"00",26,"S01202",0,131,2,null,20171001,20171231,55360.9,0]
[null,"CHIHUAHUA","08DPT0002B",100,"ROCS700130LMA","ROCS700130MDGDLL00","SILVIA ESTELA RODRIGUEZ CALVILLO","50408",480,83101,1003,"00",26,"CF02105",0,14574,5,null,20171001,20171231,63508.11,0]
[null,"CHIHUAHUA","08DPT0002B",120,"SAPP7109042V0","SAPP710904HCHLLD06","PEDRO SALAS PALOMINO","20214",480,83101,1003,"00",26,"CF33204",0,2459,2,null,20171001,20171231,137537.49000000002,0]
[null,"CHIHUAHUA","08DPT0002B",100,"VASC8109266G6","VASC810926MCHLLL08","CLAUDIA VALVERDE SALAZAR","20211",480,83101,1003,"00",26,"ED01201",0,2445,2,null,20171001,20171231,73766.070000000007,0]
[null,"CHIHUAHUA","08DPT0002B",100,"VAFM681203S84","VAFM681203MCHZGR05","MARICRUZ VAZQUEZ FIGUEROA","20203",480,83101,1003,"00",26,"CF19201",0,2451,2,null,20171001,20171231,126492.94100000002,0]
[null,"CHIHUAHUA","08DPT0003A",120,"AOOC791125GF8","AOOC791125HCHLRR17","ALOR ORTEGA CRISTHIAN OMAR",20109,480,83101,1003,"01",56,"CF33206",0,13763,2,null,20171001,20171231,149338.60999999999,0]
[null,"CHIHUAHUA","08DPT0003A",120,"AEHL721013358","AEHL721013MCHRRR04","ARMENDARIZ HUERTA LAURA ELENA",20216,480,83101,1003,"01",56,"CF19201",0,7495,2,null,20171001,20171231,73579.64,0]
[null,"CHIHUAHUA","08DPT0003A",120,"AOGA850323MS8","AOGA850323MCHRRD09","ARZOLA GARIBAY ADRIANA",20216,480,83101,1003,"01",56,"CF33203",0,7484,2,null,20171001,20171231,80270.929999999993,0]
[null,"CHIHUAHUA","08DPT0003A",120,"BALJ741015QJ5","BALJ741015HNTCPR09","BACA LOPEZ JORGE GERARDO",50401,480,83101,1003,"01",56,"CF02103",0,12683,5,null,20171001,20171231,140468.49,0]
[null,"CHIHUAHUA","08DPT0003A",120,"CALS630411D26","CALS630411HCHNSL01","CANO LEOS SALVADOR",20206,480,83101,1003,"01",56,"CF02103",0,12683,5,null,20171001,20171231,167245.85999999999,0]
[null,"CHIHUAHUA","08DPT0003A",120,"COSC761202AU8","COSC761202MCHRNL00","CORONADO SAENZ CLAUDIA",20215,480,83101,1003,"01",56,"CF02105",0,14575,2,null,20171001,20171231,76141.61,0]
[null,"CHIHUAHUA","08DPT0003A",120,"CORE740806FH5","CORE740806HCHRYN08","CORRAL REYES ENCARNACION",20401,480,83101,1003,"01",56,"CF34202",0,7498,2,null,20171001,20171231,61737.57,0]
[null,"CHIHUAHUA","08DPT0003A",120,"EABJ810502G45","EABJ810502HCHSYR08","ESPARZA BAYLON JORGE HUMBERTO",20215,480,83101,1003,"01",56,"S01201",0,7498,2,null,20171001,20171231,60194.17,0]
[null,"CHIHUAHUA","08DPT0003A",120,"EIHE740513ST9","EIHE740513MCHSRV03","ESPINOSA HERNANDEZ EVA CELINA",20216,480,83101,1003,"01",56,"CF33206",0,14307,2,null,20171001,20171231,132408.75,0]
[null,"CHIHUAHUA","08DPT0003A",120,"FAJA861008RA4","FAJA861008MCHRRL05","FRANCO JURADO MARIA ALEJANDRA",20216,480,83101,1003,"01",56,"CF33206",0,13765,2,null,20171001,20171231,103495.39,0]
[null,"CHIHUAHUA","08DPT0003A",120,"GAFS650908R84","GAFS650908HCHRLR07","GARCIA FLORES SERGIO MARTIN",20212,480,83101,1003,"01",56,"A03202",0,7472,2,null,20171001,20171231,81335.42,0]
[null,"CHIHUAHUA","08DPT0003A",120,"GAAG630825HU2","GAAG630825HCHRLR06","GARDEA ALEMAN GREGORIO",20302,480,83101,1003,"01",56,"A03202",0,7473,2,null,20171001,20171231,81356.45,0]
[null,"CHIHUAHUA","08DPT0003A",120,"GAAV670716S40","GAAV670716HCHRRC06","GARDEA ARREDONDO VICTOR MANUEL",20206,480,83101,1003,"01",56,"CF34201",0,7504,2,null,20171001,20171231,130894.06,0]
[null,"CHIHUAHUA","08DPT0003A",120,"GAHA8701284V2  ","GAHA870128HCHRRL07","GARDEA HEREDIA ALVARO",20401,480,83101,1003,"01",56,"S01201",0,7480,2,null,20171001,20171231,55723.5,0]
[null,"CHIHUAHUA","08DPT0003A",120,"GODK810903VC5","GODK810903MCHNVN04","GONZALES DAVILA KENNIS",50401,480,83101,1003,"01",56,"CF33206",0,14306,2,null,20171001,20171231,96985.919999999998,0]
[null,"CHIHUAHUA","08DPT0003A",120,"GOVJ720801R43","GOVJ720801MCHNLD09","GONZALEZ VALLES JUDITH",20201,480,83101,1003,"01",56,"CF33204",0,7493,2,null,20171001,20171231,202819.14,0]
[null,"CHIHUAHUA","08DPT0003A",120,"HESH611022NF3","HESH611022HCHRNL03","HEREDIA SAENZ HILADRIO",20401,480,83101,1003,"01",56,"S01201",0,7485,2,null,20171001,20171231,71556.88,0]
[null,"CHIHUAHUA","08DPT0003A",120,"HEGM7510295L3","HEGM751029MCHRTY07","HERNANDEZ GUTIERREZ MAYRA VERONICA",20215,480,83101,1003,"01",56,"CF33206",0,13762,2,null,20171001,20171231,81724.09,0]
[null,"CHIHUAHUA","08DPT0003A",120,"MEHP811017GD5","MEHP811017HCHNRL02","MENDEZ HERRERA PAUL ALONSO",20402,480,83101,1003,"01",56,"S01201",0,7479,2,null,20171001,20171231,68812.14,0]
[null,"CHIHUAHUA","08DPT0003A",120,"MEMD550401S32","MEMD550401HCHNTL01","MENDEZ MOTA JOSE DOLORES",20401,480,83101,1003,"01",56,"CF04201",0,10159,2,null,20171001,20171231,70479.100000000006,0]
[null,"CHIHUAHUA","08DPT0003A",120,"MOIR7306072Z5","MOIR730607HCHLBM08","MOLINA IBARRA RAMON HUMBERTO",20401,480,83101,1003,"01",56,"CF18201",0,7491,2,null,20171001,20171231,57779,0]
[null,"CHIHUAHUA","08DPT0003A",120,"MOAM570729HK3","MOAM570729HCHNRN02","MONTES ARZOLA MANUEL",20401,480,83101,1003,"01",56,"S01201",0,7494,2,null,20171001,20171231,71871.03,0]
[null,"CHIHUAHUA","08DPT0003A",120,"MOHR810216267","MOHR810216HCHNLN06","MONTES HOLGUIN RENE GUADALUPE",20401,480,83101,1003,"01",56,"S01201",0,7494,2,null,20171001,20171231,38290.83,0]
[null,"CHIHUAHUA","08DPT0003A",120,"MOME800109M88","MOME900109MCHNNS03","MONTES MONTES ESMERALDA JANETH",20401,480,83101,1003,"01",56,"A03202",0,7472,2,null,20171001,20171231,46745.75,0]
[null,"CHIHUAHUA","08DPT0003A",120,"MOCY820701FR6","MOCY820701MCHRHS01","ORTIZ CHAVEZ MARTHA ELVIRA",20201,480,83101,1003,"01",56,"S01201",0,7492,2,null,20171001,20171231,102963.99,0]
[null,"CHIHUAHUA","08DPT0003A",120,"PECF611129NU5","PECF611129MOCRSL04","PEREZ CASTRO FILOMENA IRMA",20216,480,83101,1003,"01",56,"CF33204",0,7489,2,null,20171001,20171231,81376.98,0]
[null,"CHIHUAHUA","08DPT0003A",120,"PESB570420393","PESB570420HCHRSN03","PEREZ SOSA BENJAMIN",20401,480,83101,1003,"01",56,"CF21202",0,7499,2,null,20171001,20171231,60122.83,0]
[null,"CHIHUAHUA","08DPT0003A",120,"QURM641112699","QURM641112HCHXMR08","QUIÑONEZ RAMIREZ MARTIN RENE",20302,480,83101,1003,"01",56,"S01202",0,7500,2,null,20171001,20171231,76633.25,0]
[null,"CHIHUAHUA","08DPT0003A",120,"QUYA890925FF7","QUYA890925MCHXXN07","QUIÑONEZ YAÑEZ ANABEL",20215,480,83101,1003,"01",56,"S01202",0,7501,2,null,20171001,20171231,65003.03,0]
[null,"CHIHUAHUA","08DPT0003A",120,"RAGH640227EZ9","RAGH640227HCLMTR04","RAMIREZ GUTIERREZ JOSE HORACIO",20205,480,83101,1003,"01",56,"AO3202",0,7470,2,null,20171001,20171231,193045.41,0]
[null,"CHIHUAHUA","08DPT0003A",120,"SUCM720601QH7","SUCM720601MCHRRY01","SUAREZ CORRAL MYRNA MANUELA",20214,480,83101,1003,"01",56,"CF33206",0,14306,2,null,20171001,20171231,135416.20000000001,0]
[null,"CHIHUAHUA","08DPT0003A",120,"YADR7710046J3","YADR771004MCHXZS02","YAÑEZ DIAZ ROSA IVONNE",20214,480,83101,1003,"01",56,"CF33204",0,7487,2,null,20171001,20171231,111947.69,0]
[null,"CHIHUAHUA","08DPT0003A",100,"AOCF7610047IA","AOCF761204HCHCBR06","FRANCISCO ACOSTA CONTRERAS",30102,192,83101,1001,"01",56,"L5XCBII",16,1,3,null,20171001,20171231,38660.79,0]
[null,"CHIHUAHUA","08DPT0003A",100,"AOMM7702115QA","AOMM770211MCHCRD18","MIDIAM LOURDES ACOSTA MERAZ",30102,240,83101,1001,"01",56,"L5XCBII",20,1,3,null,20171001,20171231,40907.550000000003,0]
[null,"CHIHUAHUA","08DPT0003A",100,"AUQN701229GT2","AUQN701229MCHGNR05","NORMA AGUIRRE QUINTANA ",30102,240,83101,1001,"01",56,"L5XCBII",20,1,3,null,20171001,20171231,41587.279999999999,0]
[null,"CHIHUAHUA","08DPT0003A",100,"AAHE730629HA8","AAHE730629HDGLRD05","EDGAR JESUS ALBA HERNANDEZ",30102,240,83101,1001,"01",56,"L5XCBII",20,1,3,null,20171001,20171231,40767.64,0]
[null,"CHIHUAHUA","08DPT0003A",200,"AEOP850816BU5","AEOP850816HCHRLD08","PEDRO RAFAEL ARMENDARIZ OLIVAS",30102,240,83101,1001,"01",56,"L5XC",20,1,3,null,20171001,20171231,45970.98,0]
[null,"CHIHUAHUA","08DPT0003A",120,"AERG670801H43","AERG670801HCHRVB09","GABRIEL ARMENDARIZ RIVAS",30102,192,83101,1001,"01",56,"L5XC",16,1,3,null,20171001,20171231,38687.980000000003,0]
[null,"CHIHUAHUA","08DPT0003A",200,"BASJ720920637","BASJ720920HCHCMV04","JAVIER BACA SAMPER",30102,216,83101,1001,"01",56,"L5XC",18,1,3,null,20171001,20171231,39182.5,0]
[null,"CHIHUAHUA","08DPT0003A",100,"BAMF820909BC1","BAMF820909MCHLRT08","FATIMA DEL CARMEN BALDERAS MORALES",30102,240,83101,1001,"01",56,"L5XC",20,1,3,null,20171001,20171231,48700.81,0]
[null,"CHIHUAHUA","08DPT0003A",200,"CACF650131IUA","CACF650131HCHNHL00","FILIBERTO CANO CHAVEZ",30102,204,83101,1001,"01",56,"L5XCBI",17,1,3,null,20171001,20171231,34227.519999999997,0]
[null,"CHIHUAHUA","08DPT0003A",100,"CALA591128150","CALA591128HCHNSB00","ABRAHAM CANO LEOS",30102,180,83101,1001,"01",56,"L5XC",15,1,3,null,20171001,20171231,34356.79,0]
[null,"CHIHUAHUA","08DPT0003A",200,"CATI910806HS0","CATI910806HCHRRV03","IVAN DOROTEO CARRERA DE LA TORRE",30102,240,83101,1001,"01",56,"L5XCBI",20,1,3,null,20171001,20171231,37635.370000000003,0]
[null,"CHIHUAHUA","08DPT0003A",200,"CATN8302135X1","CATN830213MCHRRD06","NADIA BEATRIZ CARRERA DE LA TORRE",30102,240,83101,1001,"01",56,"L5XC",20,1,3,null,20171001,20171231,48147.39,0]
[null,"CHIHUAHUA","08DPT0003A",100,"CAGG681119QE9","CAGG681119MCHRRB25","MARIA GABRIELA CARRILLO GARDEA",30102,216,83101,1001,"01",56,"L5XC",18,1,3,null,20171001,20171231,48244.31,0]
[null,"CHIHUAHUA","08DPT0003A",100,"CATA900830PFA","CATA900830MCHRRL03","ALEJANDRA IVETTE  CARRILLO TRUJILLO",30102,216,83101,1001,"01",56,"L5XCBI",18,1,3,null,20171001,20171231,34377.67,0]
[null,"CHIHUAHUA","08DPT0003A",100,"CATI851219KEA","CATI851219MCHRRR12","IRMA RAQUEL CARRILLO TRUJILLO",30102,240,83101,1001,"01",56,"L5XC",20,1,3,null,20171001,20171231,46736.13,0]
[null,"CHIHUAHUA","08DPT0003A",100,"CAGL680404GU5","CAGL680404MCHSTT08","LETICIA CASILLAS GUTIERREZ",30102,240,83101,1001,"01",56,"L5XC",20,1,3,null,20171001,20171231,48867.74,0]
[null,"CHIHUAHUA","08DPT0003A",100,"CEBC880121MJ0","CEBC880121MCHBCL06","CLAUDIA INES CEBALLOS BACA",30102,120,83101,1001,"01",56,"L5XCBII",10,1,3,null,20171001,20171231,26118.799999999999,0]
[null,"CHIHUAHUA","08DPT0003A",200,"CEHF701204P69","CEHF701204HDGRRR02","FRANCISCO JAVIER CERENIL HERRERA",30102,216,83101,1001,"01",56,"L5XC",18,1,3,null,20171001,20171231,47893.17,0]
[null,"CHIHUAHUA","08DPT0003A",200,"CACJ850309TV6","CACJ850309HCHHHV05","JAVIER ISAAC CHAVEZ CHAVEZ",30102,120,83101,1001,"01",56,"L5XCBII",10,1,3,null,20171001,20171231,21443.11,0]
[null,"CHIHUAHUA","08DPT0003A",100,"CASC781201J96","CASC781201MCHHNR02","CORINA CHAVEZ SANCHEZ",30102,180,83101,1001,"01",56,"L5XC",15,1,3,null,20171001,20171231,39655.46,0]
[null,"CHIHUAHUA","08DPT0003A",200,"DERI7801118J5","DEXR780111HCHLXC03","RICARDO DELGADO",30102,216,83101,1001,"01",56,"L5XC",18,1,3,null,20171001,20171231,42719.66,0]
[null,"CHIHUAHUA","08DPT0003A",200,"LEPJ860727765","LEPJ860727HCHNRV08","JAVIER EDUVIGES DE LEON PARADA",30102,192,83101,1001,"01",56,"L5XCBI",16,1,3,null,20171001,20171231,30849.119999999999,0]
[null,"CHIHUAHUA","08DPT0003A",100,"EARD8007284EA","EARD800728MCHSCL06","DULCE MARGARITA ELIZABETH ESCALANTE ROCHA",30102,240,83101,1001,"01",56,"L5XC",20,1,3,null,20171001,20171231,48135.91,0]
[null,"CHIHUAHUA","08DPT0003A",100,"FEAL8707295J5","DUPB710508MCHRRR02","LUIS RAUL FERNANDEZ ACOSTA",30102,240,83101,1001,"01",56,"L5XC",20,1,3,null,20171001,20171231,48803.13,0]
[null,"CHIHUAHUA","08DPT0003A",200,"GAQL770122HI2","GAQL770122MCHLXZ06","LUZ ELIZABETH GALVAN QUIÑONEZ",30102,216,83101,1001,"01",56,"L5XC",18,1,3,null,20171001,20171231,43221.58,0]
[null,"CHIHUAHUA","08DPT0003A",200,"GACP590517NU6","GACP590517MCHRHT05","PATRICIA EUGENIA GARCIA CHAVEZ",30102,240,83101,1001,"01",56,"L5XC",20,1,3,null,20171001,20171231,47895.55,0]
[null,"CHIHUAHUA","08DPT0003A",100,"GARJ67122131A","GARJ671221HCHRZM09","JAIME GARCIA RUIZ",30102,240,83101,1001,"01",56,"L5XC",20,1,3,null,20171001,20171231,46809.25,0]
[null,"CHIHUAHUA","08DPT0003A",200,"GOGA810922999","GOGA810922HCHNRG02","AGUSTIN GONZALEZ GARCIA",30102,240,83101,1001,"01",56,"L5XC",20,1,3,null,20171001,20171231,46080.77,0]
[null,"CHIHUAHUA","08DPT0003A",200,"GOGJ8811064X6","GOGJ881106MCHNTS09","JESSICA JANETH GONZALEZ GUTIERREZ",30102,240,83101,1001,"01",56,"L5XCBII",20,1,3,null,20171001,20171231,42331.7,0]
[null,"CHIHUAHUA","08DPT0003A",100,"GOHD580525IP0","GOHD580525HCHNRV01","DAVID GONZALEZ HERNANDEZ",30102,228,83101,1001,"01",56,"L5XCBI",19,1,3,null,20171001,20171231,35633.730000000003,0]
[null,"CHIHUAHUA","08DPT0003A",100,"GUCG610126B56","GUCG610126HCHTNR03","JOSE GERARDO GUTIERREZ CONTRERAS",30102,120,83101,1001,"01",56,"L5XC",10,1,3,null,20171001,20171231,24638.29,0]
[null,"CHIHUAHUA","08DPT0003A",100,"HEAV711202QZ8","HEAV711202MCHRGV01","VIVIANA HERNANDEZ AGUILERA",30102,228,83101,1001,"01",56,"L5XC",19,1,3,null,20171001,20171231,45395.92,0]
[null,"CHIHUAHUA","08DPT0003A",120,"HEAA900716PY3","HEAA900716HCHRGL00","ALFREDO HERNANDEZ AGUIRRE",30102,192,83101,1001,"01",56,"L5XCBI",160,1,3,null,20171001,20171231,30366.560000000001,0]
[null,"CHIHUAHUA","08DPT0003A",200,"HEAA881029IG6","HEAA881029MCHRNN04","ANGELICA HERNANDEZ ANGEL",30102,216,83101,1001,"01",56,"L5XC",18,1,3,null,20171001,20171231,38898.959999999999,0]
[null,"CHIHUAHUA","08DPT0003A",200,"HISE750912LP7","HISE750912MCHNNT05","ETHEL JANETH HINOJOS SANCHEZ",30102,240,83101,1001,"01",56,"L5XCBII",20,1,3,null,20171001,20171231,40944.07,0]
[null,"CHIHUAHUA","08DPT0003A",200,"HOOJ841127R23","HOOJ841127HCHLJS04","JESUS MANUEL HOLGUIN OJEDA",30102,240,83101,1001,"01",56,"L5XC",20,1,3,null,20171001,20171231,47503.13,0]
[null,"CHIHUAHUA","08DPT0003A",100,"HOQS841119E44","HOQS841119MCHLNL02","SILVIA HOLGUIN QUINTANA",30102,120,83101,1001,"01",56,"L5XC",10,1,3,null,20171001,20171231,30430.93,0]
[null,"CHIHUAHUA","08DPT0003A",100,"IEPA690710861","IEPA690710HZSRRL07","ALEJANDRO IRENE PEREZ",30102,120,83101,1001,"01",56,"L5XC",10,1,3,null,20171001,20171231,47688.85,0]
[null,"CHIHUAHUA","08DPT0003A",100,"JUEM870729SW2","JUEM870729MCHRSR04","MARINA JUAREZ ESPARZA",30102,228,83101,1001,"01",56,"L5XCBI",19,1,3,null,20171001,20171231,25096.12,0]
[null,"CHIHUAHUA","08DPT0003A",120,"JUGE790622JJ2","JUGE790622HCHRRD03","EDGAR ELIEL JUAREZ GRAJEDA",30102,240,83101,1001,"01",56,"L5XC",20,1,3,null,20171001,20171231,48153.13,0]
[null,"CHIHUAHUA","08DPT0003A",100,"JUAL910425AX8","JUAL910425MCHRLL09","LILIAN JURADO ALVAREZ",30102,36,83101,1001,"01",56,"L5XCBI",18,1,3,null,20171001,20171231,5721.42,0]
[null,"CHIHUAHUA","08DPT0003A",200,"LARJ611212G44","LARJ611212HCHZDL03","JOEL GUADALUPE LAZCANO RODRIGUEZ",30102,156,83101,1001,"01",56,"L5XCBI",13,1,3,null,20171001,20171231,25796.400000000001,0]
[null,"CHIHUAHUA","08DPT0003A",100,"LOGJ770422620","LOGJ770422HCHPRL08","JOEL ALONSO LOPEZ GRANADOS",30102,240,83101,1001,"01",56,"L5XC",20,1,3,null,20171001,20171231,48780.15,0]
[null,"CHIHUAHUA","08DPT0003A",100,"LOSS7606157X9","LOSS760615MCHPLL02","SILVIA LOPEZ SALCIDO",30102,240,83101,1001,"01",56,"L5XC",20,1,3,null,20171001,20171231,48740.02,0]
[null,"CHIHUAHUA","08DPT0003A",200,"LOCM7912081Q9","LOCM791208MCHYLR09","MARTHA LAURA LOYA CELESTIN",30102,240,83101,1001,"01",56,"L5XC",20,1,3,null,20171001,20171231,48084.59,0]
[null,"CHIHUAHUA","08DPT0003A",200,"LUMA890208UY4","LUMA890208HCHNLL06","ALEJANDRO LUNA MOLINA",30102,228,83101,1001,"01",56,"L5XC",19,1,3,null,20171001,20171231,44406.89,0]
[null,"CHIHUAHUA","08DPT0003A",200,"MAAK800331I60","MAAK800331MCHCGR00","KAREN LOURDES MACIAS AGUIRRE",30102,180,83101,1001,"01",56,"L5XC",15,1,3,null,20171001,20171231,37637.800000000003,0]
[null,"CHIHUAHUA","08DPT0003A",100,"MAMF571028UH3","MAMF571028HCHRCR08","FRANCISCO ROBERTO MARTINEZ MACIAS",30102,168,83101,1001,"01",56,"L5XC",14,1,3,null,20171001,20171231,36833.660000000003,0]
[null,"CHIHUAHUA","08DPT0003A",100,"MAMS761009L43","MASS761009HCHRCR04","SERGIO RENE MARTINEZ MACIAS",30102,168,83101,1001,"01",56,"L5XCBI",14,1,3,null,20171001,20171231,28303.67,0]
[null,"CHIHUAHUA","08DPT0003A",100,"MAML781222TP2","MAML781222MCHRNR05","LAURA GABRIELA MARTINEZ MONARREZ",30102,180,83101,1001,"01",56,"L5XC",15,1,3,null,20171001,20171231,36262.78,0]
[null,"CHIHUAHUA","08DPT0003A",100,"MAPJ881207NN8","MAPJ881207MCHRRN07","JANETH DERAT MARTINEZ PROSPERO",30102,240,83101,1001,"01",56,"L5XC",20,1,3,null,20171001,20171231,48069.58,0]
[null,"CHIHUAHUA","08DPT0003A",100,"MARB780909MG5","MARB780909MCHRSR07","BRENDA SOCORRO MARTINEZ RIOS",30102,240,83101,1001,"01",56,"L5XC",20,1,3,null,20171001,20171231,48153.13,0]
[null,"CHIHUAHUA","08DPT0003A",200,"MEMP850117HB8","MEMP850117MCHNNL01","PALOMA DEL CARMEN MENDEZ MENDEZ",30102,180,83101,1001,"01",56,"L5XC",15,1,3,null,20171001,20171231,36816.9,0]
[null,"CHIHUAHUA","08DPT0003A",200,"MEHJ820821C9A","MEHJ820821HCHNRN06","JUAN CARLOS MENDIAS HERNANDEZ",30102,144,83101,1001,"01",56,"L5XC",12,1,3,null,20171001,20171231,28897.119999999999,0]
[null,"CHIHUAHUA","08DPT0003A",100,"MOHE761219ZR9","MOHE761219HCHNLD06","EDGAR OBEK MONTES HOLGUIN",30102,120,83101,1001,"01",56,"L5XC",10,1,3,null,20171001,20171231,36816.9,0]
[null,"CHIHUAHUA","08DPT0003A",100,"MOMA830930QR2","MOMA830930MCHRRN04","ANTONIA MORENO MORALES",30102,204,83101,1001,"01",56,"L5XC",17,1,3,null,20171001,20171231,43489.26,0]
[null,"CHIHUAHUA","08DPT0003A",100,"NAMR830722I63","NAMR830722MCHXNB01","REBECA DIANA NANEZ MENDOZA",30102,240,83101,1001,"01",56,"L5XCBI",20,1,3,null,20171001,20171231,37635.370000000003,0]
[null,"CHIHUAHUA","08DPT0003A",100,"PAQR840612BHA","PAQR840612HCHLXM03","JOSE RAMON PALMA QUIÑONEZ",30102,240,83101,1001,1,56,"L5XCBI",20,1,3,null,20171001,20171231,37259.230000000003,0]
[null,"CHIHUAHUA","08DPT0003A",100,"PAMZ880803S42","PAMZ880803MCHTRM09","ZAMISH GABRIELA PATIÑO MORALES",30102,240,83101,1001,"01",56,"L5XCBI",20,1,3,null,20171001,20171231,37637.78,0]
[null,"CHIHUAHUA","08DPT0003A",200,"PERO820514295","PERO820514HCHRMM06","OMAR ARMANDO PEREZ RAMIREZ",30102,240,83101,1001,"01",56,"L5XC",20,1,3,null,20171001,20171231,48153.13,0]
[null,"CHIHUAHUA","08DPT0003A",100,"QUVC860208IX4","QUVC860208MCHNLR06","CRISTINA QUINTANA VILLEGAS",30102,192,83101,1001,1,56,"L5XCBI",16,1,3,null,20171001,20171231,29671.37,0]
[null,"CHIHUAHUA","08DPT0003A",200,"QUGG830326LY2","QUGG830326MCHXRR05","GEORGINA ALHELI QUIÑONEZ GARCIA",30102,240,83101,1001,"01",56,"L5XC",20,1,3,null,20171001,20171231,48153.13,0]
[null,"CHIHUAHUA","08DPT0003A",120,"QUYD9206206GA","QUYD920620MCHXXN07","DANIA ANGELICA QUIÑONEZ YAÑEZ",30102,240,83101,1001,"01",56,"L5XCBI",20,1,3,null,20171001,20171231,37619.839999999997,0]
[null,"CHIHUAHUA","08DPT0003A",100,"RACG650805Q12","RACG650805HSRMNM07","GAMALIEL RAMOS CONTRERAS",30102,240,83101,1001,"01",56,"L5XCBII",20,1,3,null,20171001,20171231,40976.58,0]
[null,"CHIHUAHUA","08DPT0003A",200,"RACA620817IU7","RACA620817HCHSHN09","ANTONIO RASCON CHAVEZ",30102,216,83101,1001,"01",56,"L5XCBI",18,1,3,null,20171001,20171231,34477.89,0]
[null,"CHIHUAHUA","08DPT0003A",200,"RERH8005305SA","RERH800530HCHNDC03","HECTOR RAUL RENTERIA RODRIGUEZ",30102,240,83101,1001,"01",56,"L5XCBII",20,1,3,null,20171001,20171231,40703.660000000003,0]
[null,"CHIHUAHUA","08DPT0003A",100,"RIPS680731I67","RIPS680731HCHCRR07","SERGIO RICO PEREZ",30102,240,83101,1001,"01",56,"L5XCBI",20,1,3,null,20171001,20171231,34985.51,0]
[null,"CHIHUAHUA","08DPT0003A",200,"RIAJ830525SU3","RIAJ830525HCHVCM08","JAIME MICHAEL RIVERA ACOSTA",30102,240,83101,1001,"01",56,"L5XC",20,1,3,null,20171001,20171231,48141.65,0]
[null,"CHIHUAHUA","08DPT0003A",200,"ROSL891018R33","ROSL891018HCHDNS03","LUIS ISIDRO RODRIGUEZ SAENZ",30102,192,83101,1001,"01",56,"L5XCBII",16,1,3,null,20171001,20171231,34339.339999999997,0]
[null,"CHIHUAHUA","08DPT0003A",120,"ROSL8112066G9","ROSL811206HCHDFS05","LUIS CARLOS RODRIGUEZ SIFUENTES",30102,228,83101,1001,"01",56,"L5XC",19,1,3,null,20171001,20171231,45516.9,0]
[null,"CHIHUAHUA","08DPT0003A",100,"ROMC790529SQ8","ROMC790529HCHJZR03","CARLOS GERMAN ROJAS MEZA",30102,240,83101,1001,"01",56,"L5XC",20,1,3,null,20171001,20171231,48084.59,0]
[null,"CHIHUAHUA","08DPT0003A",100,"ROMJ820824341","ROMJ820824HCHMRN09","JUAN PABLO ROMO MARTINEZ",30102,120,83101,1001,"01",56,"L5XC",10,1,3,null,20171001,20171231,23772.63,0]
[null,"CHIHUAHUA","08DPT0003A",100,"ROQM800726NK3","ROQM800726MCHNXR09","MARISA JUDITH RONQUILLO QUIÑONEZ",30102,180,83101,1001,"01",56,"L5XCBI",15,1,3,null,20171001,20171231,28552.15,0]
[null,"CHIHUAHUA","08DPT0003A",200,"SARJ830528CW0","SARJ830528HCHLDR12","JORGE ARTURO SALAS RODRIGUEZ",30102,216,83101,1001,"01",56,"L5XCBI",18,1,3,null,20171001,20171231,34122.01,0]
[null,"CHIHUAHUA","08DPT0003A",120,"SADC810906EH7","SADC810906MCHNZR07","MARIA CRISTINA SANCHEZ DIAZ",30102,216,83101,1001,"01",56,"L5XCBI",18,1,3,null,20171001,20171231,35217.26,0]
[null,"CHIHUAHUA","08DPT0003A",120,"SERM730609876","SERM730609MCHPYY01","MYRIAM SEPULVEDA REYES",30102,240,83101,1001,"01",56,"L5XC",20,1,3,null,20171001,20171231,46946.84,0]
[null,"CHIHUAHUA","08DPT0003A",120,"TEAR760610A38","TEAR760610HCHRGL01","RAUL FELIPE TERRAZAS AGUIRRE",30102,120,83101,1001,"01",56,"L5XC",10,1,3,null,20171001,20171231,47704.09,0]
[null,"CHIHUAHUA","08DPT0003A",120,"TOBT8310246R6","TOBT831024MCHRRH05","THELMA GUADALUPE TORRES BARRETO",30102,204,83101,1001,"01",56,"L5XC",17,1,3,null,20171001,20171231,41055.61,0]
[null,"CHIHUAHUA","08DPT0003A",100,"UUAJ8910286B1","UUAJ891028HCHRRL00","JOEL URTUZUASTEGUI ARZOLA",30102,240,83101,1001,"01",56,"L5XCBII",20,1,3,null,20171001,20171231,42334.36,0]
[null,"CHIHUAHUA","08DPT0003A",100,"VASM721005K88","VASM721005HCHLRR06","MARIO ALBERTO VALDEZ SIERRA",30102,120,83101,1001,"01",56,"L5XC",10,1,3,null,20171001,20171231,24717.67,0]
[null,"CHIHUAHUA","08DPT0003A",100,"VATE6505053PA","VATE650505HCHLRR02","ERNESTO VALLEJO TERRAZAS",30102,228,83101,1001,"01",56,"L5XC",19,1,3,null,20171001,20171231,46154.69,0]
[null,"CHIHUAHUA","08DPT0003A",100,"VAGS580921NS3","VAGS580921MCHZRL04","SOLEDAD VAZQUEZ GARCIA",30102,180,83101,1001,"01",56,"L5XC",15,1,3,null,20171001,20171231,36885.32,0]
[null,"CHIHUAHUA","08DPT0003A",100,"VASI870422IA8","VASI870422MCHZVS04","ISIS KRYSTAL VAZQUEZ SAENZ",30102,180,83101,1001,"01",56,"L5XC",15,1,3,null,20171001,20171231,35298.85,0]
[null,"CHIHUAHUA","08DPT0003A",200,"VEMA770621BW5","VEMA770621MCHLRN02","ANA ISABEL VELAZQUEZ MARTINEZ",30102,120,83101,1001,"01",56,"L5XC",10,1,3,null,20171001,20171231,27748.69,0]
[null,"CHIHUAHUA","08DPT0003A",200,"VEDA870119GY2","VEDA870119MDGRMD03","ADRIANA VERGARA DOMINGUEZ",30102,192,83101,1001,"01",56,"L5XCBI",16,1,3,null,20171001,20171231,30589,0]
[null,"CHIHUAHUA","08DPT0003A",200,"VILJ810613D4A","VILJ810613HCHLRR06","JORGE ANTONIO VILLAR LOERA",30102,204,83101,1001,"01",56,"L5XCBI",17,1,3,null,20171001,20171231,32892.03,0]
[null,"CHIHUAHUA","08DPT0003A",200,"VIGR710609UT2","VIGR710609HCHLRF00","RAFAEL VILLEGAS GARCIA",30102,240,83101,1001,"01",56,"L5XC",20,1,3,null,20171001,20171231,48362.3,0]
[null,"CHIHUAHUA","08DPT0007X",100,"AUAC8005203K7","AUAC800520HDGGNS04","CESAR ALEJANDRO AGUILAR ANTUNEZ",10207,480,83101,1003,"02","07","CF18203",0,11986,2,null,20171001,20171231,67672.679999999993]
[null,"CHIHUAHUA","08DPT0007X",100,"ARRJ7003036F2","AARJ700303MCHNMS07","MARIA DE JESUS ANAYA RAMIREZ",20201,480,83101,1003,"02","07","CF33204",0,2390,2,null,20171001,20171231,111893.07]
[null,"CHIHUAHUA","08DPT0007X",100,"AIEL6711121J4","AIXE671112MCHRXL03","MARÍA ELIZABETTH ARRIETA",20401,480,83101,1003,"02","07","S01201",0,9329,2,null,20171001,20171231,41733.870000000003]
[null,"CHIHUAHUA","08DPT0007X",100,"BELH630930M26","BELH630930HCHNNM06","JOSE HUMBERTO BENITEZ LONGORIA",10203,480,83101,1003,"02","07","CF19201",0,9327,2,null,20171001,20171231,69205.119999999995]
[null,"CHIHUAHUA","08DPT0007X",100,"CAEA740422SF8","CAEA740422MCHBSL02","ALMA SOFIA CABALLERO ESPARZA",20109,480,83101,1003,"02","07","CF33206",0,13431,2,null,20171001,20171231,133721.97]
[null,"CHIHUAHUA","08DPT0007X",100,"CADE710915BB6","CADE710915MCHRZL02","ELVIRA CARRASCO DIAZ",40401,480,83101,1003,"02","07","CF02103",0,12600,5,null,20171001,20171231,127229.61]
[null,"CHIHUAHUA","08DPT0007X",100,"CACI7205151S9","CACI720515HOCHRS01","ISIDRO MANUEL CHAVEZ CARRERA",20202,480,83101,1003,"02","07","CF33204",0,9338,2,null,20171001,20171231,109133.38]
[null,"CHIHUAHUA","08DPT0007X",100,"DEML700812U65","DEML700812MDGLRR03","LAURA DIANA DELGADO MARRERO",20208,480,83101,1003,"02","07","A03202",0,9319,2,null,20171001,20171231,66642.539999999994]
[null,"CHIHUAHUA","08DPT0007X",200,"EALJ731221FM3","EALJ731221HSLSRN06","JUAN DE DIOS ESCALANTE LAUREAN",10203,480,83101,1003,"02","07","S01202",0,9342,2,null,20171001,20171231,59870.14]
[null,"CHIHUAHUA","08DPT0007X",100,"EAGK7806257R9","EAGK780625MCHSBR04","KARLA ESPARZA GABALDON",20109,480,83101,1003,"02","07","CF33206",0,14113,2,null,20171001,20171231,134361.34]
[null,"CHIHUAHUA","08DPT0007X",100,"GAEM680908Q97","GAEC680908MCLLSN03","MA. CONCEPCION GALLARDO ESPARZA",20401,480,83101,1003,"02","07","S01202",0,9337,2,null,20171001,20171231,53067.3]
[null,"CHIHUAHUA","08DPT0007X",100,"GADA760726L20","GADA760726MCHRZD02","ADRIANA GARCIA DIAZ",20208,480,83101,1003,"02","07","A03202",0,465,2,null,20171001,20171231,64660.14]
[null,"CHIHUAHUA","08DPT0007X",100,"HEGJ620729F26","HEGJ620729HCHRNV07","JOSE JAVIER HERNANDEZ GONZALEZ",20108,480,83101,1003,"02","07","CF33206",0,14112,2,null,20171001,20171231,102053.96]
[null,"CHIHUAHUA","08DPT0007X",100,"HEGL611117FN5","HEGL611117MCHRNZ00","LUZ MARIA HERNANDEZ GONZALEZ",20203,480,83101,1003,"02","07","CF33204",0,2229,2,null,20171001,20171231,128360.06]
[null,"CHIHUAHUA","08DPT0007X",100,"HEPH660312FI8","HEPH660312HCHRRC02","HECTOR HERNANDEZ PEREZ",20202,480,83101,1003,"02","07","CF18203",0,9332,2,null,20171001,20171231,78746.73]
[null,"CHIHUAHUA","08DPT0007X",100,"MASF580311IY9","MASF580311HDGGCR04","FRANCISCO MAGDALENO SAUCEDO",20202,480,83101,1003,"02","07","CF33204",0,210,2,null,20171001,20171231,107507.4]
[null,"CHIHUAHUA","08DPT0007X",100,"MARL701010AR4","MARL701010MCLRBD02","LUDIVINA MARTINEZ REBOLLOSO",20206,480,83101,1003,"02","07","CF04201",0,11955,2,null,20171001,20171231,71156.740000000005]
[null,"CHIHUAHUA","08DPT0007X",100,"MECL790627CP7","MEXC790627MCHJXL02","CLAUDIA FABIOLA MEJIA",20211,480,83101,1003,"02","07","CF34202",0,12097,2,null,20171001,20171231,67452.5]
[null,"CHIHUAHUA","08DPT0007X",100,"MONM720514999","MONM720514HCHRXR04","MARCIAL EZEQUIEL MORALES NUÑEZ",20101,480,83101,1003,"02","07","CF33206",0,13430,2,null,20171001,20171231,162186.38]
[null,"CHIHUAHUA","08DPT0007X",100,"OIPL750706829","OIPL750706HNTRXS09","LUIS ALBERTO ORTIZ PEÑA",20206,480,83101,1003,"02","07","CF33204",0,9348,2,null,20171001,20171231,100270.63]
[null,"CHIHUAHUA","08DPT0007X",100,"PECG710113QA8","PECG710113MCHRRB06","GABRIELA PEREZ CRUZ",20211,480,83101,1003,"02","07","S01202",0,7505,2,null,20171001,20171231,59080.06]
[null,"CHIHUAHUA","08DPT0007X",100,"ROMA711015CL1","ROMA711015MDFDLN06","ANA LUISA RODRIGUEZ MILAN",20206,480,83101,1003,"02","07","A03202",0,9322,2,null,20171001,20171231,66815.149999999994]
[null,"CHIHUAHUA","08DPT0007X",100,"ROQM510228824","ROQR510228MCHGZF19","MARIA DEL REFUGIO ROGERO QUEZADA",40502,480,83101,1003,"02","07","CF02105",0,12864,5,null,20171001,20171231,84502.13]
[null,"CHIHUAHUA","08DPT0007X",100,"ROME6706013EA","ROME670601MDFJLD04","MARIA EDITH ROJAS MELENDEZ",20211,480,83101,1003,"02","07","A03202",0,9320,2,null,20171001,20171231,64102.559999999998]
[null,"CHIHUAHUA","08DPT0007X",100,"SOGC711207N65","SOGC711207MCHTRN06","MARIA CONCEPCION SOTO GUERRERO",20104,480,83101,1003,"02","07","CF33206",0,13433,2,null,20171001,20171231,161738.73000000001]
[null,"CHIHUAHUA","08DPT0007X",100,"SOHJ7805045P4","SOHJ780504HCHTRS02","JOSE DE JESUS SOTO HERNANDEZ",20201,480,83101,1003,"02","07","CF33203",0,9335,2,null,20171001,20171231,63203.31]
[null,"CHIHUAHUA","08DPT0007X",100,"TULO5510064A6","TULO551006MCHDYL01","TUDA LEYVA OLGA ESPERANZA",20109,480,83101,1003,"02","07","CF33206",0,13432,2,null,20171001,20171231,78301.710000000006]
[null,"CHIHUAHUA","08DPT0007X",100,"ZAVE920703L47","ZAVE920703HCHVLD09","EDGAR ALEJANDRO ZAVALA VALLES",20401,480,83101,1003,"02","07","S01201",0,9325,2,null,20171001,20171231,32370.19]
[null,"CHIHUAHUA","08DPT0007X",100,"AAVJ670109VEA","AAVJ670109HVZBLL08","ABSALON VILLEGAS JULIAN MIGUEL",30102,204,83101,1001,"02","07","L5XATEC",20,1,3,null,20171001,20171231,29845.247249415108]
[null,"CHIHUAHUA","08DPT0007X",200,"AOLJ680721RSA","AOLJ680721MCHCJL09","ACOSTA LUJAN JULIA ROSA",30102,216,83101,1001,"02","07","L5XCBI",19,1,3,null,20171001,20171231,36459.438507839994]
[null,"CHIHUAHUA","08DPT0007X",200,"AUCI871011KK9","AUCI871011MCHGLL16","AGUIRRE CALDERON ILEANA LIZELDY",30102,216,83101,1001,"02","07","L5XATEC",19,1,3,null,20171001,20171231,34233.861850975998]
[null,"CHIHUAHUA","08DPT0007X",200,"AEMV850720NG8","AEMV850720MCHLNR03","ALMEIDA MONTES VIRIDIANA",30102,216,83101,1001,"02","07","L5XATEC",18,1,3,null,20171001,20171231,36026.160809839996]
[null,"CHIHUAHUA","08DPT0007X",100,"AAGP8807274Z4","AAGP880727MMCLLB04","ALVARADO GALICIA PABLOVA",30102,240,83101,1001,"02","07","L5XATEC",19,1,3,null,20171001,20171231,40448.19]
[null,"CHIHUAHUA","08DPT0007X",200,"AASJ7104236Z2","AASJ710423HCHLNR06","ALVARADO SANCHEZ JORGE ADRIAN",30102,240,83101,1001,"02","07","L5XC",20,1,3,null,20171001,20171231,46493.624397439999]
[null,"CHIHUAHUA","08DPT0007X",100,"AATG900815VD7","AATG900815MCHLRL09","ALVARADO TARANGO GLORIA YARALDY",30102,228,83101,1001,"02","07","L5XATEC",19,1,3,null,20171001,20171231,36724.599999999991]
[null,"CHIHUAHUA","08DPT0007X",100,"AARP801213GG6","AARP801213HCHVDD14","AVALOS RODARTE PEDRO ALONSO",30102,216,83101,1001,"02","07","L5XCBI",20,1,3,null,20171001,20171231,37173.260068479998]
[null,"CHIHUAHUA","08DPT0007X",100,"BACJ730108BV7","BACJ730108MDFYRH00","BAYARDO CARVAJAL JAHEL",30102,216,83101,1001,"02","07","L5XATEC",18,1,3,null,20171001,20171231,34099.993426400004]
[null,"CHIHUAHUA","08DPT0007X",100,"BECI670819Q93","BECI670819HCHLRV03","BELMONTE CARRILLO IVAN",30102,240,83101,1001,"02","07","L5XC",18,1,3,null,20171001,20171231,45900.166385215998]
[null,"CHIHUAHUA","08DPT0007X",100,"BEMY780623E38","BEMY780623MCHRRS01","BERUMEN MARTINEZ YESICA",30102,240,83101,1001,"02","07","L5XC",20,1,3,null,20171001,20171231,45922.542548992002]
[null,"CHIHUAHUA","08DPT0007X",100,"BIRG861118GT6","BIRG861118MCHRYR07","BRIONES REYES GEORGINA",30102,108,83101,1001,"02","07","L5XATEC",15,1,3,null,20171001,20171231,18101.040496497779]
[null,"CHIHUAHUA","08DPT0007X",100,"BUEL761105V38","BUEL761105MCHSSR05","BUSTAMANTE ESCOBEDO LAURA ISELA",30102,240,83101,1001,"02","07","L5XC",17,1,3,null,20171001,20171231,45540.403408716797]
[null,"CHIHUAHUA","08DPT0007X",200,"CAVM69042817A","CAVM690428HCHBGR00","CABALLERO VEGA MARIO ALBERTO",30102,120,83101,1001,"02","07","L5XATEC",18,1,3,null,20171001,20171231,14380.1773227504]
[null,"CHIHUAHUA","08DPT0007X",100,"CASC9206274E9","CASC920627HCHLNH09","CALDERA SANCHEZ CHRISTIAN ALBERTO",30102,168,83101,1001,"02","07","L5XCBII",15,1,3,null,20171001,20171231,18975.159886577778]
[null,"CHIHUAHUA","08DPT0007X",200,"CAVM6006195R6","CAVM600619HCHLLN01","CALLEROS VILLALOBOS MANUEL ALBERTO ",30102,240,83101,1001,"02","07","L5XCBI",20,1,3,null,20171001,20171231,41200.168575360003]
[null,"CHIHUAHUA","08DPT0007X",100,"CIGJ801220RP4","CIGJ801220HCHSRL09","CISNEROS GARCIA JULIO ALBERTO",30102,240,83101,1001,"02","07","L5XCBI",17,1,3,null,20171001,20171231,41200.168575360003]
[null,"CHIHUAHUA","08DPT0007X",200,"DIAA860226874","DIAA860226MSRZGN04","DIAZ AGUILAR ANA FABIOLA",30102,228,83101,1001,"02","07","L5XC",19,1,3,null,20171001,20171231,43580.786735820802]
[null,"CHIHUAHUA","08DPT0007X",200,"DOBG610203LR2","DOBG610203HCHMRL02","DOMINGUEZ BARAY GILBERTO",30102,204,83101,1001,"02","07","L5XC",18,1,3,null,20171001,20171231,40648.870465024003]
[null,"CHIHUAHUA","08DPT0007X",200,"EADJ860902I17","EADJ860902HCHSZV01","ESPARZA DIAZ JAVIER EDUARDO",30102,240,83101,1001,"02","07","L5XCBI",15,1,3,null,20171001,20171231,46207.879480256001]
[null,"CHIHUAHUA","08DPT0007X",200,"EACL8412183L3","EACL841218MCHSRR08","ESTRADA CARRILLO LAURA VERONICA",30102,240,83101,1001,"02","07","L5XC",18,1,3,null,20171001,20171231,46258.736288716798]
[null,"CHIHUAHUA","08DPT0007X",200,"EAHJ881022RT6","EAHJ881022HCHSRQ05","ESTRADA HERNANDEZ JOAQUIN JOEL",30102,120,83101,1001,"02","07","L5XC",15,1,3,null,20171001,20171231,25493.094383822223]
[null,"CHIHUAHUA","08DPT0007X",200,"CARF8005231E2","CARF800523HCHRVD08","ESTRADA SALAYANDIA JOSE ANGEL",30102,192,83101,1001,"02","07","L5XCBII",18,1,3,null,20171001,20171231,20393.086655075556]
[null,"CHIHUAHUA","08DPT0007X",200,"FOCG620409LQ0","FOCG620409HDGLHN03","FLORES CHACON GONZALO",30102,180,83101,1001,"02","07","L5XATEC",14,1,3,null,20171001,20171231,29753.751339875558]
[null,"CHIHUAHUA","08DPT0007X",100,"GAEH711103S52","GAEH711103HCHBNC07","GABALDON ENRÍQUEZ HECTOR GERARDO                  ",30102,168,83101,1001,"02","07","L5XCBI",20,1,3,null,20171001,20171231,33885.68692500623]
[null,"CHIHUAHUA","08DPT0007X",200,"GAJE670908MV9","GAJE670908HDGLRV06","GALVAN JUAREZ EVARISTO",30102,240,83101,1001,"02","07","L5XCBI",14,1,3,null,20171001,20171231,39179.869200000001]
[null,"CHIHUAHUA","08DPT0007X",100,"GAMY7604228L5","GAMY760422MDGLXL00","GALVAN MUÑOZ YOLANDA ALEJANDRA",30102,240,83101,1001,"02","07","L5XC",15,1,3,null,20171001,20171231,46236.364436940799]
[null,"CHIHUAHUA","08DPT0007X",200,"GAOR861127BG3","GAOR861127MCHMNQ19","GAMBOA ONTIVEROS RAQUEL",30102,240,83101,1001,"02","07","L5XC",18,1,3,null,20171001,20171231,46795.651081164804]
[null,"CHIHUAHUA","08DPT0007X",100,"GAAN631226D5A","GAAN631226MCHNNR03","GANDARA ANGUIANO NORMA",30102,240,83101,1001,"02","07","L5XATEC",11,1,3,null,20171001,20171231,39892.102993152002]
[null,"CHIHUAHUA","08DPT0007X",100,"GARA6105276N5","GARA610527HCHRZL00","GARAY RUIZ JOSE ALFONSO",30102,228,83101,1001,"02","07","L5XATEC",20,1,3,null,20171001,20171231,39225.589424799997]
[null,"CHIHUAHUA","08DPT0007X",100,"GOTD6910121D1","GOTD691012MCHMVY06","GOMEZ TAVARES DEYANIRA",30102,228,83101,1001,"02","07","L5XC",18,1,3,null,20171001,20171231,44590.549712319997]
[null,"CHIHUAHUA","08DPT0007X",100,"GONM640214JC7","GONM640214HJCNVG03","GONZÁLEZ NAVA MIGUEL",30102,216,83101,1001,"02","07","L5XATEC",17,1,3,null,20171001,20171231,33520.432438975993]
[null,"CHIHUAHUA","08DPT0007X",100,"HEPR900403KQ2","HEPR900403HCHRRC03","HERNANDEZ PEREZ RICARDO",30102,228,83101,1001,"02","07","L5XCBI",16,1,3,null,20171001,20171231,45509.609705983996]
[null,"CHIHUAHUA","08DPT0007X",100,"HEMA6604046K4","HEMA660404HCHRXN05","HERRERA MUÑOZ JOSE ANGEL",30102,240,83101,1001,"02","07","L5XC",19,1,3,null,20171001,20171231,47177.790221440002]
[null,"CHIHUAHUA","08DPT0007X",100,"HEOA9003177A9","HEOA900317MCHRGN09","HERRERA OGAZ ANGELICA LIZETTE",30102,228,83101,1001,"02","07","L5XCBI",19,1,3,null,20171001,20171231,38706.895578239993]
[null,"CHIHUAHUA","08DPT0007X",100,"HEOS840726F25","HEOS840726HCHRGR06","HERRERA OGAZ SERGIO ARTURO",30102,240,83101,1001,"02","07","L5XATEC",10,1,3,null,20171001,20171231,39978.43]
[null,"CHIHUAHUA","08DPT0007X",100,"HOAG621120KT8","HOAG621120MCHLVB08","HOLGUIN AVILA GABRIELA ALEJANDRA",30102,216,83101,1001,"02","07","L5XATEC",20,1,3,null,20171001,20171231,36627.731444223995]
[null,"CHIHUAHUA","08DPT0007X",200,"LOHA840518CS8","LOHA840518HCHPRL07","LOPEZ HERNANDEZ ALBERTO",30102,216,83101,1001,"02","07","L5XATEC",16,1,3,null,20171001,20171231,34207.134768639997]
[null,"CHIHUAHUA","08DPT0007X",200,"MAVA850717159","MAVA850717MCHCLL06","MACÍAS VELAZQUEZ ALEJANDRA",30102,240,83101,1001,"02","07","L5XC",17,1,3,null,20171001,20171231,45294.918712767998]
[null,"CHIHUAHUA","08DPT0007X",200,"MAER720708DH1","MAXE720708MCHNXR00","MANCHA ERIKA SELENE",30102,180,83101,1001,"02","07","L5XCBI",20,1,3,null,20171001,20171231,33628.638775881605]
[null,"CHIHUAHUA","08DPT0007X",100,"MARS830130RA7","MARS830130HCHRVR05","MARTINEZ RIVERA SERGIO ALONSO",30102,204,83101,1001,"02","07","L5XCBI",19,1,3,null,20171001,20171231,33797.207822912002]
[null,"CHIHUAHUA","08DPT0007X",200,"MALA850527KR1","MALA850527HTLTCN04","MATUS LECOURTOIS ANDRES ISAAC",30102,216,83101,1001,"02","07","L5XATEC",19,1,3,null,20171001,20171231,31612.236688639994]
[null,"CHIHUAHUA","08DPT0007X",100,"MESO501218RY9","MESO501218HJCNLS04","MENDOZA SALAS OSCAR  IGNAC IO",30102,180,83101,1001,"02","07","L5XC",17,1,3,null,20171001,20171231,34678.215869404448]
[null,"CHIHUAHUA","08DPT0007X",200,"MESB8507159W0","MESB850715HCHNRN00","MENDOZA SORIANO BENJAMIN ALEJANDRO",30102,240,83101,1001,"02","07","L5XATEC",18,1,3,null,20171001,20171231,40873.242776159997]
[null,"CHIHUAHUA","08DPT0007X",200,"MOAJ681102IQ0","MOAJ681102HCHNGS07","MONTES AGUILAR JESUS GERARDO",30102,204,83101,1001,"02","07","L5XATEC",0,1,3,null,20171001,20171231,30725.281510286219]
[null,"CHIHUAHUA","08DPT0007X",200,"MOMM791027B8A","MOMM791027MCHRRY08","MORALES MORENO MAYRA MARGARITA",30102,228,83101,1001,"02","07","L5XC",0,1,3,null,20171001,20171231,41947.091700095996]
[null,"CHIHUAHUA","08DPT0007X",200,"OEPH7911267A5","OEPH791126HCHRNC09","ORNELAS DEL PINO HECTOR RICARDO",30102,216,83101,1001,"02","07","L5XATEC",0,1,3,null,20171001,20171231,36928.244947359999]
[null,"CHIHUAHUA","08DPT0007X",200,"OIGA8509273I1","OIGA850927HCHRTL04","ORTIZ GUTIERREZ JOSE ALBERTO",30102,180,83101,1001,"02","07","L5XATEC",0,1,3,null,20171001,20171231,28719.987689386671]
[null,"CHIHUAHUA","08DPT0007X",200,"PEME750130UP9","PEME750130HCHRRR00","PEREZ MARTINEZ ERICK DAVID",30102,216,83101,1001,"02","07","L5XATEC",0,1,3,null,20171001,20171231,31136.193539999997]
[null,"CHIHUAHUA","08DPT0007X",100,"PERL8208024K1","PERL820802MCHRMR03","PEREZ RAMOS LAURA ANGELICA",30102,180,83101,1001,"02","07","L5XATEC",0,1,3,null,20171001,20171231,35810.511672780805]
[null,"CHIHUAHUA","08DPT0007X",200,"POMJ860826TB2","POMJ860826HCHRDN05","PORRAS MEDINA JUAN CARLOS",30102,216,83101,1001,"02","07","L5XATEC",0,1,3,null,20171001,20171231,35500.495756351993]
[null,"CHIHUAHUA","08DPT0007X",200,"RIBG810102KB8","RIBG810102MCHVRR02","RIVAS BARRAGAN GRACIELA",30102,168,83101,1001,"02","07","L5XATEC",0,1,3,null,20171001,20171231,25705.550180088892]
[null,"CHIHUAHUA","08DPT0007X",100,"ROMP8008014S4","ROMP800801MCSBZT07","ROBLERO MAZARIEGOS PATRICIA",30102,240,83101,1001,"02","07","L5XATEC",0,1,3,null,20171001,20171231,46236.360124940795]
[null,"CHIHUAHUA","08DPT0007X",200,"ROCG680807P47","ROCG680807MCLLSR09","ROLDAN CASTILLO GRISELDA",30102,168,83101,1001,"02","07","L5XC",0,1,3,null,20171001,20171231,24782.764099604425]
[null,"CHIHUAHUA","08DPT0007X",200,"ROMM911224P47","ROMM911224HCHSNR07","ROSALES MENDOZA MARIO",30102,180,83101,1001,"02","07","L5XATEC",0,1,3,null,20171001,20171231,24149.310603610196]
[null,"CHIHUAHUA","08DPT0007X",200,"RUGA7605108F9","RUGA760510MCHVTN01","RUVALCABA GUTIERREZ MARIA ANTONIETA",30102,216,83101,1001,"02","07","L5XATEC",0,1,3,null,20171001,20171231,34928.252063324442]
[null,"CHIHUAHUA","08DPT0007X",100,"SASE940502AY3","SASE940502HCHLLD03","SALAZAR SILVA EDGAR OVED",30102,132,83101,1001,"02","07","L5ATEC",0,1,3,null,20171001,20171231,15609.850549766594]
[null,"CHIHUAHUA","08DPT0007X",100,"SAMD9405148N8","SAMD940514HCHLNN04","SALCEDO MONRREAL DANIEL",30102,240,83101,1001,"02","07","L5XATEC",0,1,3,null,20171001,20171231,24401.397638044444]
[null,"CHIHUAHUA","08DPT0007X",100,"SAFA580219G58","SAFA580219HVZMLL08","SAMARIO FLORES ALVARO",30102,216,83101,1001,"02","07","L5XC",0,1,3,null,20171001,20171231,43258.487137920005]
[null,"CHIHUAHUA","08DPT0007X",100,"SAOA880909JJ6","SAOA880909HOCMSL00","SAMARIO OSORIO ALVARO OSCAR",30102,204,83101,1001,"02","07","L5XCBII",0,1,3,null,20171001,20171231,30680.624683208887]
[null,"CHIHUAHUA","08DPT0007X",100,"SEEI760505188","SAOA880909HOCMSL00","SERRATOS ESPARZA ILSE",30102,192,83101,1001,"02","07","L5XATEC",0,1,3,null,20171001,20171231,32154.757704480005]
[null,"CHIHUAHUA","08DPT0007X",200,"TAVY911105KV5","TAVI911105MCHGNS05","TAGLE VENZOR YASSMIN",30102,228,83101,1001,"02","07","L5XATEC",0,1,3,null,20171001,20171231,35311.51889781333]
[null,"CHIHUAHUA","08DPT0007X",200,"TENA800305KZ2","TENA800305HCHJVN00","TEJADA NEVAREZ ANGEL ADRIAN",30102,228,83101,1001,"02","07","L5XCBI",0,1,3,null,20171001,20171231,39526.578001919988]
[null,"CHIHUAHUA","08DPT0007X",200,"TORE8012234Y9","TORE801223HNTPYD08","TOPETE REYES EDGAR",30102,120,83101,1001,"02","07","L5XC",0,1,3,null,20171001,20171231,22793.094383822223]
[null,"CHIHUAHUA","08DPT0007X",100,"TOCJ650407CT0","TOCJ650407HVZRNS07","TORRES CANTERO JOSE",30102,240,83101,1001,"02","07","L5XC",0,1,3,null,20171001,20171231,47177.790221440002]
[null,"CHIHUAHUA","08DPT0007X",200,"TORN791114PY6","TORN791114MCHRYD07","TORRES REY NADIA MARIA",30102,192,83101,1001,"02","07","L5XATEC",0,1,3,null,20171001,20171231,34238.335572246404]
[null,"CHIHUAHUA","08DPT0007X",100,"TOCA911218IK5","TOCA911218MCLVRL07","TOVAR CRISTIAN ALMA DELIA",30102,204,83101,1001,"02","07","L5XATEC",0,1,3,null,20171001,20171231,24148.65381251635]
[null,"CHIHUAHUA","08DPT0007X",100,"UUAR860131EV3","UUAR860131HCHRRF06","URTUZUASTEGUI ARZOLA RAFAEL",30102,240,83101,1001,"02","07","L5XC",0,1,3,null,20171001,20171231,47143.624397439999]
[null,"CHIHUAHUA","08DPT0007X",200,"VAAF840608FK3","VAAF840608HCHZCR03","VAZQUEZ ACEVEDO FERNANDO",30102,228,83101,1001,"02","07","L5XCBI",0,1,3,null,20171001,20171231,39672.421311839993]
[null,"CHIHUAHUA","08DPT0007X",200,"VIAS640217RZ1","VIAS640217HCHLGL08","VILLALOBOS AGUIRRE SAUL",30102,228,83101,1001,"02","07","L5XATEC",0,1,3,null,20171001,20171231,34172.881660556799]
[null,"CHIHUAHUA","08DPT0007X",100,"VIPY930427KI9","VIPY930427MCHLRR02","VILLALOBOS PORRAS YARA VERONICA",30102,204,83101,1001,"02","07","L5XATEC",0,1,3,null,20171001,20171231,28101.340615460351]
[null,"CHIHUAHUA","08DPT0007X",100,"VIGR720403880","VIGR720403HVZLBC14","VILLARAUZ GABINO RICARDO",30102,216,83101,1001,"02","07","L5XCBI",0,1,3,null,20171001,20171231,42712.159861529602]
[null,"CHIHUAHUA","08DPT0008W",100,"AUED570608MR1","AUED570608HZSGSN08","DANIEL AGUILAR EZPARZA",20214,480,83101,1003,"02","08","CF33203",0,"9354",2,null,20171001,20171231,64142.98,0]
[null,"CHIHUAHUA","08DPT0008W",100,"BESJ800501RQ3","BESJ800501HCLRLL06","JULIO CESAR BERNAL SALAS",20214,480,83101,1003,"02","08","CF33206",0,13383,2,null,20171116,20171231,28762.6,0]
[null,"CHIHUAHUA","08DPT0008W",100,"EOCA6608284C4","EOCA660828HCHSRG02","AGUSTIN ESCOBAR CERVANTES",20214,480,83101,1003,"02","08","CF18201",0,12852,2,null,20171001,20171231,41687.11,0]
[null,"CHIHUAHUA","08DPT0008W",100,"EOHE660901TLA","EOHE660901MCHSLV04","EVA MARIA ESCOBAR HOLGUIN",20214,480,83101,1003,"02","08","SO1202",0,"9359",2,null,20171001,20171231,56975.53,0]
[null,"CHIHUAHUA","08DPT0008W",100,"HEGA690525I40","HEGA690525MCHRRL02","ALICIA HERNANDEZ GARCIA",20214,480,83101,1003,"02","08","CF33206",0,"13382",2,null,20171001,20171231,61435.21,0]
[null,"CHIHUAHUA","08DPT0008W",100,"HEGE6610076VO","HEGE661007MSIRLG06","MARIA EUGENIA HERRERA GOLARTE",20214,480,83101,1003,"02","08","AO3202",0,"9350",2,null,20171001,20171231,143997.69,0]
[null,"CHIHUAHUA","08DPT0008W",100,"MAVM680815AT6","MAVM680815HCHRLR01","MARIO ALBERTO MARTINEZ VILLELA",20214,480,83101,1003,"02","08","CF33206",0,"13384",2,null,20171001,20171231,146584.60999999999,0]
[null,"CHIHUAHUA","08DPT0008W",100,"MALM890515EN0","MALM890515HCHTCR05","MARIO ALBERTO MATA LICON",20514,480,83101,1003,"02","08","CF02103",0,"12588",5,null,20171001,20171231,109593.9,0]
[null,"CHIHUAHUA","08DPT0008W",100,"MEMF660302UMO","MEMF660302HCHNLD06","FEDERICO MENDOZA MOLINA",20214,480,83101,1003,"02","08","CF18203",0,"9369",2,null,20171001,20171231,66850.59,0]
[null,"CHIHUAHUA","08DPT0008W",100,"MIRA630916H43","MIRA630916HCHRJN07","ANTONIO MIRANDA ROJO",20214,480,83101,1003,"02","08","CF02105",0,"13383",2,null,20171001,20171031,42193.91,0]
[null,"CHIHUAHUA","08DPT0008W",100,"MOAG600916JW6","MOAG600916HCHYCL04","GUILLERMO MOY ACOSTA",20214,480,83101,1003,"02","08","CF33206",0,2377,2,null,20171001,20171231,82221.740000000005,0]
[null,"CHIHUAHUA","08DPT0008W",100,"OOVM6504302T1","OOVM650430HCHRLS07","MOISES OROZCO VALDEZ",20214,480,83101,1003,"02","08","CF18203",0,"9363",2,null,20171001,20171231,65527.57,0]
[null,"CHIHUAHUA","08DPT0008W",100,"PANA720117JW4","PANA720117HDGLVN01","ANTONIO PALMA NEVAREZ",20214,480,83101,1003,"02","08","CF19201",0,"9365",2,null,20171001,20171231,57498.34,0]
[null,"CHIHUAHUA","08DPT0008W",100,"PAHA640330KP3","PAHA640330MCHYLR06","ARMIDA IRENE PAYAN HOLGUIN",20214,480,83101,1003,"02","08","CF33206",0,"13385",2,null,20171001,20171231,165150.17000000001,0]
[null,"CHIHUAHUA","08DPT0008W",100,"POAJ710301PK6","POAJ710301MCHRLS06","MARIA DE JESUS PORTILLO ALARCON",20214,480,83101,1003,"02","08","CF04201",0,"9358",2,null,20171001,20171231,44962.45,0]
[null,"CHIHUAHUA","08DPT0008W",100,"RIGR710129FB6","RIGR710129MCHVRQ06","RAQUEL ERENDIDA RIVERA GARCIA",20214,480,83101,1003,"02","08","CF34201",0,"9366",2,null,20171001,20171231,61055.44,0]
[null,"CHIHUAHUA","08DPT0008W",100,"SAML750404I76","SAML750404MCHNXZ07","SAENZ MUNOZ LUZ MARIA",20214,480,83101,1003,"02","08","SO1201",0,9358,2,null,20171001,20171231,38234.17,0]
[null,"CHIHUAHUA","08DPT0008W",100,"SADE650818IV1","SADE650818MCHLRL09","MARIA ELENA SALAZAR DUARTE",20214,480,83101,1003,"02","08","AO3202",0,"9352",2,null,20171001,20171231,58568.08,0]
[null,"CHIHUAHUA","08DPT0008W",100,"TAHJ7109304KA","TAHJ710930HCHRLV01","JAVIER EUSEBIO TARANGO HOLGUIN",20214,480,83101,1003,"02","08","CF33206",0,"14089",2,null,20171001,20171231,146745.53,0]
[null,"CHIHUAHUA","08DPT0008W",100,"VARJ610925H36","VARJ610925HCHLSS00","JESUS ANTONIO VALDEZ ROSALES",20214,480,83101,1003,"02","08","CF18201",0,"9367",2,null,20171001,20171231,50082.13,0]
[null,"CHIHUAHUA","08DPT0008W",100,"VEGR750904UR2","VEGR750904MCHLRS06","ROSALIA MARGARITA VELARDE GARCIA",20214,480,83101,1003,"02","08","AO3202",0,9350,2,null,20171001,20171231,72381.52,0]
[null,"CHIHUAHUA","08DPT0008W",100,"VARO691222JA8","VAXR691222MCHLXS07","ROSA MARIA VALENZUELA",30102,108,83101,1001,"02","08","L5XCBI",10,1,3,null,20171001,20171231,19810.11,0]
[null,"CHIHUAHUA","08DPT0008W",100,"AUMM780328A31","AUMM780328MCHGLN09","MINERVA AGUILAR MOLINAR",30102,240,83101,1001,"02","08","L5XCBI",20,1,3,null,20171001,20171231,39699.83,0]
[null,"CHIHUAHUA","08DPT0008W",100,"AEGL800105RF6","AEGL800105MCHLNZ06","LIZETTE JOHANNA ALEJANDRO GONZALEZ",30102,216,83101,1001,"02","08","L5XCBI",18,1,3,null,20171001,20171231,36315.43,0]
[null,"CHIHUAHUA","08DPT0008W",100,"AAGJ670423U8A","AAGJ670423HCHMNR05","JORGE AMPARAN GONZALEZ",30102,216,83101,1001,"02","08","L5XCBI",18,1,3,null,20171001,20171231,35395.949999999997,0]
[null,"CHIHUAHUA","08DPT0008W",100,"AESS721002N67","AESS721002MCHRTS00","SUSANA ARMENDARIZ SOTO",30102,240,83101,1001,"02","08","L5XCBI",20,1,3,null,20171001,20171231,35628.53,0]
[null,"CHIHUAHUA","08DPT0008W",100,"BAVM821203FN0","BAVM821203MCHRLN06","MONICA LOURDES BARRAZA VILLALOBOS",30102,228,83101,1001,"02","08","L5XCBI",19,1,3,null,20171001,20171231,33584.58,0]
[null,"CHIHUAHUA","08DPT0008W",100,"CAVS820702FV1","CAVS820702MCHRRN01","SANDRA ELIZABETH CARDENAS VARGAS",30102,216,83101,1001,"02","08","L5XCBI",18,1,3,null,20171001,20171231,31094.33,0]
[null,"CHIHUAHUA","08DPT0008W",100,"ROMJ731201675","CANA840815MCHRVN00","ANA ISABEL CARREON NAVA",30102,240,83101,1001,"02","08","L5XCBI",20,1,3,null,20171001,20171231,31126.84,0]
[null,"CHIHUAHUA","08DPT0008W",100,"COMR940524BD4","COMR940524HCHNRD00","CONTRERAS MARTINEZ RODOLFO",30102,120,83101,1001,"02","08","L5XCBI",10,1,3,null,20171001,20171231,17304,0]
[null,"CHIHUAHUA","08DPT0008W",100,"DIHL770620B93","DIHL770620MCHZRZ06","LUZ IMELDA DIAZ HERNANDEZ",30102,240,83101,1001,"02","08","L5ATEC",20,1,3,null,20171001,20171231,36516.199999999997,0]
[null,"CHIHUAHUA","08DPT0008W",100,"GASJ850822GF7","GASJ850822HCHLNS04","JOSE GALVEZ SANTANA",30102,240,83101,1001,"02","08","L5XCBI",20,1,3,null,20171001,20171231,38108.050000000003,0]
[null,"CHIHUAHUA","08DPT0008W",100,"CAEJ9105085V8","GASA810331MCHRRD08","ADRIANA GARDEA SERRANO",30102,240,83101,1001,"02","08","L5XCBI",20,1,3,null,20171001,20171231,28600.5,0]
[null,"CHIHUAHUA","08DPT0008W",100,"GULM750313628","GULM750313HCHLNN08","MANUEL ALEJANDRO GULLEN LUNA",30102,228,83101,1001,"02","08","L5XCBI",19,1,3,null,20171001,20171231,32709.59,0]
[null,"CHIHUAHUA","08DPT0008W",100,"HEAJ8610295N1","HEAJ861029HCHRCN09","JUAN CARLOS HERNANDEZ ACOSTA ",30102,216,83101,1001,"02","08","L5XATEC",18,1,3,null,20171001,20171231,36372.199999999997,0]
[null,"CHIHUAHUA","08DPT0008W",100,"HEGE760311918","HEGE760311HCHRTF05","EFRAIN ARTURO HERNANDEZ GUTIERREZ",30102,240,83101,1001,"02","08","L5XCBI",20,1,3,null,20171001,20171231,23747.08,0]
[null,"CHIHUAHUA","08DPT0008W",100,"MAML7703077T7","MAML770307MCHCRS01","LESSLEY MYRLEE MACIAS MARTINEZ",30102,240,83101,1001,"02","08","L5XCBI",20,1,3,null,20171001,20171231,39725.9,0]
[null,"CHIHUAHUA","08DPT0008W",100,"MAEJ690219AK2","MAEJ690219HCHRSS06","JESUS MARTINEZ ESPARZA",30102,240,83101,1001,"02","08","L5XCBII",20,1,3,null,20171001,20171231,40300.879999999997,0]
[null,"CHIHUAHUA","08DPT0008W",100,"MECO550827IG3","MECO550827MSLXSL09","MEXIA CASTRO OLGA PATRICIA",30102,240,83101,1001,"02","08","L5XCBI",20,1,3,null,20171001,20171231,32414.13,0]
[null,"CHIHUAHUA","08DPT0008W",100,"MOGE730414EA4","MOGE730414HCHRRL09","MORENO GARCIA ELISEO",30102,180,83101,1001,"02","08","L5XCBI",15,1,3,null,20171001,20171231,18095.560000000001,0]
[null,"CHIHUAHUA","08DPT0008W",100,"MUDL850226U70","MUDL850226MCHXLL02","LILIA MUÑOZ DELGADO",30102,240,83101,1001,"02","08","L5XCBI",20,1,3,null,20171001,20171231,38548.269999999997,0]
[null,"CHIHUAHUA","08DPT0008W",100,"MUMP8911284K8","MUMP891128HCHXXS06","PASCUAL ABRAHAM MUÑOZ MUÑOZ",30102,228,83101,1001,"02","08","L5XCBI",19,1,3,null,20171001,20171231,30036.05,0]
[null,"CHIHUAHUA","08DPT0008W",100,"NAHJ790815BF0","NAHJ790815HCHVRS00","JESUS MIGUEL NAVARRO HERNANDEZ",30102,240,83101,1001,"02","08","L5XCBI",20,1,3,null,20171001,20171231,29356.639999999999,0]
[null,"CHIHUAHUA","08DPT0008W",100,"OIGM890424ICI","OIGM890424MCHLRR06","MARTA ALEJANDRA OLIVAS GUERRERO",30102,228,83101,1001,"02","08","L5XCBI",19,1,3,null,20171001,20171231,32660.639999999999,0]
[null,"CHIHUAHUA","08DPT0008W",100,"OINS5902223YA","OINS590222HMNLXL02","OLIVO NUÑEZ JOSE SALVADOR",30102,240,83101,1001,"02","08","L5XCBI",20,1,3,null,20171001,20171231,32137.62,0]
[null,"CHIHUAHUA","08DPT0008W",100,"PAVF6602076Y9","PAVF660207MCHLRL06","PALMA VARGAS FLOR",30102,144,83101,1001,"02","08","L5XCBI",12,1,3,null,20171001,20171231,14426.24,0]
[null,"CHIHUAHUA","08DPT0008W",100,"PAFV661205KZ5","PAFV661205HCHTRC01","PATENA FIERRO VICTOR MANUEL",30102,228,83101,1001,"02","08","L5XCBI",19,1,3,null,20171001,20171231,32814.269999999997,0]
[null,"CHIHUAHUA","08DPT0008W",100,"RERP770809FK9","RERP770809HCHDDD04","PEDRO OSWALDO REDE RODRIGUEZ",30102,240,83101,1001,"02","08","L5XCBII",20,1,3,null,20171001,20171231,35554.06,0]
[null,"CHIHUAHUA","08DPT0008W",100,"REVY780409NT1","REVY780409MCHYLZ05","YASMIN LISSET REYES VALLES",30102,240,83101,1001,"02","08","L5XCBI",20,1,3,null,20171001,20171231,31839.59,0]
[null,"CHIHUAHUA","08DPT0008W",100,"RIGJ610311956","RIGJ610311HDFVRL08","JOEL RAUL RIVAS GARCIA",30102,240,83101,1001,"02","08","L5XC",20,1,3,null,20171001,20171231,34539.589999999997,0]
[null,"CHIHUAHUA","08DPT0008W",100,"ROGR680108PWA","ROGR680108HCHDRC09","RICARDO RODRIGUEZ GARCIA",30102,240,83101,1001,"02","08","L5XCBI",20,1,3,null,20171001,20171231,40748.550000000003,0]
[null,"CHIHUAHUA","08DPT0008W",100,"RORF881013FI1","RORF881013MCHDBT02","RODRIGUEZ ROBLES FATIMA",30102,240,83101,1001,"02","08","L5XCBI",20,1,3,null,20171001,20171231,31383.1,0]
[null,"CHIHUAHUA","08DPT0008W",100,"SADR840831726","SADR840831HCHNZM02","RAMON AGUSTO SANCHEZ DIAZ",30102,120,83101,1001,"02","08","L5XCBI",10,1,3,null,20171001,20171231,20719.490000000002,0]
[null,"CHIHUAHUA","08DPT0008W",100,"SARJ650111CB4","SARJ650111HCHNVM05","JAIME SANCHEZ RIVERA",30102,240,83101,1001,"02","08","L5XCBI",20,1,3,null,20171001,20171231,39675.35,0]
[null,"CHIHUAHUA","08DPT0008W",100,"VAVS740521TK5","VAVS740521HCHLLL09","SAUL ARMANDO VALLES VALLE",30102,120,83101,1001,"02","08","L5XCBI",10,1,3,null,20171001,20171231,18826.189999999999,0]
[null,"CHIHUAHUA","08DPT0008W",100,"VICG5002047Q6","VICG500204HCHTRL01","GILBERTO FELICIANO VITELA CARRASCO",30102,240,83101,1001,"02","08","L5XCBI",20,1,3,null,20171001,20171231,39948.550000000003,0]
[null,"CHIHUAHUA","08DPT0012I",124,"CAMC8511068L5","CAMC851106MCHRRR00","CARMEN IVONNE CARMONA MURILLO","20216",480,83101,1003,"02","18","SO1201","00.0",9680,2,null,20171001,20171231,36843.050000000003,0]
[null,"CHIHUAHUA","08DPT0012I",124,"CATJ640415MG5","CATJ640415HCHHRN06","JUAN ANTONIO CHAVEZ TERRAZAS","20108",480,83101,1003,"02","18","CF33206","00.0",13933,2,null,20171001,20171231,163220.60999999999,0]
[null,"CHIHUAHUA","08DPT0012I",124,"COVC830703U30","COVC830703MCHRZY01","CYNTHIA ROSARIO CORONADO VAZQUEZ","20109",480,83101,1003,"02","18","CF33206","00.0",14308,2,null,20171001,20171231,126887.06,0]
[null,"CHIHUAHUA","08DPT0012I",124,"EIRL670407TS6","EIRL670407MCHNDT08","LETICIA ENRIQUEZ RODRIGUEZ","20105",480,83101,1003,"02","18","CF33206","00.0",13934,2,null,20171001,20171231,164652.81,0]
[null,"CHIHUAHUA","08DPT0012I",124,"GACI7107098NA","GACI710709MCHRRM01","IMELDA IVONE GARCIA CARMONA","20201",480,83101,1003,"02","18","CF33203","00.0",9688,2,null,20171001,20171231,66589.69,0]
[null,"CHIHUAHUA","08DPT0012I",124,"GOMB690116428","GOMB690116MCHNRL02","BELIA LORENA GONZALEZ  MORENO","20206",480,83101,1003,"02","18","A03202","00.0",9677,2,null,20171001,20171231,55732.640000000007,0]
[null,"CHIHUAHUA","08DPT0012I",124,"IAMM880831RY4","IAMM880831MCHZRR03","MAR ELISA IZAGUIRRE MARTINEZ","20216",480,83101,1003,"02","18","A03202","00.0",9678,2,null,20171001,20171231,50040.560000000005,0]
[null,"CHIHUAHUA","08DPT0012I",124,"LECG700827GY1","LECG700827MCHCHL00","GLORIA A LECHUGA CHAVEZ","20201",480,83101,1003,"02","18","CF33204","00.0",9675,2,null,20171001,20171231,107771.65999999999,0]
[null,"CHIHUAHUA","08DPT0012I",124,"LOLJ670726J90","LOLJ670723HCHPZV05","JAVIER LOPEZ LOZANO","20401",480,83101,1003,"02","18","SO1201","00.0",9681,2,null,20171001,20171231,36843.050000000003,0]
[null,"CHIHUAHUA","08DPT0012I",124,"MAAS821018113","MAAS821018HCHRNG05","SIGIFREDO MARQUEZ ANCHONDO","20216",480,83101,1003,"02","18","CF18203","00.0",8788,2,null,20171001,20171231,56091.850000000006,0]
[null,"CHIHUAHUA","08DPT0012I",124,"MAQS651014TH4","MAQS651014HCHRNL03","SAUL MARQUEZ QUINTANA","20302",480,83101,1003,"02","18","CF18201","00.0",9689,2,null,20171001,20171231,44706.509999999995,0]
[null,"CHIHUAHUA","08DPT0012I",124,"PEDR620906HG6","PEDR620906HCHRMM07","RAMON JAVIER PEREZ DOMINGUEZ","50401",480,83101,1003,"02","18","CF02104","00.0",12726,5,null,20171001,20171231,107437.06,0]
[null,"CHIHUAHUA","08DPT0012I",124,"ROCR700830F58","ROCR700830HCHDNC08","RICARDO ANTELMO RODRIGUEZ CANO","20302",480,83101,1003,"02","18","S01202","00.0",9681,2,null,20171001,20171231,50271.909999999996,0]
[null,"CHIHUAHUA","08DPT0012I",124,"ROTF760823LY5","ROTF760823MCHDRL03","FLOR GUADALUPE RODRIGUEZ TREJO","20216",480,83101,1003,"02","18","CF04201","00.0",9676,2,null,20171001,20171231,62391.76,0]
[null,"CHIHUAHUA","08DPT0012I",124,"SOMD561124TEA","SOMD561124HCHTDV09","DAVID SOTELO MEDRANO","20205",480,83101,1003,"02","18","T08201","00.0",11851,2,null,20171001,20171231,59814.09,0]
[null,"CHIHUAHUA","08DPT0012I",124,"TERL781019J60","TERL781019HCHNDS08","LUIS CARLOS TENA RODELAS","20206",480,83101,1003,"02","18","CF21202","00.0",9694,2,null,20171001,20171231,55651.59,0]
[null,"CHIHUAHUA","08DPT0012I",124,"UIST6008045JA","UIST600804HDGRMM07","TOMAS URBINA SIMENTAL","20216",480,83101,1003,"02","18","CF18203","00.0",9691,2,null,20171001,20171231,60417.19,0]
[null,"CHIHUAHUA","08DPT0012I",124,"VAGA800112LSA","VAGA800112HCHLTL07","ALBERTO VALENZUELA GUTIERREZ",20216,480,83101,1003,"02","18","CF19201","00.0",9692,2,null,20171001,20171231,42526.95,0]
[null,"CHIHUAHUA","08DPT0012I",124,"VIMD590726DU0","VIMD590726HCHLRN05","DONACIANO VILLALOBOS MORENO","20109",480,83101,1003,"02","18","CF33206","00.0",13932,2,null,20171001,20171231,162240.50999999998,0]
[null,"CHIHUAHUA","08DPT0012I",200,"AARP7710257KA","AARP771025MCHLZL02","PALMA LILIANA ALMANZA RUIZ","30102",168,83101,1001,"02","18","L5XC",14,1,3,null,20171001,20171231,28066.799999999999,0]
[null,"CHIHUAHUA","08DPT0012I",124,"AAOG811026Q47","AAOG811026MCHRRB02","GABRIELA MARIA ARAGON ORTIZ","30102",240,83101,1001,"02","18","L5XCBII",20,1,3,null,20171001,20171231,33554.61,0]
[null,"CHIHUAHUA","08DPT0012I",100,"CARE8810091J2","CARE881009HCHRMD08","EDGAR ENRIQUE CARREON RAMOS","30102",216,83101,1001,"02","18","L5XC",18,1,3,null,20171001,20171231,33816.199999999997,0]
[null,"CHIHUAHUA","08DPT0012I",100,"CACP850903KT2","CACP850903MCHHHR00","PERLA JAZMIN CHAIREZ CHACON","30102",204,83101,1001,"02","18","L5XC",17,1,3,null,20171001,20171231,33175.729999999996,0]
[null,"CHIHUAHUA","08DPT0012I",100,"CAJG690110UD1","CAJG690110HCHHRN00","GONZALO CHAVEZ JUAREZ","30102",240,83101,1001,"02","18","L5XC",20,1,3,null,20171001,20171231,39789.130000000005,0]
[null,"CHIHUAHUA","08DPT0012I",200,"CAMN760505UE4","CAMN760505MCHHNN03","NANCY LORENA CHAVEZ MONCADA","30102",192,83101,1001,"02","18","L5XC",16,1,3,null,20171001,20171231,31847.65,0]
[null,"CHIHUAHUA","08DPT0012I",100,"PEMC8412061M5","PEMC841206HCHXRR02","CARLOS DE LA PEÑA MERAZ","30102",120,83101,1001,"02","18","L5XC",10,1,3,null,20171001,20171231,20069.5,0]
[null,"CHIHUAHUA","08DPT0012I",100,"DOCE610806AJ3","DOCE610806MCHMMS03","ESPERANZA DOMINGUEZ CAMUÑEZ","30102",240,83101,1001,"02","18","L5XCBI",20,1,3,null,20171001,20171231,29674.07,0]
[null,"CHIHUAHUA","08DPT0012I",100,"DOCA7712105BA","DOCA771210HCHMSL05","ALVARO DOMINGUEZ CASARES","30102",240,83101,1001,"02","18","L5XCBI",20,1,3,null,20171001,20171231,28518.639999999999,0]
[null,"CHIHUAHUA","08DPT0012I",200,"DOTW8710023S3","DOTW871002HCHMRL06","WALTER ALEJANDRO DOMINGUEZ TORRES","30102",192,83101,1001,"02","18","L5XC",16,1,3,null,20171001,20171231,31046.510000000006,0]
[null,"CHIHUAHUA","08DPT0012I",100,"DUIA911217JM8","DUIA911217HCHRBR05","ARMANDO ALEXIS DUARTE IBARRA","30102",180,83101,1001,"02","18","L5XCBI",15,1,3,null,20171001,20171231,22922.629999999997,0]
[null,"CHIHUAHUA","08DPT0012I",124,"EACL761108IA6","EACL761108HCHSHS08","JOSE LUIS ESTRADA CHAVEZ","30102",156,83101,1001,"02","18","L5XATEC",13,1,3,null,20171001,20171231,13797.57,0]
[null,"CHIHUAHUA","08DPT0012I",200,"FITM7609208P9","FITM760920MCHGVR05","MARISOL FIGUEROA TOVAR","30102",216,83101,1001,"02","18","L5XC",18,1,3,null,20171001,20171231,35554.81,0]
[null,"CHIHUAHUA","08DPT0012I",124,"FORM921019289","FORM921019HCHLDR09","MARCO ANTONIO FLORES RODRIGUEZ","30102",204,83101,1001,"02","18","L5XCBI",17,1,3,null,20171001,20171231,26026.989999999998,0]
[null,"CHIHUAHUA","08DPT0012I",100,"GAMC820716BJ4","GAMC820716MCHLRR08","MARIA DEL CARMEN GALLEGOS MARTINEZ","30102",240,83101,1001,"02","18","L5XC",20,1,3,null,20171001,20171231,39348.559999999998,0]
[null,"CHIHUAHUA","08DPT0012I",100,"GOCS820528T91","GOCS820528MCHNLN05","SANDRA BERENICE GONZALEZ COLMENERO","30102",240,83101,1001,"02","18","L5XC",20,1,3,null,20171001,20171231,39149.82,0]
[null,"CHIHUAHUA","08DPT0012I",100,"GOGG631226J88","GOGG631226MCHNLL06","GLORIA MARINA GONZALEZ GALLEGOS","30102",240,83101,1001,"02","18","L5XC",20,1,3,null,20171001,20171231,38598.270000000004,0]
[null,"CHIHUAHUA","08DPT0012I",100,"GOQM960413969","GOQM960413HCHNXR03","MARCO ANTONIO GONZALEZ QUIÑONEZ","30102",108,83101,1001,"02","18","L5XATEC",9,1,3,null,20171001,20171231,11391.93,0]
[null,"CHIHUAHUA","08DPT0012I",100,"GAMO630830H94","GAMO630830MCHRRL07","OLGA CECILIA GRAJEDA  MIRAMONTES","30102",240,83101,1001,"02","18","L5XC",20,1,3,null,20171001,20171231,39298.559999999998,0]
[null,"CHIHUAHUA","08DPT0012I",124,"HEGP741201TCA","HEGP741201MCHRRT03","PATRICIA OLAYA HERRERA GARCIA","30102",204,83101,1001,"02","18","L5XC",17,1,3,null,20171001,20171231,34019.53,0]
[null,"CHIHUAHUA","08DPT0012I",100,"IIOF8012093M1","IIOF801209HCHRLR08","FRANCISCO IRIGOYEN OLIVAS","30102",240,83101,1001,"02","18","L5XC",20,1,3,null,20171001,20171231,39749.82,0]
[null,"CHIHUAHUA","08DPT0012I",200,"IAFR620519979","IAFR620519HSLZRM07","RAMON  IZAGUIRRE FIERRO","30102",228,83101,1001,"02","18","L5XCBII",19,1,3,null,20171001,20171231,30852.789999999997,0]
[null,"CHIHUAHUA","08DPT0012I",200,"JAAG74101784A","JAAG741017MCHQRL01","GLORIA LINDA JAQUEZ ARBALLO","30102",240,83101,1001,"02","18","L5XC",20,1,3,null,20171001,20171231,39398.559999999998,0]
[null,"CHIHUAHUA","08DPT0012I",200,"LAGL890709J41","LAGL890709MCHZNL07","LLUVIA CRISTINA LAZO GONZALEZ","30102",228,83101,1001,"02","18","L5XCBII",19,1,3,null,20171001,20171231,31946.939999999995,0]
[null,"CHIHUAHUA","08DPT0012I",200,"MALS840210DM2","MALS840210MCHCYL02","SILVIA ISELA MACIAS LOYA","30102",120,83101,1001,"02","18","L5XC",10,1,3,null,20171001,20171231,21328.58,0]
[null,"CHIHUAHUA","08DPT0012I",124,"MAGZ860917JB4","MAGZ860917MCHLLL02","ZULEYKA MARIELA MALDONADO GIL","30102",240,83101,1001,"02","18","L5XC",20,1,3,null,20171001,20171231,38449.82,0]
[null,"CHIHUAHUA","08DPT0012I",200,"MATM841124GU1","MATM841124MCHRLY00","MAYTEE ABRIL MARQUEZ TELLO","30102",156,83101,1001,"02","18","L5XC",13,1,3,null,20171001,20171231,26781.99,0]
[null,"CHIHUAHUA","08DPT0012I",100,"MAGM880802UR1","MAGM880802MCHRRR08","MARINA ANGELICA MARTINEZ GARCIA","30102",240,83101,1001,"02","18","L5XC",20,1,3,null,20171001,20171231,38799.050000000003,0]
[null,"CHIHUAHUA","08DPT0012I",200,"MEOE6606187C0","MEOE660618HCHLRF02","EFREN MELENDEZ ORTIZ","30102",180,83101,1001,"02","18","L5XC",15,1,3,null,20171001,20171231,29332.61,0]
[null,"CHIHUAHUA","08DPT0012I",100,"MERA900126FD2","MERA900126MCHNMN03","ANA ISABEL MENDOZA RAMOS","30102",240,83101,1001,"02","18","L5XCBI",20,1,3,null,20171001,20171231,30063.190000000002,0]
[null,"CHIHUAHUA","08DPT0012I",124,"MOEJ8410204P7","MOEJ841020HCHRSS09","JESUS MORENO ESTRADA","30102",144,83101,1001,"02","18","L5XCBII",12,1,3,null,20171001,20171231,21899.510000000002,0]
[null,"CHIHUAHUA","08DPT0012I",200,"NUMR860506DV4","NUMR860506MCHXRQ03","RAQUEL NUÑEZ MARTINEZ","30102",240,83101,1001,"02","18","L5XC",20,1,3,null,20171001,20171231,39099.82,0]
[null,"CHIHUAHUA","08DPT0012I",200,"OIPC830620AE8","OIPC830620HCHRRR03","CARLOS ALEJANDRO ORTIZ PAREDES","30102",216,83101,1001,"02","18","L5XC",18,1,3,null,20171001,20171231,35216.199999999997,0]
[null,"CHIHUAHUA","08DPT0012I",100,"PAVC680810379","PAVC680810MCHLLR09","CARMEN LORENA PALMA VALVERDE","30102",192,83101,1001,"02","18","L5XC",16,1,3,null,20171001,20171231,31337.440000000002,0]
[null,"CHIHUAHUA","08DPT0012I",100,"PAVK8303143F4","PAVK830314MCHYLR05","KARLA DENISSE PAYAN VALVERDE","30102",240,83101,1001,"02","18","L5XC",20,1,3,null,20171001,20171231,39099.82,0]
[null,"CHIHUAHUA","08DPT0012I",100,"POED8604086S3","POED860408MCHRCN03","DIANA ELIZABETH PORTILLO ECHAVARRIA","30102",240,83101,1001,"02","18","L5XC",20,1,3,null,20171001,20171231,39049.82,0]
[null,"CHIHUAHUA","08DPT0012I",200,"RORH430507A24","RORH430507HDGBMC03","HECTOR ANTONIO ROBALI ROMERO","30102",240,83101,1001,"02","18","L5XC",20,1,3,null,20171001,20171231,37248.559999999998,0]
[null,"CHIHUAHUA","08DPT0012I",200,"ROAN6811104YA","ROAN681110HVZDGX08","JOSE NOE RODRIGUEZ AGUILERA","30102",156,83101,1001,"02","18","L5XC",13,1,3,null,20171001,20171231,26851.440000000002,0]
[null,"CHIHUAHUA","08DPT0012I",100,"ROVC830522ILA","ROVC830522MCHDLR00","CRISTINA RODRIGUEZ VALVERDE","30102",216,83101,1001,"02","18","L5XCBI",18,1,3,null,20171001,20171231,26855.55,0]
[null,"CHIHUAHUA","08DPT0012I",200,"SAME780216645","SAME780216MCHCLS05","ESMERALDA SAUCEDO MOLINA","30102",228,83101,1001,"02","18","L5XC",19,1,3,null,20171001,20171231,36883.58,0]
[null,"CHIHUAHUA","08DPT0012I",200,"UUGA831111DY9","UUGA831111MCHRND03","ADRIANA ARMINE URQUIZA GONZALEZ","30102",240,83101,1001,"02","18","L5XC",20,1,3,null,20171001,20171231,38548.270000000004,0]
[null,"CHIHUAHUA","08DPT0012I",100,"VATL8403292K8","VATL840329HCHLRS05","LUIS OCTAVIO VALVERDE TORRES","30102",240,83101,1001,"02","18","L5XCBII",20,1,3,null,20171001,20171231,33628.53,0]
[null,"CHIHUAHUA","08DPT0012I",100,"VACA8309027BA","VXCA830902HCHZHN07","ANDRES VAZQUEZ  CHAVEZ","30102",228,83101,1001,"02","18","L5XC",19,1,3,null,20171001,20171231,36808.050000000003,0]
[null,"CHIHUAHUA","08DPT0012I",200,"VIVR8208282T1","VIVR820828HDGLLB03","ROBERTO RENE VILLALPALDO VILLALPANDO","30102",228,83101,1001,"02","18","L5XATEC",19,1,3,null,20171001,20171231,21753.679999999997,0]
[null,"CHIHUAHUA","08DPT0011J",120,"AAEJ730109C94","AAEJ730109HCHLSL06","ALVAREZ ESCARCEGA JULIAN ","20206",480,83101,1003,"02",19,"S01201","00.0","9738",2,null,20171001,20171231,28828.859999999997,0]
[null,"CHIHUAHUA","08DPT0011J",121,"AOJS831129TE8","AOJS831129MCHNRL09","ANCHONDO JUAREZ SILVIA GRACIELA",20206,480,83101,1003,"02",19,"S01202","00.1","2386",2,null,20171001,20171231,43022.92,0]
[null,"CHIHUAHUA","08DPT0011J",120,"AOLY671118ELA","AOLY671118MDGRCZ05","ARROYO LECHUGA YAZMIN",20109,480,83101,1003,"02",19,"CF33206","00.2","14302",2,null,20171001,20171231,148495.32,0]
[null,"CHIHUAHUA","08DPT0011J",120,"BARM6606271QA","BARM660627HCHRBR03","MARIO ALBERTO BARBA RUBIO ","20216",480,83101,1003,"02",19,"CF18201","00.3","9741",2,null,20171001,20171231,37759.810000000005,0]
[null,"CHIHUAHUA","08DPT0011J",120,"CAMF661018JC7","CAMF661018HCHHDR08","FRANCISCO JAVIER CABRERA MEDINA","20205",480,83101,1003,"02",19,"CF33204","00.4","6359",2,null,20171001,20171231,106560.54,0]
[null,"CHIHUAHUA","08DPT0011J",120,"EUGM7504107E2","EUGM750410HCHSRR05","ESQUIVEL GUERRERO MAURO EZEQUIEL ",20216,480,83101,1003,"02",19,"S01202","00.5","9718",2,null,20171001,20171231,40250.85,0]
[null,"CHIHUAHUA","08DPT0011J",120,"FACG681029MZ8","FACG681029MCHDRR04","GEORGINA FAUDOA CRUZ","50408",480,83101,1003,"02",19,"CF19201","00.6",9706,2,null,20171001,20171231,60948.649999999994,0]
[null,"CHIHUAHUA","08DPT0011J",120,"FEPD840911LH2","FEPD840911MCHRZN04","DENISSE JANETT FERNANDEZ PAEZ","20214",480,83101,1003,"02",19,"CF33204","00.7","9714",2,null,20171001,20171231,85357,0]
[null,"CHIHUAHUA","08DPT0011J",120,"FOTL710111DG5","FOTL710111MDFLNL02","LILLIAN KARINA FLOTTE TINOCO ",20109,480,83101,1003,"02",19,"CF33206","00.8","14303",2,null,20171001,20171231,106696.23999999998,0]
[null,"CHIHUAHUA","08DPT0011J",120,"GAGJ740328P75","GAGJ740328HCHLNR03","JORGE ARTURO GALLEGOS GONZALEZ","20109",480,83101,1003,"02",19,"CF18203","00.9","9725",2,null,20171001,20171231,56578.5,0]
[null,"CHIHUAHUA","08DPT0011J",120,"GOQG650428BVA","GOQG650428MCHNNR07","GEORGINA GONZALEZ QUINTANA","20216",480,83101,1003,"02",19,"A03202","00.10","9700",2,null,20171001,20171231,52717.09,0]
[null,"CHIHUAHUA","08DPT0011J",120,"GURJ541104T10","GURJ541104HCHRMS04","JESUS LUIS GUERRA RAMIREZ","20206",480,83101,1003,"02",19,"CF18201","00.11","9720",2,null,20171001,20171231,54748.72,0]
[null,"CHIHUAHUA","08DPT0011J",120,"HENE680323MJ1","HENE680323MCHRRL03","ELIDA HERNANDEZ NORES","20214",480,83101,1003,"02",19,"A03202","00.12","9701",2,null,20171001,20171231,56301.29,0]
[null,"CHIHUAHUA","08DPT0011J",120,"LIGG8206272AA","LIGG820627HCLRRZ15","GIEZI LIRA GARCIA","20214",480,83101,1003,"02",19,"CF18203","00.13","9710",2,null,20171001,20171231,56974.03,0]
[null,"CHIHUAHUA","08DPT0011J",120,"LOCJ4605101D2","LOCJ460510HCHPSS06","JESUS LOPEZ CASTRO","20206",480,83101,1003,"02",19,"A03202","00.14","9776",2,null,20171001,20171231,53842.2,0]
[null,"CHIHUAHUA","08DPT0011J",120,"LOPO671113I30","LOPO671113HCHPRS00","OSCAR BENJAMIN LOPEZ PEREZ","20216",480,83101,1003,"02",19,"CF33206","00.15","13188",2,null,20171001,20171231,153529.97,0]
[null,"CHIHUAHUA","08DPT0011J",120,"MACE880915VB1","MACE880915HCHRNR04","ERICK MARTELL CONTRERAS ",20205,480,83101,1003,"02",19,"CF33204","00.16","9705",2,null,20171001,20171231,74466.22,0]
[null,"CHIHUAHUA","08DPT0011J",120,"MAGI710826BY5","MAGI710826HCHRNV05","IVONNE ARACELI MARTINEZ GONZALEZ","20216",480,83101,1003,"02",19,"CF33204","00.17","9699",2,null,20171001,20171231,100805.42,0]
[null,"CHIHUAHUA","08DPT0011J",120,"MAVE810424SY3","MAVE810424MCHRLL08","ELIA ZURASY MARTINEZ VELO","20206",480,83101,1003,"02",19,"S01201","00.18","9738",2,null,20171001,20171231,40826.68,0]
[null,"CHIHUAHUA","08DPT0011J",120,"MEGM480906839","MEGM480906HCHNNG00","MIGUEL ANGEL MENDOZA GONZALEZ","20206",480,83101,1003,"02",19,"S01201","00.19","9728",2,null,20171001,20171231,41155.340000000004,0]
[null,"CHIHUAHUA","08DPT0011J",120,"MOCY820701FR6","MOCY820701MCHRHS01","YESSENIA IVONNE MORENO CHAVEZ","20202",480,83101,1003,"02",19,"CF33206","00.20","13640",2,null,20171001,20171231,141301.31,0]
[null,"CHIHUAHUA","08DPT0011J",120,"OIFL620226A15","OIFL620226MCHLLD03","LIDIA GUADALUPE OLIVAS FLORES",20102,480,83101,1003,"02",19,"CF33206","00.21","14303",2,null,20171001,20171231,78914.7,0]
[null,"CHIHUAHUA","08DPT0011J",120,"OESN6905137N5","OESN690513MCHRCR06","NORMA ORTEGA SCOTT","20104",480,83101,1003,"02",19,"CF33204","00.22","9704",2,null,20171001,20171231,107927.87,0]
[null,"CHIHUAHUA","08DPT0011J",120,"OIAA580304QJ4","OIAA580304HCHRRB04","ABRAHAM ORTIZ ARMENDARIZ","20206",480,83101,1003,"02",19,"S01202","00.23","9722",2,null,20171001,20171231,52870.640000000007,0]
[null,"CHIHUAHUA","08DPT0011J",120,"PICM810405PX1","PICM810405MCHRRR02","MARIANA PRIETO CARRASCO ","20214",480,83101,1003,"02",19,"S01201","00.24","9723",2,null,20171001,20171231,35760.86,0]
[null,"CHIHUAHUA","08DPT0011J",120,"RUAJ680828NZ1","RUAJ680828HCHZGN01","JUAN CARLOS RUIZ AGUIRRE","20214",480,83101,1003,"02",19,"S1201","00.25","9709",2,null,20171001,20171231,40189.67,0]
[null,"CHIHUAHUA","08DPT0011J",120,"RUGC841213D50","RUGC841213HCHZNS07","CESAR ALEXIS RUIZ GONZALEZ","20101",480,83101,1003,"02",19,"CF02103","00.26","12652",2,null,20171001,20171231,107666.99000000002,0]
[null,"CHIHUAHUA","08DPT0011J",120,"SADC620717A78","SADC620717MCHLMR01","CARMEN ESTELA SALAS DOMINGUEZ",20214,480,83101,1003,"02",19,"CF33204","00.27","9702",2,null,20171001,20171231,81832.84,0]
[null,"CHIHUAHUA","08DPT0011J",120,"SACG701206260","SACG701206MCHLND02","MARIA GUADALUPE SALAZAR CONTRERAS","20214",480,83101,1003,"02",19,"CF33204","00.28","9730",2,null,20171001,20171231,105484.43999999999,0]
[null,"CHIHUAHUA","08DPT0011J",120,"VAAG6312036W2","VAAG631203HTSLVR03","GERARDO VALDEZ AVILA",20105,480,83101,1003,"02",19,"CF02103","00.29","13638",5,null,20171001,20171231,107527.31999999999,0]
[null,"CHIHUAHUA","08DPT0011J",120,"VILA590828MZ1","VILA590828HCHLZG06","AGUSTIN VILLAGRAN LOZOYA","20214",480,83101,1003,"02",19,"S1202","00.30","9737",2,null,20171001,20171231,43378.89,0]
[null,"CHIHUAHUA","08DPT0011J",120,"VIDV791004RJO","VIDV791004MCHLRR04","VIRGINIA VILLALBA DURAN","20206",480,83101,1003,"02",19,"CF04201","00.31","9696",2,null,20171001,20171231,54682.53,0]
[null,"CHIHUAHUA","08DPT0011J",120,"VIMS620916EH4","VIMS620916MCHLRN00","SANDRA HORTENSIA VILLALOBOS MARIN","20214",480,83101,1003,"02",19,"CF33204","00.32","2404",2,null,20171001,20171231,102139.01,0]
[null,"CHIHUAHUA","08DPT0011J",120,"VIYD670220UH2","VIYD670220MCHLXR09","DORA EMMA VILLALOBOS YAÑEZ","20214",480,83101,1003,"02",19,"A03202","00.33","9695",2,null,20171001,20171231,54604.380000000005,0]
[null,"CHIHUAHUA","08DPT0011J",120,"AOAJ720609R46","AOAJ720609MCHCLS06","MARÍA DE JESÚS ACOSTA ÁLVAREZ",30102,240,83101,1001,"02",19,"L5XCBI",20,1,3,null,20171001,20171231,26383.41,0]
[null,"CHIHUAHUA","08DPT0011J",120,"AOPA860917999","AOPA860917MCHCRG05","AGLAE BERENICE ACOSTA PORTILLO",30102,156,83101,1001,"02",19,"L5XCBI",13,1,3,null,20171001,20171231,17129.580000000002,0]
[null,"CHIHUAHUA","08DPT0011J",120,"AORC6607129B3","AORC660712HCHCMS03","CÉSAR RENÉ ACOSTA ROMO",30102,168,83101,1001,"02",19,"L5XCCBII",14,1,3,null,20171001,20171231,20756.68,0]
[null,"CHIHUAHUA","08DPT0011J",120,"AUVX671108950","AUVX671108MCHGLC09","XOCHITL MARGARITA AGUILAR VILLALOBOS",30102,240,83101,1001,"02",19,"L5XC",20,1,3,null,20171001,20171231,33592.39,0]
[null,"CHIHUAHUA","08DPT0011J",120,"AADF760822JB4","AADF760822MCHLML07","FLOR ANEL ALMANZA DOMÍNGUEZ",30102,216,83101,1001,"02",19,"L5XCCBII",18,1,3,null,20171001,20171231,30688.549999999996,0]
[null,"CHIHUAHUA","08DPT0011J",120,"AADF541004UL3","AADF541004HDGLMR07","FRANCISCO ALVARADO DOMÍNGUEZ",30102,240,83101,1001,"02",19,"L5XC",20,1,3,null,20171001,20171231,34222.620000000003,0]
[null,"CHIHUAHUA","08DPT0011J",120,"AAGD820816HU2","AAGD820816MCHLTL09","DALYLA ALVARADO GUTIÉRREZ",30102,240,83101,1001,"02",19,"L5XC",20,1,3,null,20171001,20171231,34222.620000000003,0]
[null,"CHIHUAHUA","08DPT0011J",120,"AASE930324BT6","AASE930324MCHLLD02","EDITH ALVAREZ SALASAR",30102,216,83101,1001,"02",19,"L5XCCBII",18,1,3,null,20171001,20171231,17457.45,0]
[null,"CHIHUAHUA","08DPT0011J",120,"AAOG691105623","AAOG691105HCHLCS09","GASTÓN ÁLVAREZ OCHOA",30102,216,83101,1001,"02",19,"L5XCBII",18,1,3,null,20171001,20171231,30800.359999999993,0]
[null,"CHIHUAHUA","08DPT0011J",120,"AIRL900105A19","AIRL900105HCHLSS09","JOSÉ LUIS ALVÍDREZ RÍOS",30102,216,83101,1001,"02",19,"L5XCBI",18,1,3,null,20171001,20171231,26782.21,0]
[null,"CHIHUAHUA","08DPT0011J",120,"AALU670310HX2","AAXL670310HCHMXS16","LUIS CARLOS AMAYA X",30102,240,83101,1001,"02",19,"L5XC",20,1,3,null,20171001,20171231,34222.620000000003,0]
[null,"CHIHUAHUA","08DPT0011J",120,"AAAM880501","AAAM880501MCHNCL02","MILDRET ARLETTE ANDRADE ACOSTA",30102,216,83101,1001,"02",19,"L5XCBI ",18,1,3,null,20171001,20171231,23507.579999999998,0]
[null,"CHIHUAHUA","08DPT0011J",120,"AIDJ6101296Q4","AIDJ610129HCHVLS09","JESÚS HUMBERTO ÁVILA DELGADO",30102,240,83101,1001,"02",19,"L5XC",20,1,3,null,20171001,20171231,34171.67,0]
[null,"CHIHUAHUA","08DPT0011J",120,"AIQC690227LQ0","AIQC690227HCHVNS05","CESAR ROGACIANO ÁVILA QUINTANA",30102,180,83101,1001,"02",19,"L5XCBI",15,1,3,null,20171001,20171231,21384.430000000004,0]
[null,"CHIHUAHUA","08DPT0011J",120,"BABR540126HB4","BABR540126HCHZDL02","RAÚL GABRIEL BAEZA BEDOY",30102,240,83101,1001,"02",19,"L5XC",20,1,3,null,20171001,20171231,32962.160000000003,0]
[null,"CHIHUAHUA","08DPT0011J",120,"BAGA570401CF3","BAGA570401HCHRNN09","ANDRÉS BARBA GÁNDARA",30102,240,83101,1001,"02",19,"L5XC",20,1,3,null,20171001,20171231,39606.11,0]
[null,"CHIHUAHUA","08DPT0011J",120,"BASZ650208NL8","BASZ650208MMCRTH02","ZHENIA PATRICIA BARRAZA STOELTING",30102,180,83101,1001,"02",19,"L5XC",15,1,3,null,20171001,20171231,27788.070000000007,0]
[null,"CHIHUAHUA","08DPT0011J",120,"BEAG740617517","BEAG740617MSLJRB00","MARÍA GABIELA BEJARANO ARREDONDO",30102,240,83101,1001,"02",19,"L5XCBI",20,1,3,null,20171001,20171231,29652.39,0]
[null,"CHIHUAHUA","08DPT0011J",120,"BEML730902B28","BEML730902HCHLRS07","JOSÉ LUIS BELTRÁN MÁRQUEZ",30102,240,83101,1001,"02",19,"L5XC",20,1,3,null,20171001,20171231,34222.620000000003,0]
[null,"CHIHUAHUA","08DPT0011J",120,"BACJ820811R51","BACJ820811HCHLRN02","JUAN JOSÉ BLANCO CRUZ",30102,120,83101,1001,"02",19,"L5XCCBII",10,1,3,null,20171001,20171231,16989.59,0]
[null,"CHIHUAHUA","08DPT0011J",120,"BASH700602N82","BASH700602HCHLNR08","HERNÁN BLANCO SÁENZ",30102,216,83101,1001,"02",19,"L5XC",18,1,3,null,20171001,20171231,31166.419999999995,0]
[null,"CHIHUAHUA","08DPT0011J",120,"CAHJ821204323","CAHJ821204HCHBRL07","JOEL ANTONIO CABALLERO HERNÁNDEZ",30102,216,83101,1001,"02",19,"L5XC",18,1,3,null,20171001,20171231,31166.419999999995,0]
[null,"CHIHUAHUA","08DPT0011J",120,"CADL780717DQ0","CADL780717HCHMLS06","LUIS MANUEL CAMACHO DELGADO",30102,240,83101,1001,"02",19,"L5XCCBII",20,1,3,null,20171001,20171231,29652.39,0]
[null,"CHIHUAHUA","08DPT0011J",120,"CAML770621S57","CAML770621HCHRRS02","LUIS CARMONA MORA",30102,120,83101,1001,"02",19,"L5XCCBII",10,1,3,null,20171001,20171231,17024.669999999998,0]
[null,"CHIHUAHUA","08DPT0011J",120,"CAUC820727RA3","CAUC820727MCHRLN05","CINTHYA CARNERO ULLOA",30102,240,83101,1001,"02",19,"L5XCBI",20,1,3,null,20171001,20171231,29652.39,0]
[null,"CHIHUAHUA","08DPT0011J",120,"CAEI831214746","CAEI831214MCHRSV05","IVETH SELENE CARO ESCUDERO",30102,240,83101,1001,"02",19,"L5XCCBII",20,1,3,null,20171001,20171231,28868.81,0]
[null,"CHIHUAHUA","08DPT0011J",120,"CAGS5611036P5","CAGS561103MCHRLL06","SILVIA CARRASCO GALVÁN",30102,240,83101,1001,"02",19,"L5XC",20,1,3,null,20171001,20171231,32962.160000000003,0]
[null,"CHIHUAHUA","08DPT0011J",120,"CAVJ780821N37","CAVJ780821HCHZLS05","JESÚS MANUEL CAZARES VILLARREAL",30102,240,83101,1001,"02",19,"L5XCCBII",20,1,3,null,20171001,20171231,29652.39,0]
[null,"CHIHUAHUA","08DPT0011J",120,"CEPJ5209176A4","CEPJ520917MCLDXS03","MARÍA DE JESÚS CEDILLO PEÑA",30102,180,83101,1001,"02",19,"L5XC",15,1,3,null,20171001,20171231,26582.160000000003,0]
[null,"CHIHUAHUA","08DPT0011J",120,"CACL6504048EA","CACL650404HCHHHS06","JOSÉ LUIS CHAVARRÍA CHÁVEZ",30102,228,83101,1001,"02",19,"L5XC",19,1,3,null,20171001,20171231,32694.55,0]
[null,"CHIHUAHUA","08DPT0011J",120,"CALM790104KB2","CALM790104HCHHPN06","MANUEL ALBERTO CHAVIRA LÓPEZ",30102,240,83101,1001,"02",19,"L5XC",20,1,3,null,20171001,20171231,34222.620000000003,0]
[null,"CHIHUAHUA","08DPT0011J",120,"CORI861010967","CORI861010HCHNVS07","ISAÚL CONTRERAS RIVERA",30102,240,83101,1001,"02",19,"L5XCBI",20,1,3,null,20171001,20171231,26383.41,0]
[null,"CHIHUAHUA","08DPT0011J",120,"COVM710719995","COVM710719HCHRLR08","MARCO ANTONIO CORONADO VILLARREAL",30102,240,83101,1001,"02",19,"L5XC",20,1,3,null,20171001,20171231,32707.41,0]
[null,"CHIHUAHUA","08DPT0011J",120,"DIVM670828475","DIVM670828HCHZQN04","MANUEL DÍAZ VAQUERA",30102,180,83101,1001,"02",19,"L5XC",15,1,3,null,20171001,20171231,25601.350000000002,0]
[null,"CHIHUAHUA","08DPT0011J",120,"EICP660518T31","EICP660518MCHSRT02","PATRICIA EISSA CARRILLO",30102,180,83101,1001,"02",19,"L5XC",15,1,3,null,20171001,20171231,25667.000000000004,0]
[null,"CHIHUAHUA","08DPT0011J",120,"EIAL6904095Y1","EIAL690409MCHSLR06","LORENA MARGARITA ESPINOZA ALCALÁ",30102,240,83101,1001,"02",19,"L5XC",20,1,3,null,20171001,20171231,34222.620000000003,0]
[null,"CHIHUAHUA","08DPT0011J",120,"FOSJ7411047Y2","FOSJ741104HCHLLV00","JAVIER ARTURO FLORES SALAS",30102,180,83101,1001,"02",19,"L5XC",15,1,3,null,20171001,20171231,26139.670000000002,0]
[null,"CHIHUAHUA","08DPT0011J",120,"GAGJ711007916","GAGJ711007HCHBRL03","JULIÁN GABIRA DE LA GARZA",30102,228,83101,1001,"02",19,"L5XC",19,1,3,null,20171001,20171231,32511.52,0]
[null,"CHIHUAHUA","08DPT0011J",120,"GALP860519RL8","GALP860519MCHRCR06","PERLA LILIANA GARCÍA LUCERO",30102,240,83101,1001,"02",19,"L5XCCBII",20,1,3,null,20171001,20171231,29431.67,0]
[null,"CHIHUAHUA","08DPT0011J",120,"GAMJ7901211A8","GAMJ790121HCHRDS09","JESÚS ANTONIO GARCÍA MEDINA",30102,108,83101,1001,"02",19,"L5XCCBII",9,1,3,null,20171001,20171231,13298.089999999998,0]
[null,"CHIHUAHUA","08DPT0011J",120,"GOCC7107156X6","GOCC710715MCHNHR03","CARMEN GUADALUPE GONZÁLEZ CHACÓN",30102,216,83101,1001,"02",19,"L5XC",18,1,3,null,20171001,20171231,31192.679999999993,0]
[null,"CHIHUAHUA","08DPT0011J",120,"GOGJ721103UI4","GOGJ721103HCHNRL03","JULIO CESAR GONZÁLEZ GRANADOS",30102,240,83101,1001,"02",19,"L5XCCBII",20,1,3,null,20171001,20171231,34049.339999999997,0]
[null,"CHIHUAHUA","08DPT0011J",120,"GOPS631119234","GOPS631119HCHNZX06","SIXTO HUMBERTO GONZÁLEZ PÁEZ",30102,240,83101,1001,"02",19,"L5XC",20,1,3,null,20171001,20171231,34222.620000000003,0]
[null,"CHIHUAHUA","08DPT0011J",120,"GUTM700125H14","GUTM700125MCHRRR03","MARGARITA GUARDADO TORRES",30102,240,83101,1001,"02",19,"L5XC",20,1,3,null,20171001,20171231,34222.620000000003,0]
[null,"CHIHUAHUA","08DPT0011J",120,"GUGL640702V28","GUGL640702HCHTRS02","LUIS ROGELIO GUTIÉRREZ GARCÍA",30102,240,83101,1001,"02",19,"L5XC",20,1,3,null,20171001,20171231,33434.83,0]
[null,"CHIHUAHUA","08DPT0011J",120,"HECM730118619","HECM730118HCHRDR06","MAURICIO HERNÁNDEZ CAUDILLO",30102,48,83101,1001,"02",19,"L5XCCBII",4,1,3,null,20171001,20171231,6984.2400000000007,0]
[null,"CHIHUAHUA","08DPT0011J",120,"HEOD870714Q19","HEOD870714MCLRLN06","DIANA HERNÁNDEZ OLIVARES",30102,240,83101,1001,"02",19,"L5XCCBII",20,1,3,null,20171001,20171231,32610.239999999998,0]
[null,"CHIHUAHUA","08DPT0011J",120,"HETC8302175X4","HETC830217MCHRRN07","CINTHIA LIZETH HERNÁNDEZ TREVIÑO",30102,240,83101,1001,"02",19,"L5XC",20,1,3,null,20171001,20171231,33907.5,0]
[null,"CHIHUAHUA","08DPT0011J",120,"HEDM761211T33","HEDM761211MCHRZY08","MAYRA GUADALUPE HERRERA DÍAZ",30102,180,83101,1001,"02",19,"L5XC",15,1,3,null,20171001,20171231,26294.870000000003,0]
[null,"CHIHUAHUA","08DPT0011J",120,"JASX660321NQ4","JASX660321HZSYTM15","XAMIR JAYDAR SOTO",30102,240,83101,1001,"02",19,"L5XCCBII",20,1,3,null,20171001,20171231,34049.339999999997,0]
[null,"CHIHUAHUA","08DPT0011J",120,"JILS7804098R3","JILS780409HCHMZR04","SERGIO ARMANDO JIMÉNEZ LOZANO",30102,240,83101,1001,"02",19,"L5XCCBII",20,1,3,null,20171001,20171231,29652.39,0]
[null,"CHIHUAHUA","08DPT0011J",120,"JISR460111595","JISR460111HBCMLY00","REYNALDO JIMÉNEZ SOLÍS",30102,192,83101,1001,"02",19,"L5XC",16,1,3,null,20171001,20171231,28110.230000000003,0]
[null,"CHIHUAHUA","08DPT0011J",120,"LEGI810812S76","LEGI810812HCHYNR04","IRVING LEYVA GONZÁLEZ",30102,240,83101,1001,"02",19,"L5XC",20,1,3,null,20171001,20171231,34222.620000000003,0]
[null,"CHIHUAHUA","08DPT0011J",120,"LOGE770513D53","LOGE770513MCHPLL01","ELENA DEL ROSARIO LÓPEZ GALAVIZ",30102,240,83101,1001,"02",19,"L5XC",20,1,3,null,20171001,20171231,33854.979999999996,0]
[null,"CHIHUAHUA","08DPT0011J",120,"LUCL830421CC7","LUCL830421HCHVNS03","LUIS FERNANDO LUÉVANO CONTRERAS",30102,240,83101,1001,"02",19,"L5XCBI",20,1,3,null,20171001,20171231,29430.29,0]
[null,"CHIHUAHUA","08DPT0011J",120,"LURI7603163W9","LURI760316MCHJDR01","IRMA EMILLIA LUJAN RODRÍGUEZ",30102,228,83101,1001,"02",19,"L5XCBI",19,1,3,null,20171001,20171231,24955.919999999998,0]
[null,"CHIHUAHUA","08DPT0011J",120,"MEFJ6010186V1","MEFJ601018HCHNNS07","JESÚS ALBERTO MENCHACA FUENTES",30102,216,83101,1001,"02",19,"L5XCCBII",18,1,3,null,20171001,20171231,30993.139999999992,0]
[null,"CHIHUAHUA","08DPT0011J",120,"MEEJ750705D34","MEEJ750705HCHNSS02","JESÚS MENDOZA ESTEVANÉ",30102,240,83101,1001,"02",19,"L5XC",20,1,3,null,20171001,20171231,33907.5,0]
[null,"CHIHUAHUA","08DPT0011J",120,"MOVI660317J46","MOXV660317HCHLXC08","VÍCTOR MANUEL MOLINAR X",30102,240,83101,1001,"02",19,"L5XCCBII",20,1,3,null,20171001,20171231,29528.48,0]
[null,"CHIHUAHUA","08DPT0011J",120,"MORR640403339","MORR640403MCHNDS08","ROSARIO FLORENTINA MONTOYA RODRÍGUEZ",30102,240,83101,1001,"02",19,"L5XCCBII",20,1,3,null,20171001,20171231,34049.339999999997,0]
[null,"CHIHUAHUA","08DPT0011J",120,"MOEC8307215B7","MOEC830721HCHRSR06","CARLOS DANIEL MORALES ESPINOZA",30102,240,83101,1001,"02",19,"L5XCCBII",20,1,3,null,20171001,20171231,34049.339999999997,0]
[null,"CHIHUAHUA","08DPT0011J",120,"MOSV610329FQ0","MOSV610329HCHRTC06","VÍCTOR MORENO SOTO",30102,240,83101,1001,"02",19,"L5XC",20,1,3,null,20171001,20171231,34222.620000000003,0]
[null,"CHIHUAHUA","08DPT0011J",120,"MOOL690713831","MOOL690713MCHRSR07","LAURA MAGDALENA MORONES OSUNA",30102,240,83101,1001,"02",19,"L5XC",20,1,3,null,20171001,20171231,34222.620000000003,0]
[null,"CHIHUAHUA","08DPT0011J",120,"MORC720201UY4","MORC720201MCHRDL09","CLAUDIA MORONES RODRÍGUEZ",30102,240,83101,1001,"02",19,"L5XC",20,1,3,null,20171001,20171231,34222.620000000003,0]
[null,"CHIHUAHUA","08DPT0011J",120,"MUNL690829H48","MUNL690829MCHXTZ04","LUZ EMILIA MUÑOZ NATIVIDAD",30102,180,83101,1001,"02",19,"L5XC",15,1,3,null,20171001,20171231,26582.160000000003,0]
[null,"CHIHUAHUA","08DPT0011J",120,"NADJ630505N67","NADJ630505HCHVLN05","JUAN NAVA DELGADO",30102,240,83101,1001,"02",19,"L5XC",20,1,3,null,20171001,20171231,34222.620000000003,0]
[null,"CHIHUAHUA","08DPT0011J",120,"NAML740428B29","NAML740428MCHVRR05","LORENA IVONNE NAVA MORALES",30102,240,83101,1001,"02",19,"L5XC",20,1,3,null,20171001,20171231,34222.620000000003,0]
[null,"CHIHUAHUA","08DPT0011J",120,"NUGA831209HF9","NUGA831209HSLVZR04","ARTURO GUADALUPE NUEVO GUZMAN",30102,228,83101,1001,"02",19,"L5XCBI",19,1,3,null,20171001,20171231,24955.919999999998,0]
[null,"CHIHUAHUA","08DPT0011J",120,"OOMJ61083051A","OOMJ610830MCHCDN00","JUANA ROSA OCHOA MADRID",30102,240,83101,1001,"02",19,"L5XC",20,1,3,null,20171001,20171231,34222.620000000003,0]
[null,"CHIHUAHUA","08DPT0011J",120,"OOGI7603109Y9","OOGI760310HDGRNS08","ISIDRO OROZCO GONZÁLEZ",30102,240,83101,1001,"02",19,"L5XC",20,1,3,null,20171001,20171231,34209.49,0]
[null,"CHIHUAHUA","08DPT0011J",120,"OORA820321M63","OORA820321MCHRNY08","AYDE OROZCO RENOVA",30102,240,83101,1001,"02",19,"L5XCCBII",20,1,3,null,20171001,20171231,33524.020000000004,0]
[null,"CHIHUAHUA","08DPT0011J",120,"PAMC840828GP8","PAMC840828MCHCRR08","CRISTINA PACHECO MÁRQUEZ",30102,192,83101,1001,"02",19,"L5XC",16,1,3,null,20171001,20171231,26206.400000000001,0]
[null,"CHIHUAHUA","08DPT0011J",120,"PAPA6106238L4","PAPA610623HCHLXN04","ANTONIO PALACIO PIÑA",30102,240,83101,1001,"02",19,"L5XC",20,1,3,null,20171001,20171231,34222.620000000003,0]
[null,"CHIHUAHUA","08DPT0011J",120,"PEHJ6802298H5","PEHJ680229HCHRRN03","JUAN JOSÉ PÉREZ HERNÁNDEZ",30102,120,83101,1001,"02",19,"L5XC",10,1,3,null,20171001,20171231,18941.64,0]
[null,"CHIHUAHUA","08DPT0011J",120,"PERM720917SD7","PERM720917MCHRMR06","MARGARITA PÉREZ RAMÍREZ",30102,120,83101,1001,"02",19,"L5XCCBII",10,1,3,null,20171001,20171231,18678.93,0]
[null,"CHIHUAHUA","08DPT0011J",120,"PADM510809525","PADM510809HNTLZG08","MIGUEL ÁNGEL PLASCENCIA DÍAZ",30102,240,83101,1001,"02",19,"L5XC",20,1,3,null,20171001,20171231,34222.620000000003,0]
[null,"CHIHUAHUA","08DPT0011J",120,"POSR7405169RO","POSR740516HCHRNB07","JOSÉ ROBERTO PORTILLO SÁENZ",30102,216,83101,1001,"02",19,"L5XC",18,1,3,null,20171001,20171231,30723.929999999993,0]
[null,"CHIHUAHUA","08DPT0011J",120,"QUCC800518RJ7","QUCC800518MCHZML03","CLAUDIA ROCÍO QUEZADA CAMPOYA",30102,180,83101,1001,"02",19,"L5XC",15,1,3,null,20171001,20171231,25951.93,0]
[null,"CHIHUAHUA","08DPT0011J",120,"QUME830808SH6","QUME830808HCHXRR06","ERIC QUIÑONES MARIÑELARENA",30102,228,83101,1001,"02",19,"L5XC",19,1,3,null,20171001,20171231,32694.55,0]
[null,"CHIHUAHUA","08DPT0011J",120,"RARR491119L95","RARR491119HPLMVB06","ROBERTO PONCIANO RAMÍREZ RIVERA",30102,228,83101,1001,"02",19,"L5XC",19,1,3,null,20171001,20171231,32707.68,0]
[null,"CHIHUAHUA","08DPT0011J",120,"RAHA780618377","RAHA780618HCHMRD01","ADARIK QUILEO RAMOS HERRERA",30102,216,83101,1001,"02",19,"L5XC",18,1,3,null,20171001,20171231,31192.679999999993,0]
[null,"CHIHUAHUA","08DPT0011J",120,"RARL740713SN9","RARL740713MCHSYR08","LOURDES GABRIELA RASCÓN REYES",30102,240,83101,1001,"02",19,"L5XC",20,1,3,null,20171001,20171231,34156.97,0]
[null,"CHIHUAHUA","08DPT0011J",120,"REGJ630501KR7","REGJ630501HDFNRN07","JUAN CARLOS RENDÓN GARCÍA",30102,216,83101,1001,"02",19,"L5XC",18,1,3,null,20171001,20171231,30833.679999999993,0]
[null,"CHIHUAHUA","08DPT0011J",120,"RILA820506DD4","RILA820506HCHVCN08","ÁNGEL ARMANDO RIVERA LECHUGA",30102,216,83101,1001,"02",19,"L5XCBI",18,1,3,null,20171001,20171231,25774.41,0]
[null,"CHIHUAHUA","08DPT0011J",120,"ROVW790131VE9","ROVW790131HCHJLL05","WILFREDO ROJO VELÁZQUEZ",30102,240,83101,1001,"02",19,"L5XCCBII",20,1,3,null,20171001,20171231,34049.339999999997,0]
[null,"CHIHUAHUA","08DPT0011J",120,"ROHE830406P40","ROHE830406MCHMRL03","ELSA SAMANTHA ROMERO HERRERA",30102,156,83101,1001,"02",19,"L5XCBI",13,1,3,null,20171001,20171231,17605.300000000003,0]
[null,"CHIHUAHUA","08DPT0011J",120,"RUHJ7401277YA","RUHJ740127HCHZRR00","JORGE ARTURO RUIZ HEIRAS",30102,240,83101,1001,"02",19,"L5XC",20,1,3,null,20171001,20171231,34222.620000000003,0]
[null,"CHIHUAHUA","08DPT0011J",120,"RUBJ910211L87","RUBJ910211HCHZCS01","RUIZ ESPARZA BACASEHUA JOSÉ",30102,204,83101,1001,"02",19,"L5XCBII",17,1,3,null,20171001,20171231,16639.54,0]
[null,"CHIHUAHUA","08DPT0011J",120,"RUCJ590315LP9","RUCJ590315HZSZMS00","JOSÉ RUIZ ESPARZA CAMARENA",30102,120,83101,1001,"02",19,"L5XCCBII",10,1,3,null,20171001,20171231,15046.92,0]
[null,"CHIHUAHUA","08DPT0011J",120,"SARC670203156","SARC670203MDGLZR00","MARIA DEL CARMEN SALAS RUIZ",30102,156,83101,1001,"02",19,"L5XC",13,1,3,null,20171001,20171231,23578.48,0]
[null,"CHIHUAHUA","08DPT0011J",120,"SACD640228KY5","SACD640228HCHLNN03","DANIEL JAVIER SALAZAR CONTRERAS",30102,240,83101,1001,"02",19,"L5XC",20,1,3,null,20171001,20171231,26884.13,0]
[null,"CHIHUAHUA","08DPT0011J",120,"SASL611115CC2","SASL611115HCHMPP00","LEOPOLDO SAMANIEGO SEPÚLVEDA",30102,240,83101,1001,"02",19,"L5XC",20,1,3,null,20171001,20171231,34095.24,0]
[null,"CHIHUAHUA","08DPT0011J",120,"SAPJ770502I20","SAPJ770502HCHNRV00","JAVIER SÁNCHEZ PÉREZ",30102,168,83101,1001,"02",19,"L5XC",14,1,3,null,20171001,20171231,23538.819999999996,0]
[null,"CHIHUAHUA","08DPT0011J",120,"SEVK920127JG4","SEVK920127MCHGLR02","KAREN JEMIMA SEGOVIA VILLALOBOS",30102,240,83101,1001,"02",19,"L5XCBI",20,1,3,null,20171001,20171231,29528.48,0]
[null,"CHIHUAHUA","08DPT0011J",120,"TORR510819H11","TORR510819HDFLSL04","RAÚL ALBERTO TOLEDO ROSILLO",30102,240,83101,1001,"02",19,"L5XC",20,1,3,null,20171001,20171231,35636.660000000003,0]
[null,"CHIHUAHUA","08DPT0011J",120,"TOMG6805124B0","TOMG680512MCHRRB05","GABRIELA TORRES MORENO",30102,168,83101,1001,"02",19,"L5XC",14,1,3,null,20171001,20171231,23137.859999999997,0]
[null,"CHIHUAHUA","08DPT0011J",120,"TOPD7211138C2","TOPD721113MCHRRL03","DELIA ARMIDA TORRES PORTILLO",30102,240,83101,1001,"02",19,"L5XC",20,1,3,null,20171001,20171231,34222.620000000003,0]
[null,"CHIHUAHUA","08DPT0011J",120,"TORJ640811CX6","TORJ640811HCHVVS02","JOSÉ TOVAR RIVERO",30102,228,83101,1001,"02",19,"L5XC",19,1,3,null,20171001,20171231,32511.52,0]
[null,"CHIHUAHUA","08DPT0011J",120,"UUIL8212152F2","UUIL821215HCHRBS02","LUIS ALBERTO URQUIDI IBARBOL",30102,240,83101,1001,"02",19,"L5XCCBII",20,1,3,null,20171001,20171231,29261.03,0]
[null,"CHIHUAHUA","08DPT0011J",120,"VAPD660401U61","VAPD660401HCHLRN00","DANIEL VALADEZ PORTILLO",30102,240,83101,1001,"02",19,"L5XCCBII",20,1,3,null,20171001,20171231,34049.339999999997,0]
[null,"CHIHUAHUA","08DPT0011J",120,"VAGB5901245Z9","VAGB590124MCHLNL07","VALDERRABANO GONZÁLEZ BLANCA ESTELA ",30102,216,83101,1001,"02",19,"L5XC",18,1,3,null,20171001,20171231,30800.359999999993,0]
[null,"CHIHUAHUA","08DPT0011J",120,"VAHJ690910EY0","VAHJ690910HCHLRM02","JAIME VALENZUELA HERNÁNDEZ",30102,240,83101,1001,"02",19,"L5XC",20,1,3,null,20171001,20171231,34222.620000000003,0]
[null,"CHIHUAHUA","08DPT0011J",120,"VAGJ670203PVA","VAGJ670203HCLLVS03","JOSÉ VALLEJO GUEVARA",30102,228,83101,1001,"02",19,"L5XCCBII",19,1,3,null,20171001,20171231,28015.279999999999,0]
[null,"CHIHUAHUA","08DPT0011J",120,"VEDL620727PL3","VEDL620727MCHGRR05","LORETO VEGA DURAN",30102,240,83101,1001,"02",19,"L5XC",20,1,3,null,20171001,20171231,34222.620000000003,0]
[null,"CHIHUAHUA","08DPT0011J",120,"VEMA551027JGA","VEMA551027HCHGRR06","ARIEL VEGA MIRANDA",30102,204,83101,1001,"02",19,"L5XCCBII",17,1,3,null,20171001,20171231,29151.539999999997,0]
[null,"CHIHUAHUA","08DPT0011J",120,"VIPT690222Q18","VIPT690222MCHLXR04","MARIA TERESA VILLARREAL PIÑÓN",30102,240,83101,1001,"02",19,"L5XC",20,1,3,null,20171001,20171231,33907.5,0]
[null,"CHIHUAHUA","00XXX0000X",124,"LIAL810304JK3","LIAL810304MCHCRL00","LILIANA LICON ARAGONEZ",50301,480,83101,1003,"07","04","CF11102","00.0",10994,5,null,20171001,20171231,127345.83]
[null,"CHIHUAHUA","00XXX0000X",124,"CATC7205274V8","CATC720527HCHNRR09","CARLOS CANO TORRES",20303,480,83101,1003,"07","04","CF33204","00.0",10990,2,null,20171001,20171231,118152.38]
[null,"CHIHUAHUA","00XXX0000X",124,"EATH590728P67","EATH590728HCHSRG00","HUGO ESNAYRA TRISTAN",50705,480,83101,1003,"07","04","CF01601","00.0",10992,5,null,20171001,20171231,84502.13]
[null,"CHIHUAHUA","00XXX0000X",124,"GOMD671113QD6","GOMD671113HCHMRG03","DIEGO RAUL GOMEZ MARTINEZ",20303,480,83101,1003,"07","04","CF33204","00.0",11820,2,null,20171001,20171231,117904.54]
[null,"CHIHUAHUA","00XXX0000X",124,"MONL710121CT7","MONL710121MSLGVR08","LORENA INES MOGUEL NOVELO",50703,480,83101,1003,"07","04","CF01601","00.0",10993,5,null,20171001,20171231,84502.13]
[null,"CHIHUAHUA","00XXX0000X",124,"MOHB751008K98","MOHB751008MMNNRL03","BLANCA ESTELA MONTAÑEZ HERNANDEZ",20201,480,83101,1003,"07","04","CF33204","00.0",10999,2,null,20171001,20171231,99523.5]
[null,"CHIHUAHUA","00XXX0000X",124,"PALU750621U84","PAXL750621HCHLXS05","LUIS ENRIQUE PALACIOS",20303,480,83101,1003,"07","04","CF33204","00.0",10995,2,null,20171001,20171231,109994.8]
[null,"CHIHUAHUA","00XXX0000X",124,"PELV7211011F2","PELV721101MCHRYR06","VERONICA PERALES LEYVA",20201,80,83101,1003,"07","04","CF01601","00.0",11822,5,null,20171001,20171015,10338.25]
[null,"CHIHUAHUA","00XXX0000X",124,"QUEG630216GA8","QUEG630216MCHXSR02","GRACIELA QUIÑONEZ ESTRADA",20201,400,83101,1003,"07","04","CF01601","00.0",11822,5,null,20171016,20171231,58530.83]
[null,"CHIHUAHUA","00XXX0000X",124,"SAWV80120227A","SAWV801202MCLNLV05","VIVIANA SANCHEZ WILLIAMS",50704,480,83101,1003,"07","04","CF01601","00.0",11000,5,null,20171001,20171231,84502.13]
[null,"CHIHUAHUA","00XXX0000X",124,"VARM7910137D6","VARM791013MCHLMR03","MARISOL VALLES RAMOS",20206,480,83101,1003,"07","04","CF33204","00.0",11819,2,null,20171001,20171231,104051.21]
[null,"CHIHUAHUA","00XXX0000X",124,"AOCF590913PU5","AOCF590913HCHCNL08","FLAVIO FILOMENO ACOSTA CANO DE LOS RIOS","50201",480,83101,1003,"05","12","CF11100",0,10166,5,null,20171001,20171231,305035.04000000004,0]
[null,"CHIHUAHUA","00XXX0000X",124,"AAGE900717365","AAGE900717MCHZZL09","ELIZABETH AZAETA GUZMAN","20215",480,83101,1003,"05","12","CF34201",0,9729,2,null,20171001,20171231,46387.659999999996,0]
[null,"CHIHUAHUA","00XXX0000X",124,"CAMH8103197WA","CAMH810319HCHRRG06","HUGO ALBERTO CARMONA MORA","50608",480,83101,1003,"05","12","CF02100",0,12457,5,null,20171001,20171231,95755.799999999988,0]
[null,"CHIHUAHUA","00XXX0000X",124,"DEMS680803PI5","DEMS680803MCHLXN06","SANDRA DELGADO MUÑOZ","20109",480,83101,1003,"05","12","CF33206",0,13183,2,null,20171001,20171231,110460.47,0]
[null,"CHIHUAHUA","00XXX0000X",124,"DUCD810810J24","DUCD810810MCHRRN06","DANISSA DURAN CARO","20201",480,83101,1003,"05","12","CF33204",0,13186,2,null,20171001,20171231,121504.9,0]
[null,"CHIHUAHUA","00XXX0000X",124,"GACS670112I53","GACS670112MCHRHN02","SANDRA MARGARITA GARCIA CHAVEZ","20109",480,83101,1003,"05","12","CF33206",0,14136,2,null,20171001,20171231,145697.20000000001,0]
[null,"CHIHUAHUA","00XXX0000X",124,"GARG760607HY8","GARG760607HCHSMS07","GUSTAVO ALONSO GASCA RAMIREZ ",50201,480,83101,1003,"05","12","CF02100",0,10166,5,null,20171001,20171231,95518.64999999998,0]
[null,"CHIHUAHUA","00XXX0000X",124,"LAAC860420JE7","LAAC860420MCHBPL04","CLAUDIA PATRICIA LABRADO APARICIO","20201",480,83101,1003,"05","12","CF34205",0,10163,2,null,20171001,20171231,76752.53,0]
[null,"CHIHUAHUA","00XXX0000X",124,"MOSF7009259L5","MOSF700925HCHRTR02","FERNANDO ALBERTO MORA SOTO","20109",480,83101,1003,"05","12","CF33206",0,10160,2,null,20171001,20171231,151955.59,0]
[null,"CHIHUAHUA","00XXX0000X",124,"PAMA800623I22","PAMA800623MDGDRL02","PADILLA MARQUEZ ALICIA","20101",480,83101,1003,"05","12","CF33204",0,2413,2,null,20171001,20171231,87321.81,0]
[null,"CHIHUAHUA","00XXX0000X",124,"PEGC7811144HZ3","PEGC781114HCHRRS06","CESAR VALENTE PEREA GARCIA ","20202",480,83101,1003,"05","12","S01202",0,9718,2,null,20171001,20171231,45573.950000000004,0]
[null,"CHIHUAHUA","00XXX0000X",124,"RAMJ770419E96","RAMJ770419HSPMRS01","JESUS ALFONSO RAMIREZ MARRUFO","20201",480,83101,1003,"05","12","CF33204",0,8024,2,null,20171001,20171231,93844.65,0]
[null,"CHIHUAHUA","00XXX0000X",124,"RAPE620309J41","RAPE620309HCHYRN08","ENRIQUE RAY PORTILLO","50609",480,83101,1003,"05","12","CF02100",0,12456,5,null,20171001,20171231,95492.069999999992,0]
[null,"CHIHUAHUA","00XXX0000X",124,"ROMF8411116Z4","ROMF841111MCHJXR01","FARINA ROJAS MUÑOZ","20201",480,83101,1003,"05","12","ED01201",0,11615,2,null,20171001,20171231,25325.1]
[null,"CHIHUAHUA","00XXX0000X",124,"SACP740829IP4","SACP740829MCHLNL05","PILAR ALICIA SALAZAR CONTRERAS",20214,480,83101,1003,"05","12","T08201",0,11845,2,null,20171001,20171231,62200.920000000006,0]
[null,"CHIHUAHUA","00XXX0000X",124,"SIRS640927FF8","SIRS640927MCHLDL09","SILVIA SILVA RODRIGUEZ ","20104",480,83101,1003,"05","12","CF33206",0,14135,2,null,20171001,20171231,162780.38999999998,0]
[null,"CHIHUAHUA","00XXX0000X",124,"VARS761230AZ5","VARS761230MCHLML03","VALENZUELA RAMIREZ SILVIA CAROLINA",20215,480,83101,1003,"05","12","ED01201",0,11615,2,null,20171001,20171231,62760.37000000001,0]
[null,"CHIHUAHUA","00XXX0000X",124,"VAGP6007013D4","VAGP600701MCHLNT09","PATRICIA RAQUEL VALVERDE GONZALEZ","20105",480,83101,1003,"05","12","CF33206",0,10165,2,null,20171001,20171231,142738.92000000001,0]
[null,"Total Personas : ",753,null,null,null,null,null,null,null,null,null,null,"Total Plazas : ",null,243,null,null,"Total Pto. Federal",null,{"$f":"SUBTOTAL(109,Tabla12[Columna20])","v":37140120.173822954}]
[]
[null,null,null,null,null,null,null,null,null,null,null,null,null,null,null,null,null,null,"Total Ppto. Otras Fuentes:",null,null,{"$f":"SUM(V16:V770)","v":0}]
[]
[null,"*Total de Percepciones reportadas por la Entidad Federativa como pagadas al trabajador durante la comisión."]
[null,"Fuente : Información proporcionada por las Entidades Federativas"]

{"sheet":"II D) 2","index":7,"n_rows":47,"n_cols":19,"rows_kept":47,"cut":false,"hidden":false,"merged":[[11,16,12,16],[11,15,12,15],[11,17,12,17],[11,18,12,18],[11,6,11,12],[11,13,12,13],[11,14,12,14],[8,1,8,9],[11,0,12,0],[11,1,12,1],[11,5,12,5],[11,2,12,2],[11,3,12,3],[11,4,12,4]]}
[]
[]
[]
[]
[]
[]
[]
[null,"Formato: Movimientos de Plazas"]
[null,{"$f":"IF('1'!D22=\"Elige el Periodo…\",\"\",'1'!D22)","v":"Fondo de Aportaciones para la Educación Tecnológica y de Adultos/Colegio Nacional de Educación Profesional Técnica (FAETA/CONALEP)"},null,null,null,null,null,null,null,null,null,null,null,null,null,null,null,"4to. Trimestre 2017"]
[]
[]
[null,"Entidad Federativa","RFC","CURP","Nombre","Origen Presupuestal\n de la plazas","Clave Presupuestal",null,null,null,null,null,null,"Clave de nivel de puesto","Clave de nivel de sueldo","Zona Económica","Tipo de movimiento","Quincena Inicial","Quincena Final"]
[null,null,null,null,null,null,"Partida Presupuestal","Código de Pago","Clave de Unidad","Clave de Sub Unidad","Clave de Categoría","Horas Semana Mes ","Número de Plaza"]
[]
[null,"Entidad Federativa","RFC","CURP","Nombbre","Origen Presupuestal\n de la plazas","Partida Presupuestal","Código de Pago","Clave de Unidad","Clave de Sub Unidad","Clave de Categoría","Horas semana mes","Número de plaza","Clave de nivel de puesto","Clave de nivel de sueldo","Zona Económica","Tipo de movimiento","Quincena Inicial","Quincena Final"]
[null,"CHIHUAHUA","DILB701214BPA","DILB701214MCHZYL06  ","BLANCA ORILDE DIAZ LOYA","8310110030156A0320200.07472",83101,1003,"01","56","A03202","00.0",7472,27,"N05","C","2","201303",201719]
[null,"CHIHUAHUA","PELV7211011F2","PELV721101MCHRYR06  ","VERONICA PERALES LEYVA","8310110030704CF0160100.011822",83101,1003,"07","04","CF01601","00.0",11822,27,"OC1","A","2","201713",201719]
[null,"CHIHUAHUA","MELE5809218Z2","MELE580921MCHDLG09  ","MARIA EUGENIA MEDINA LEAL","8310110030026CF3320400.02441",83101,1003,"00","26","CF33204","00.0",2441,27,"N13","A","2","201104",201720]
[null,"CHIHUAHUA","MIRA630916H43","MIRA630916HCHRJN07  ","ANTONIO MIRANDA ROJO","8310110030208CF3320600.013383",83101,1003,"02","08","CF33206","00.0",13383,27,"N15","C","2","198707",201720]
[null,"CHIHUAHUA","ROAA691008HF2","ROAA691008HNLDLD05  ","ADRIAN DESIDERIO RODRIGUEZ ALMAGUER","8310110030026CF3320600.014112",83101,1003,"00","26","CF33206","00.0",14112,27,"N15","A","2","201205",201720]
[null,"CHIHUAHUA","HERO621113HM2","HEXR621113HCHRXG06","ROGELIO HERNANDEZ \\","8310110030026CF3320400.02450",83101,1003,"00","26","CF33204","00.0",2450,27,"N13","A","2","198018",201724]
[null,"CHIHUAHUA","MECR611201IB7","MECR611201HCHZRL07  ","RAUL MEZA CARDONA","8310110030026CF1820300.02442",83101,1003,"00","26","CF18203","00.0",2442,27,"N09","A","2","198509",201724]
[null,"CHIHUAHUA","EIDM611216HY9","EIDM611216MCHSMY09  ","MYRNA LETICIA ESPINOZA DOMINGUEZ","8310110030025CF1820300.02397",83101,1003,"00","25","CF18203","00.0",2397,27,"N09","C","2","198616",201724]
[null,"CHIHUAHUA","FOLC560327T8A","FOLC560327MDFLRR07  ","MARIA DEL CARMEN FLORES LARA","8310110030026CF3320600.09278",83101,1003,"00","26","CF33206","00.0",9278,27,"N15","A","2","200013",201724]
[null,"CHIHUAHUA","ROMF8411116Z4","ROMF841111MCHJXR01  ","FARINA ROJAS MUÑOZ","8310110030512ED0120100.011615",83101,1003,"05","12","ED01201","00.0",11615,27,"N06","C","1","201719",999999]
[null,"CHIHUAHUA","TULO5510064A6","TULO551006MCHDYL01  ","OLGA ESPERANZA TUDA LEYVAÑLEYVA","8310110030207CF3320600.013432",83101,1003,"02","07","CF33206","00.0",13432,27,"N15","A","1",201719,999999]
[null,"CHIHUAHUA","ROCS700130LMA","ROCS700130MDGDLL00  ","SILVIA ESTELA RODRIGUEZ CALVILLOÑCALVILLO","8310110030026CF0210500.014574",83101,1003,"00","26","CF02105","00.0",14574,27,"OB2","A","1",201719,999999]
[null,"CHIHUAHUA","QUEG630216GA8","QUEG630216MCHXSR02  ","GRACIELA QUI¤ONEZ ESTRADAÑESTRADA","8310110030704CF0160100.011822",83101,1003,"07","04","CF01601","00.0",11822,27,"OC1","A","1","201720",999999]
[null,"CHIHUAHUA","PIRE860510KC2","PIRE860510HCHZBS00  ","ESTALI PIZANO RUBIOÑRUBIO","8310110030025S0120100.010161",83101,1003,"00","25","S01201","00.0",10161,27,"N02","C","1","201721",999999]
[null,"CHIHUAHUA","BESJ800501RQ3","BESJ800501HCLRLL06  ","JULIO CESAR BERNAL SALASÑSALAS","8310110030208CF3320600.013383",83101,1003,"02","08","CF33206","00.0",13383,27,"N15","C","1","201722",999999]
[null,"CHIHUAHUA","RUNH860818SE6","RUNH860818HCHBJM07","HUMBERTO ALONSO RUBIO NAJERA","8310110010025L5XCBI18.00",83101,1001,"00","25","L5XCBI","18.0","0",27,0,"C",2,201715,201724]
[null,"CHIHUAHUA","HEEP940626UV1","HEEP940626MCHRSR02","PERLA ALEJANDRA HERNANDEZ ESTUPIÑON","8310110010025L5XCBI8.00",83101,1001,"00","25","L5XCBI","8.0","0",27,0,"C",2,201715,201724]
[null,"CHIHUAHUA","GOCY840110NQ4","GOCY840110MCHNLS07","YSELA GONZALEZ CALDERA","8310110010026L5XCBII11.00",83101,1001,"00","26","L5XCBII","11.0","0",27,0,"A",2,201715,201719]
[null,"CHIHUAHUA","GOCY840110NQ4","GOCY840110MCHNLS07","YSELA GONZALEZ CALDERA","8310110010026L5XCBII20.00",83101,1001,"00","26","L5XCBII","20.0","0",27,0,"A",1,201721,999999]
[null,"CHIHUAHUA","CACF650131IUA","CACF650131HCHNHL00","FILIBERTO CANO CHAVEZ","8310110010156L5XCBI9.00",83101,1001,"01","56","L5XCBI","9.0","0",27,0,"C",3,201715,201719]
[null,"CHIHUAHUA","CACF650131IUA","CACF650131HCHNHL00","FILIBERTO CANO CHAVEZ","8310110010156L5XCBI17.00",83101,1001,"01","56","L5XCBI","17.0","0",27,0,"C",3,201720,999999]
[null,"CHIHUAHUA","HISE750912LP7","HISE750912MCHNNT05","ETHEL YANETT HINOJOS SANCHEZ","8310110010156L5XCBII17.00",83101,1001,"01","56","L5XCBII","17.0","0",27,0,"C",3,201715,201719]
[null,"CHIHUAHUA","HISE750912LP7","HISE750912MCHNNT05","ETHEL YANETT HINOJOS SANCHEZ","8310110010156L5XCBII20.00",83101,1001,"01","56","L5XCBII","20.0","0",27,0,"C",3,201720,999999]
[null,"CHIHUAHUA","JUAL910425AX8","JUAL910425MCHRLL09","LILIAN JURADO ALVAREZ","8310110010156L5XCBI18.00",83101,1001,"01","56","L5XCBI","18.0","0",27,0,"C",2,201715,201720]
[null,"CHIHUAHUA","JUAL910425AX8","JUAL910425MCHRLL09","LILIAN JURADO ALVAREZ","8310110010156L5XCBI12.00",83101,1001,"01","56","L5XCBI","12.0","0",27,0,"C",1,201724,999999]
[null,"CHIHUAHUA","COGL890808DV8","COGL890808HCHBTS05","LUIS ALBERTO COBOS GUTIERREZ","8310110010156L5XCBI18.00",83101,1001,"01","56","L5XCBI","18.0","0",27,0,"C",1,201720,999999]
[null,"CHIHUAHUA","COGL890808DV8","COGL890808HCHBTS05","LUIS ALBERTO COBOS GUTIERREZ","8310110010156L5XCBI18.00",83101,1001,"01","56","L5XCBI","18.0","0",27,0,"C",2,201721,201722]
[null,"Total Personas : ",22,null,null,null,null,null,null,null,"Total Plazas : ",null,15]
[]
[]
[]
[null,"Fuente : Información proporcionada por las Entidades Federativas"]

{"sheet":"II D) 4","index":8,"n_rows":23,"n_cols":17,"rows_kept":23,"cut":false,"hidden":false,"merged":[[12,16,13,16],[12,5,13,5],[12,4,13,4],[12,3,13,3],[9,1,9,9],[19,13,19,14],[12,0,13,0],[12,6,13,6],[12,7,12,13],[12,14,12,15],[12,2,13,2],[12,1,13,1]]}
[]
[]
[]
[]
[]
[]
[]
[]
[null,"Formato: Trabajadores Jubilados en el Periodo"]
[null,{"$f":"IF('1'!D22=\"Elige el Periodo…\",\"\",'1'!D22)","v":"Fondo de Aportaciones para la Educación Tecnológica y de Adultos/Colegio Nacional de Educación Profesional Técnica (FAETA/CONALEP)"},null,null,null,null,null,null,null,null,null,null,null,null,null,"4to. Trimestre 2017"]
[]
[]
[null,"Entidad Federativa","R.F.C.","CURP","NOMBRE","Clave CT","Última(s) ó Penultima(s) Plaza(s) Ocupada(s)\n(*)","Clave Presupuestal de la Jubilación",null,null,null,null,null,null,"Periodo ocupado",null,"Quincena de inicio de jubilación"]
[null,null,null,null,null,null,null,"Partida Presupuestal","Código de Pago","Clave de Unidad","Clave de Sub Unidad","Clave de Categoría","Horas Semana Mes ","Número de Plaza","Inicio","Conclusión"]
[]
[null,"Entidad Federativa","R.F.C.","CURP","NOMBRE","Clave Centro de Trabajo","Última(s) ó Penultima(s) Plaza(s) Ocupada(s)\n(*)","Partida Presupuestal","Código de Pago","Clave de Unidad","Clave de Sub Unidad","Clave de Categoría","Horas Semana Mes ","Número de Plaza","Periodo ocupado\nInicio","Periodo ocupado\nConclusión","Quincena de inicio de jubilación"]
[null,"CHIHUAHUA","MIRA630916H43","MIRA630916HCHRJN07","ANTONIO MIRANDA ROJO","08DPT0008W",1,83101,1003,"02","08","CF33206","00.0",13383,198707,201720,201721]
[null,"Total Personas : ",1,null,null,null,null,null,null,null,null,"Total Plazas : ",null,1]
[]
[]
[]
[null,"Fuente : Información proporcionada por las Entidades Federativas"]
[null,"(*) Si  el trabajador se jubila con más de una clave presupuestal, por cada plaza se debe llenar un registro hasta que se haya informado acerca de todas las plazas del trabajador."]

{"sheet":"II D) 4 A","index":9,"n_rows":27,"n_cols":18,"rows_kept":27,"cut":false,"hidden":false,"merged":[[21,13,21,14],[9,1,9,7],[23,13,23,14],[12,17,13,17],[12,1,13,1],[12,2,13,2],[12,3,13,3],[12,4,13,4],[12,5,13,5],[12,6,12,12],[12,13,12,14],[12,15,13,15],[12,16,13,16]]}
[]
[]
[]
[]
[]
[]
[]
[]
[null,"Formato: Trabajadores que Tramitaron Licencia Prejubilatoria en el Periodo"]
[null,{"$f":"IF('1'!D22=\"Elige el Periodo…\",\"\",'1'!D22)","v":"Fondo de Aportaciones para la Educación Tecnológica y de Adultos/Colegio Nacional de Educación Profesional Técnica (FAETA/CONALEP)"},null,null,null,null,null,null,null,null,null,null,null,null,null,null,null,"4to. Trimestre 2017"]
[]
[]
[null,"Entidad Federativa","R.F.C.","CURP","NOMBRE","Clave integrada","Clave Presupuestal",null,null,null,null,null,null,"Periodo Licencia",null,"Percepciones pagadas con Presupuesto Federal en el  Periodo reportado*","Percepciones pagadas con Presupuesto de otra Fuente en el  Periodo reportado*","Clave CT Origen"]
[null,null,null,null,null,null,"Partida Presupuestal","Código de Pago","Clave de Unidad","Clave de Sub Unidad","Clave de Categoría","Horas Semana Mes ","Número de Plaza","Inicio","Conclusión"]
[]
[null,"Entidad Federativa","R.F.C.","CURP","NOMBRE","Clave integrada","Partida Presupuestal","Código de Pago","Clave de Unidad","Clave de Sub Unidad","Clave de Categoría","Horas Semana Mes ","Número de Plaza","Periodo Licencia\nInicio","Periodo Licencia\nConclusión","Percepciones pagadas con Presupuesto Federal en el  Periodo reportado*","Percepciones pagadas con Presupuesto de otra Fuente en el  Periodo reportado*","Clave CT Origen"]
[null,"CHIHUAHUA","EIDM611216HY9","EIDM611216MCHSMY09","MYRNA LETICIA ESPINOZA DOMINGUEZ","8310110030025CF1820300.02397",83101,1003,"00","25","CF18203","00.0",2397,20171001,20171231,69451.570000000007,0,"08DPT0001C"]
[null,"CHIHUAHUA","NASP6305126A9","NASP630512HCHJLD06","PEDRO GERARDO NAJERA SILVA","8310110030025CF3320600.02385",83101,1003,"00","25","CF33206","00.0",2385,20171101,20180131,145933.65,0,"08DPT0001C"]
[null,"CHIHUAHUA","HERO621113HM2","HEXR621113HCHRXG06","ROGELIO HERNANDEZ","8310110030026CF3320400.02450",83101,1003,"00","26","CF33204","00.0",2450,20171001,20171231,140198.15,0,"08DPT0002B"]
[null,"CHIHUAHUA","FOLC560327T8A","FOLC560327MDFLRR07","MARIA DEL CARMEN FLORES LARA","8310110030026CF3320600.09278",83101,1003,"00","26","CF33206","00.0",9278,20171001,20171231,166561.01999999999,0,"08DPT0002B"]
[null,"CHIHUAHUA","MECR611201IB7","MECR611201HCHZRL07","RAUL MEZA CARDONA","8310110030026CF1820300.02442",83101,1003,"00","26","CF18203","00.0",2442,20171001,20171231,89082.86,0,"08DPT0002B"]
[null,"Total Personas : ",5,null,null,null,null,null,null,null,"Total Plazas : ",null,5,"Total Pto. Federal",null,{"$f":"SUM(P17:P21)","v":611227.25}]
[]
[null,null,null,null,null,null,null,null,null,null,null,null,null,"Total Ppto. Otras Fuentes",null,null,0]
[]
[null,"*Total de Percepciones reportadas por la Entidad Federativa como pagadas en el periodo "]
[null,"Fuente : Información proporcionada por las Entidades Federativas"]

{"sheet":"II D) 6","index":10,"n_rows":24,"n_cols":13,"rows_kept":24,"cut":false,"hidden":false,"merged":[[10,1,10,6],[13,12,14,12],[13,9,13,10],[13,11,14,11],[13,1,14,1],[13,2,14,2],[13,3,14,3],[13,4,14,4],[13,5,14,5],[13,6,14,6],[13,7,13,8]]}
[]
[]
[]
[]
[]
[]
[]
[]
[]
[null,"Formato: Trabajadores Contratados por Honorarios en el Periodo"]
[null,{"$f":"IF('1'!D22=\"Elige el Periodo…\",\"\",'1'!D22)","v":"Fondo de Aportaciones para la Educación Tecnológica y de Adultos/Colegio Nacional de Educación Profesional Técnica (FAETA/CONALEP)"},null,null,null,null,null,null,null,null,null,"4to. Trimestre 2017"]
[]
[]
[null,"Entidad Federativa","Clave Centro de Trabajo","R.F.C.","CURP","Nombre","Identificador del Contrato","Equivalencia",null,"Periodo de Contratación",null,"Función","Percepciones pagadas dentro del periodo reportado"]
[null,null,null,null,null,null,null,"Clave de Categoría","Horas Semana Mes ","Inicio","Conclusión"]
[]
[null,"Entidad Federativa","Clave Centro de Trabajo","R.F.C.","CURP","Nombre","Identificador del Contrato","Clave de Categoría","Horas Semana Mes ","Periodo de Contratación\nInicio","Periodo de Contratación\nConclusión","Función","Percepciones pagadas dentro del periodo reportado"]
[null,"CHIHUAHUA","08DPT0011J","BAGA570401CF3","BAGA570401HCHRNN09","ANDRÉS BARBA GÁNDARA",1,"L5XC",20,20171001,20171231,"DOCENTE",39606.11]
[null,"Total Entidad Federativa Personas : ",null,1,null,null,null,null,null,null,null,"Subtotal Monto Pagado en el Periodo:",39606.11]
[]
[]
[null,null,null,null,null,null,null,null,null,"Total   Percepciones :",null,{"$f":"M19","v":39606.11}]
[]
[null,"Fuente : Información proporcionada por las Entidades Federativas"]

{"sheet":"II D) 7 1","index":11,"n_rows":163,"n_cols":19,"rows_kept":163,"cut":false,"hidden":false,"merged":[[8,17,8,18],[9,1,9,9],[12,6,13,6],[12,7,12,9],[12,10,13,10],[12,11,13,11],[12,12,13,12],[12,1,13,1],[12,2,13,2],[12,3,13,3],[12,4,13,4],[12,5,13,5],[12,17,13,17],[9,17,9,18],[156,16,156,17],[12,18,13,18],[12,13,13,13],[12,14,13,14],[12,15,13,15],[12,16,13,16]]}
[]
[]
[]
[]
[]
[]
[]
[]
[null,"Formato: Analítico de Categorías / Plazas Autorizadas con su Tabulador",null,null,null,null,null,null,null,null,null,null,null,null,null,null,"Entidad Federativa:",{"$f":"IF('1'!D21=\"Elige el Periodo…\",\"\",'1'!D21)","v":"CHIHUAHUA "}]
[null,{"$f":"IF('1'!D22=\"Elige el Periodo…\",\"\",'1'!D22)","v":"Fondo de Aportaciones para la Educación Tecnológica y de Adultos/Colegio Nacional de Educación Profesional Técnica (FAETA/CONALEP)"},null,null,null,null,null,null,null,null,null,null,null,null,null,null,null,"4to. Trimestre 2017"]
[]
[]
[null,"Clave Tipo educativo","Clave Nivel educativo","Clave Subnivel educativo","Descripción Nivel / Subnivel","Tipo Financiamiento","Partida Presupuestal","CATEGORIA",null,null,"Zona Económica","Nivel Puesto","Nivel Sueldo","Tipo Contratación","Monto mensual\npor plaza jornada","Monto mensual\nPor Plaza HSM","Número de Plazas Jornada","Número de Plazas HSM","Monto total autorizado"]
[null,null,null,null,null,null,null,"Tipo de Categoría"," Categoría","Descripción"]
[null,null,null,null,null,null,null,null,null,null,null,null,null,null,null,0]
[null,"Clave Tipo educativo","Clave Nivel educativo","Clave Subnivel educativo","Descripción Nivel / Subnivel","Tipo Financiamiento","Partida Presupestal","Tipo de Categoría"," Categoría","Descripción","Zona Económica","Nivel Puesto","Nivel Sueldo","Tipo Contratación","Monto mensual\npor plaza jornada","0","Número de Plazas Jornada","Número de Plazas HSM","Monto total autorizado"]
[null,2,21,"020","PERSONAL TECNICO",1,83101,5,"CF02103","DIRECTOR DE PLANTEL \"B\" Y \"C\"","C",27,"NB1","P",5753.58,null,1,0,5753.58]
[null,2,21,"020","PERSONAL TECNICO",1,83101,5,"CF02105","COORDINADOR EJECUTIVO II","C",27,"OB2","P",5165.88,null,1,0,5165.88]
[null,2,21,"020","PERSONAL TECNICO",1,83101,4,"CF33202","ASISTENTE ESCOLAR Y SOCIAL","C",27,"N07","P",8210.94,null,1,0,8210.94]
[null,2,21,"020","PERSONAL TECNICO",1,83101,4,"CF33206","JEFE DE PROYECTO","C",27,"N15","P",19992,null,1,0,19992]
[null,2,21,"020","PERSONAL TECNICO",1,83101,4,"CF33206","JEFE DE PROYECTO","C",27,"N15","P",22390.74,null,5,0,22390.74]
[null,2,21,"020","PERSONAL TECNICO",1,83101,4,"CF33204","SUBJEFE TECNICO ESPECIALISTA","C",27,"N13","P",12965.46,null,1,0,12965.46]
[null,2,21,"020","PERSONAL TECNICO",1,83101,4,"CF33204","SUBJEFE TECNICO ESPECIALISTA","C",27,"N13","P",13699.5,null,1,0,13699.5]
[null,2,21,"020","PERSONAL TECNICO",1,83101,4,"CF33204","SUBJEFE TECNICO ESPECIALISTA","C",27,"N13","P",14521.7,null,2,0,14521.7]
[null,2,21,"020","PERSONAL TECNICO",1,83101,4,"CF21202","ASISTENTE ESCOLAR Y SOCIAL","C",27,"N07","P",7630.54,null,1,0,7630.54]
[null,2,21,"020","PERSONAL TECNICO",1,83101,4,"CF04201","SECRETARIA \"B\"","C",27,"N07","P",7630.44,null,1,0,7630.44]
[null,2,21,"020","PERSONAL TECNICO",1,83101,4,"A03202","SECRETARIA \"C\"","C",27,"N05","P",7059.84,null,3,0,7059.84]
[null,2,21,"020","PERSONAL TECNICO",1,83101,4,"S01201","ASISTENTE DE SERVICIOS BASICOS","C",27,"N02","P",6220.4,null,1,0,6220.4]
[null,2,21,"020","PERSONAL TECNICO",1,83101,4,"S01201","ASISTENTE DE SERVICIOS BASICOS","C",27,"N02","P",5553.66,null,6,0,5553.66]
[null,2,21,"020","PERSONAL TECNICO",1,83101,4,"S01202","AUXILIAR DE SERVICIOS GENERALES","C",27,"N04","P",6778.6,null,2,0,6778.6]
[null,2,21,"020","PERSONAL TECNICO",1,83101,4,"S01202","AUXILIAR DE SERVICIOS GENERALES","C",27,"N04","P",6394.9,null,1,0,6394.9]
[null,2,21,"020","PERSONAL TECNICO",1,83101,4,"CF18201","AUXILIAR DE SEGURIDAD","C",27,"N02","P",5553.66,null,2,0,5553.66]
[null,2,21,"020","PERSONAL TECNICO",1,83101,4,"CF18201","AUXILIAR DE SEGURIDAD","C",27,"N02","P",5868.4,null,1,0,5868.4]
[null,2,21,"020","PERSONAL TECNICO",1,83101,4,"CF18203","SUPERVISOR DE MANTENIMIENTO","C",27,"N09","P",8210.94,null,1,0,8210.94]
[null,2,21,"020","PERSONAL TECNICO",1,83101,4,"CF34201","TECNICO BIBLIOTECARIO","C",27,"N06","P",7343.6,null,1,0,7343.6]
[null,2,21,"020","PERSONAL TECNICO",1,83101,4,"CF34202","PROMOTOR CULTURAL Y DEPORTIVO","C",27,"N05","P",7059.84,null,3,0,7059.84]
[null,2,21,"020","PERSONAL TECNICO",1,83101,4,"CF19201","TUTOR ESCOLAR","C",27,"N06","P",7343.6,null,1,0,7343.6]
[null,2,21,"020","PERSONAL TECNICO",1,83101,4,"T08201","AUXILIAR DE SERVICIOS GENERALES","C",27,"N08","P",7918.44,null,1,0,7918.44]
[null,2,21,"020","PERSONAL TECNICO",1,83101,5,"CF02103","DIRECTOR DE PLANTEL \"B\" Y \"C\"","A",27,"NB2","P",5753.58,null,1,0,5753.58]
[null,2,21,"020","PERSONAL TECNICO",1,83101,5,"CF02105","COORDINADOR EJECUTIVO II","A",27,"N14","P",5165.88,null,1,0,5165.88]
[null,2,21,"020","PERSONAL TECNICO",1,83101,4,"CF33206","JEFE DE PROYECTO","A",27,"N15","P",100013.2,null,4,0,100013.2]
[null,2,21,"020","PERSONAL TECNICO",1,83101,4,"CF33206","JEFE DE PROYECTO","A",27,"N15","P",24651.06,null,1,0,24651.06]
[null,2,21,"020","PERSONAL TECNICO",1,83101,4,"CF33206","JEFE DE PROYECTO","A",27,"N15","P",24471.9,null,1,0,24471.9]
[null,2,21,"020","PERSONAL TECNICO",1,83101,4,"CF33204","SUBJEFE TECNICO ESPECIALISTA","A",27,"N13","P",124425.42,null,7,0,124425.42]
[null,2,21,"020","PERSONAL TECNICO",1,83101,4,"CF33204","SUBJEFE TECNICO ESPECIALISTA","A",27,"N13","P",27220,null,2,0,27220]
[null,2,21,"020","PERSONAL TECNICO",1,83101,4,"CF18203","SUPERVISOR DE MANTENIMIENTO","A",27,"N09","P",30151.98,null,3,0,30151.98]
[null,2,21,"020","PERSONAL TECNICO",1,83101,4,"CF04201","SECRETARIA \"B\"","A",27,"N07","P",9340.1,null,1,0,9340.1]
[null,2,21,"020","PERSONAL TECNICO",1,83101,4,"CF19201","TUTOR ESCOLAR","A",27,"N06","P",8989.2999999999993,null,1,0,8989.2999999999993]
[null,2,21,"020","PERSONAL TECNICO",1,83101,4,"CF19201","TUTOR ESCOLAR","A",27,"N06","P",8025.66,null,1,0,8025.66]
[null,2,21,"020","PERSONAL TECNICO",1,83101,4,"CF34202","PROMOTOR CULTURAL Y DEPORTIVO","A",27,"N05","P",8769.9599999999991,null,1,0,8769.9599999999991]
[null,2,21,"020","PERSONAL TECNICO",1,83101,4,"A03202","SECRETARIA \"C\"","A",27,"N05","P",8769.9599999999991,null,1,0,8769.9599999999991]
[null,2,21,"020","PERSONAL TECNICO",1,83101,4,"S01202","AUXILIAR DE SERVICIOS GENERALES","A",27,"N04","P",49785,null,6,0,49785]
[null,2,21,"020","PERSONAL TECNICO",1,83101,4,"CF34201","TECNICO BIBLIOTECARIO","A",27,"N06","P",8989.2999999999993,null,1,0,8989.2999999999993]
[null,2,21,"020","PERSONAL TECNICO",1,83101,4,"S01201","ASISTENTE DE SERVICIOS BASICOS","A",27,"N02","P",22843.5,null,3,0,22843.5]
[null,2,21,"020","PERSONAL TECNICO",1,83101,4,"S01201","ASISTENTE DE SERVICIOS BASICOS","A",27,"N02","P",13597,null,2,0,13597]
[null,2,21,"020","PERSONAL TECNICO",1,83101,4,"ED01201","ADMINISTRATIVO TECNICO ESPECIALISTA","A",27,"N06","P",17978.599999999999,null,2,0,17978.599999999999]
[null,2,21,"020","PERSONAL TECNICO",1,83101,4,"CF18201","AUXILIAR DE SEGURIDAD","A",27,"N02","P",13597,null,2,0,13597]
[null,2,21,"020","PERSONAL TECNICO",1,83101,5,"CF02103","DIRECTOR DE PLANTEL \"B\" Y \"C\"","C",27,"NB1","P",5753.58,null,1,0,5753.58]
[null,2,21,"020","PERSONAL TECNICO",1,83101,5,"CF02105","COORDINADOR EJECUTIVO II","C",27,"OB2","P",5165.8900000000003,null,1,0,5165.8900000000003]
[null,2,21,"020","PERSONAL TECNICO",1,83101,4,"CF33206","JEFE DE PROYECTO","C",27,"N15","P",67172.22,null,3,0,67172.22]
[null,2,21,"020","PERSONAL TECNICO",1,83101,4,"CF33206","JEFE DE PROYECTO","C",27,"N15","P",21123.759999999998,null,1,0,21123.759999999998]
[null,2,21,"020","PERSONAL TECNICO",1,83101,4,"CF33206","JEFE DE PROYECTO","C",27,"N15","P",41215.519999999997,null,2,0,41215.519999999997]
[null,2,21,"020","PERSONAL TECNICO",1,83101,4,"CF33204","SUBJEFE TECNICO ESPECIALISTA","C",27,"N13","P",29043.4,null,2,0,29043.4]
[null,2,21,"020","PERSONAL TECNICO",1,83101,4,"CF33204","SUBJEFE TECNICO ESPECIALISTA","C",27,"N13","P",13699.5,null,1,0,13699.5]
[null,2,21,"020","PERSONAL TECNICO",1,83101,4,"CF33204","SUBJEFE TECNICO ESPECIALISTA","C",27,"N13","P",12965.46,null,1,0,12965.46]
[null,2,21,"020","PERSONAL TECNICO",1,83101,4,"CF33203","TECNICO FINANCIERO","C",27,"N09","P",8463.84,null,1,0,8463.84]
[null,2,21,"020","PERSONAL TECNICO",1,83101,4,"CF04201","SECRETARIA \"B\"","C",27,"N07","P",15730.92,null,2,0,15730.92]
[null,2,21,"020","PERSONAL TECNICO",1,83101,4,"CF21202","ASISTENTE ESCOLAR Y SOCIAL","C",27,"N07","P",7865.46,null,1,0,7865.46]
[null,2,21,"020","PERSONAL TECNICO",1,83101,4,"CF19201","TUTOR ESCOLAR","C",27,"N06","P",7569.8,null,1,0,7569.8]
[null,2,21,"020","PERSONAL TECNICO",1,83101,4,"A03202","SECRETARIA \"C\"","C",27,"N05","P",6865.44,null,1,0,6865.44]
[null,2,21,"020","PERSONAL TECNICO",1,83101,4,"A03202","SECRETARIA \"C\"","C",27,"N05","P",12995.8,null,2,0,12995.8]
[null,2,21,"020","PERSONAL TECNICO",1,83101,4,"CF34202","PROMOTOR CULTURAL Y DEPORTIVO","C",27,"N05","P",7277.3,null,1,0,7277.3]
[null,2,21,"020","PERSONAL TECNICO",1,83101,4,"S01202","AUXILIAR DE SERVICIOS GENERALES","C",27,"N04","P",13974.8,null,2,0,13974.8]
[null,2,21,"020","PERSONAL TECNICO",1,83101,4,"CF34201","TECNICO BIBLIOTECARIO","C",27,"N06","P",7569.8,null,1,0,7569.8]
[null,2,21,"020","PERSONAL TECNICO",1,83101,4,"S01201","ASISTENTE DE SERVICIOS BASICOS","C",27,"N02","P",25648,null,4,0,25648]
[null,2,21,"020","PERSONAL TECNICO",1,83101,4,"S01201","ASISTENTE DE SERVICIOS BASICOS","C",27,"N02","P",6049.14,null,1,0,6049.14]
[null,2,21,"020","PERSONAL TECNICO",1,83101,4,"S01201","ASISTENTE DE SERVICIOS BASICOS","C",27,"N02","P",11449.4,null,2,0,11449.4]
[null,2,21,"020","PERSONAL TECNICO",1,83101,4,"CF18201","AUXILIAR DE SEGURIDAD","C",27,"N02","P",12824,null,2,0,12824]
[null,2,21,"020","PERSONAL TECNICO",1,83101,5,"CF02103","DIRECTOR DE PLANTEL \"B\" Y \"C\"","A",27,"NB2","P",5753.58,null,1,0,5753.58]
[null,2,21,"020","PERSONAL TECNICO",1,83101,5,"CF02105","COORDINADOR EJECUTIVO II","A",27,"OB2","P",5165.88,null,1,0,5165.88]
[null,2,21,"020","PERSONAL TECNICO",1,83101,4,"CF33206","JEFE DE PROYECTO","A",27,"N15","P",50006.6,null,2,0,50006.6]
[null,2,21,"020","PERSONAL TECNICO",1,83101,4,"CF33206","JEFE DE PROYECTO","A",27,"N15","P",97887.6,null,4,0,97887.6]
[null,2,21,"020","PERSONAL TECNICO",1,83101,4,"CF33204","SUBJEFE TECNICO ESPECIALISTA","A",27,"N13","P",71100.240000000005,null,4,0,71100.240000000005]
[null,2,21,"020","PERSONAL TECNICO",1,83101,4,"CF33204","SUBJEFE TECNICO ESPECIALISTA","A",27,"N13","P",16768.8,null,1,0,16768.8]
[null,2,21,"020","PERSONAL TECNICO",1,83101,4,"CF33203","TECNICO FINANCIERO","A",27,"N09","P",10050.66,null,1,0,10050.66]
[null,2,21,"020","PERSONAL TECNICO",1,83101,4,"CF18203","SUPERVISOR DE MANTENIMIENTO","A",27,"N09","P",20101.32,null,2,0,20101.32]
[null,2,21,"020","PERSONAL TECNICO",1,83101,4,"CF04201","SECRETARIA \"B\"","A",27,"N07","P",9340.1,null,1,0,9340.1]
[null,2,21,"020","PERSONAL TECNICO",1,83101,4,"CF19201","TUTOR ESCOLAR","A",27,"N06","P",8989.2999999999993,null,1,0,8989.2999999999993]
[null,2,21,"020","PERSONAL TECNICO",1,83101,4,"S01202","AUXILIAR DE SERVICIOS GENERALES","A",27,"N04","P",16595,null,2,0,16595]
[null,2,21,"020","PERSONAL TECNICO",1,83101,4,"S01202","AUXILIAR DE SERVICIOS GENERALES","A",27,"N04","P",7408,null,1,0,7408]
[null,2,21,"020","PERSONAL TECNICO",1,83101,4,"CF34202","PROMOTOR CULTURAL Y DEPORTIVO","A",27,"N05","P",8769.9599999999991,null,1,0,8769.9599999999991]
[null,2,21,"020","PERSONAL TECNICO",1,83101,4,"A03202","SECRETARIA \"C\"","A",27,"N05","P",35079.839999999997,null,4,0,35079.839999999997]
[null,2,21,"020","PERSONAL TECNICO",1,83101,4,"S01201","ASISTENTE DE SERVICIOS BASICOS","A",27,"N02","P",13597,null,2,0,13597]
[null,2,21,"020","PERSONAL TECNICO",1,83101,5,"CF02103","DIRECTOR DE PLANTEL \"B\" Y \"C\"","C",27,"NB1","P",5753.58,null,1,0,5753.58]
[null,2,21,"020","PERSONAL TECNICO",1,83101,5,"CF02105","COORDINADOR EJECUTIVO II","C",27,"OB2","P",5165.8900000000003,null,1,0,5165.8900000000003]
[null,2,21,"020","PERSONAL TECNICO",1,83101,4,"CF33206","JEFE DE PROYECTO","C",27,"N15","P",92321.600000000006,null,4,0,92321.600000000006]
[null,2,21,"020","PERSONAL TECNICO",1,83101,4,"CF33206","JEFE DE PROYECTO","C",27,"N15","P",41215.519999999997,null,2,0,41215.519999999997]
[null,2,21,"020","PERSONAL TECNICO",1,83101,4,"CF33203","TECNICO FINANCIERO","C",27,"N09","P",8463.84,null,1,0,8463.84]
[null,2,21,"020","PERSONAL TECNICO",1,83101,4,"CF04201","SECRETARIA \"B\"","C",27,"N07","P",7865.46,null,1,0,7865.46]
[null,2,21,"020","PERSONAL TECNICO",1,83101,4,"S01202","AUXILIAR DE SERVICIOS GENERALES","C",27,"N04","P",6987.4,null,1,0,6987.4]
[null,2,21,"020","PERSONAL TECNICO",1,83101,4,"CF18203","SUPERVISOR DE MANTENIMIENTO","C",27,"N09","P",16927.68,null,2,0,16927.68]
[null,2,21,"020","PERSONAL TECNICO",1,83101,4,"CF19201","TUTOR ESCOLAR","C",27,"N06","P",7569.8,null,1,0,7569.8]
[null,2,21,"020","PERSONAL TECNICO",1,83101,4,"CF34201","TECNICO BIBLIOTECARIO","C",27,"N06","P",6758.4,null,1,0,6758.4]
[null,2,21,"020","PERSONAL TECNICO",1,83101,4,"A03202","SECRETARIA \"C\"","C",27,"N05","P",14554.6,null,2,0,14554.6]
[null,2,21,"020","PERSONAL TECNICO",1,83101,4,"S01201","ASISTENTE DE SERVICIOS BASICOS","C",27,"N02","P",5724.7,null,1,0,5724.7]
[null,2,21,"020","PERSONAL TECNICO",1,83101,4,"CF18201","AUXILIAR DE SEGURIDAD","C",27,"N02","P",6412,null,1,0,6412]
[null,2,21,"020","PERSONAL TECNICO",1,83101,4,"CF18201","AUXILIAR DE SEGURIDAD","C",27,"N02","P",5724.7,null,1,0,5724.7]
[null,2,21,"020","PERSONAL TECNICO",1,83101,4,"A03202","SECRETARIA \"C\"","C",27,"N05","P",14554.6,null,2,0,14554.6]
[null,2,21,"020","PERSONAL TECNICO",1,83101,4,"CF33206","JEFE DE PROYECTO","C",27,"N15","P",92321.600000000006,null,4,0,92321.600000000006]
[null,2,21,"020","PERSONAL TECNICO",1,83101,4,"CF33203","TECNICO FINANCIERO","C",27,"N09","P",8463.84,null,1,0,8463.84]
[null,2,21,"020","PERSONAL TECNICO",1,83101,4,"S01201","ASISTENTE DE SERVICIOS BASICOS","C",27,"N02","P",11449.4,null,2,0,11449.4]
[null,2,21,"020","PERSONAL TECNICO",1,83101,4,"CF02104","DIRECTOR DE PLANTEL \"D\" Y \"E\"","C",27,"NA2","P",5165.88,null,1,0,5165.88]
[null,2,21,"020","PERSONAL TECNICO",1,83101,4,"CF33204","SUBJEFE TECNICO ESPECIALISTA","C",27,"N13","P",14968.96,null,1,0,14968.96]
[null,2,21,"020","PERSONAL TECNICO",1,83101,4,"CF18203","SUPERVISOR DE MANTENIMIENTO","C",27,"N09","P",16927.68,null,2,0,16927.68]
[null,2,21,"020","PERSONAL TECNICO",1,83101,4,"CF18201","AUXILIAR DE SEGURIDAD","C",27,"N02","P",6412,null,1,0,6412]
[null,2,21,"020","PERSONAL TECNICO",1,83101,4,"CF04201","SECRETARIA \"B\"","C",27,"N07","P",7865.46,null,1,0,7865.46]
[null,2,21,"020","PERSONAL TECNICO",1,83101,4,"T08201","AUXILIAR DE SERVICIOS GENERALES","C",27,"N08","P",8162.34,null,1,0,8162.34]
[null,2,21,"020","PERSONAL TECNICO",1,83101,4,"S01202","AUXILIAR DE SERVICIOS GENERALES","C",27,"N04","P",6987.4,null,1,0,6987.4]
[null,2,21,"020","PERSONAL TECNICO",1,83101,4,"CF19201","TUTOR ESCOLAR","C",27,"N06","P",6758.4,null,1,0,6758.4]
[null,2,21,"020","PERSONAL TECNICO",1,83101,4,"CF21202","ASISTENTE ESCOLAR Y SOCIAL","C",27,"N07","P",7865.46,null,1,0,7865.46]
[null,2,21,"020","PERSONAL TECNICO",1,83101,5,"CF02103","DIRECTOR DE PLANTEL \"B\" Y \"C\"","C",27,"NB1","P",17260.740000000002,null,1,0,17260.740000000002]
[null,2,21,"020","PERSONAL TECNICO",1,83101,4,"CF33206","JEFE DE PROYECTO","C",27,"N15","P",207723.6,null,3,0,207723.6]
[null,2,21,"020","PERSONAL TECNICO",1,83101,4,"CF33206","JEFE DE PROYECTO","C",27,"N15","P",185469.84,null,3,0,185469.84]
[null,2,21,"020","PERSONAL TECNICO",1,83101,4,"CF33204","SUBJEFE TECNICO ESPECIALISTA","C",27,"N13","P",40094.400000000001,null,1,0,40094.400000000001]
[null,2,21,"020","PERSONAL TECNICO",1,83101,4,"CF33204","SUBJEFE TECNICO ESPECIALISTA","C",27,"N13","P",14521.7,null,7,0,14521.7]
[null,2,21,"020","PERSONAL TECNICO",1,83101,4,"CF18203","SUPERVISOR DE MANTENIMIENTO","C",27,"N09","P",50783.040000000001,null,2,0,50783.040000000001]
[null,2,21,"020","PERSONAL TECNICO",1,83101,4,"CF19201","TUTOR ESCOLAR","C",27,"N06","P",22709.4,null,1,0,22709.4]
[null,2,21,"020","PERSONAL TECNICO",1,83101,4,"CF04201","SECRETARIA \"B\"","C",27,"N07","P",23596.38,null,1,0,23596.38]
[null,2,21,"020","PERSONAL TECNICO",1,83101,4,"A03202","SECRETARIA \"C\"","C",27,"N05","P",87327.6,null,4,0,87327.6]
[null,2,21,"020","PERSONAL TECNICO",1,83101,4,"S01202","AUXILIAR DE SERVICIOS GENERALES","C",27,"N03","P",18716.580000000002,null,1,0,18716.580000000002]
[null,2,21,"020","PERSONAL TECNICO",1,83101,4,"S01202","AUXILIAR DE SERVICIOS GENERALES","C",27,"N03","P",83848.800000000003,null,4,0,83848.800000000003]
[null,2,21,"020","PERSONAL TECNICO",1,83101,4,"S01201","ASISTENTE DE SERVICIOS BASICOS","C",27,"N02","P",68696.399999999994,null,4,0,68696.399999999994]
[null,2,21,"020","PERSONAL TECNICO",1,83101,4,"CF18201","AUXILIAR DE SEGURIDAD","C",27,"N02","P",17174.099999999999,null,1,0,17174.099999999999]
[null,2,21,"020","PERSONAL TECNICO",1,83101,4,"CF18201","AUXILIAR DE SEGURIDAD","C",27,"N02","P",19236,null,1,0,19236]
[null,2,21,"020","PERSONAL TECNICO",1,83101,5,"CF02100","SUBCOORDINADOR","C",27,"OC2","P",15497.67,null,3,0,15497.67]
[null,2,21,"020","PERSONAL TECNICO",1,83101,4,"CF33206","JEFE DE PROYECTO","C",27,"N15","P",115402,null,5,0,115402]
[null,2,21,"020","PERSONAL TECNICO",1,83101,4,"CF33206","JEFE DE PROYECTO","C",27,"N15","P",20607.75,null,1,0,20607.75]
[null,2,21,"020","PERSONAL TECNICO",1,83101,4,"CF34201","TECNICO BIBLIOTECARIO","C",27,"N06","P",7569.8,null,1,0,7569.8]
[null,2,21,"020","PERSONAL TECNICO",1,83101,4,"CF33204","SUBJEFE TECNICO ESPECIALISTA","C",27,"N13","P",44906.85,null,3,0,44906.85]
[null,2,21,"020","PERSONAL TECNICO",1,83101,5,"CF11100","DIRECTOR GENERAL ESTATAL","C",27,"MC2","P",11552.21,null,1,0,11552.21]
[null,2,21,"020","PERSONAL TECNICO",1,83101,4,"CF34205","ADMINISTRATIVO TECNICO ESPECIALISTA","C",27,"N11","P",9075.4,null,1,0,9075.4]
[null,2,21,"020","PERSONAL TECNICO",1,83101,4,"S01201","ASISTENTE DE SERVICIOS BASICOS","C",27,"N02","P",6049.15,null,1,0,6049.15]
[null,2,21,"020","PERSONAL TECNICO",1,83101,4,"ED01201","ADMINISTRATIVO TECNICO ESPECIALISTA","C",27,"N06","P",6758.4,null,1,0,6758.4]
[null,2,21,"020","PERSONAL TECNICO",1,83101,4,"T08201","AUXILIAR DE SERVICIOS GENERALES","C",27,"N08","P",7700.45,null,1,0,7700.45]
[null,2,21,"020","PERSONAL TECNICO",1,83101,2,"L5XC","DOCENTE","C",27,0,"H",null,1944954.75,0,4115,1944954.75]
[null,2,21,"020","PERSONAL TECNICO",1,83101,2,"L5XCBII","DOCENTE","C",27,0,"H",null,465658.35,0,1137,465658.35]
[null,2,21,"020","PERSONAL TECNICO",1,83101,2,"L5XCBI","DOCENTE","C",27,0,"H",null,319578,0,877,319578]
[null,2,21,"020","PERSONAL TECNICO",1,83101,2,"L5XATEC","DOCENTE","C",27,0,"H",null,25718.400000000001,0,96,25718.400000000001]
[null,2,21,"020","PERSONAL TECNICO",1,83101,2,"L5XC","DOCENTE","A",27,0,"H",null,631783.75,0,1105,631783.75]
[null,2,21,"020","PERSONAL TECNICO",1,83101,2,"L5XCBII","DOCENTE","A",27,0,"H",null,396069.15,0,797,396069.15]
[null,2,21,"020","PERSONAL TECNICO",1,83101,2,"L5XCBI","DOCENTE","A",27,0,"H",null,212814.8,0,484,212814.8]
[null,2,21,"020","PERSONAL TECNICO",1,83101,2,"L5XATEC","DOCENTE","A",27,0,"H",null,19578,0,60,19578]
[null,2,21,"020","PERSONAL TECNICO",1,83101,5,"CF11102","DIRECTOR DEL CENTRO","A",27,"NB2","P",5753.58,null,1,0,5753.58]
[null,2,21,"020","PERSONAL TECNICO",1,83101,5,"CF01601","JEFE DE UNIDAD","A",27,"OC1","P",20663.52,null,4,0,20663.52]
[null,2,21,"020","PERSONAL TECNICO",1,83101,4,"CF33204","SUBJEFE TECNICO ESPECIALISTA","A",27,"N13","P",53325.18,null,3,0,53325.18]
[null,2,21,"020","PERSONAL TECNICO",1,83101,4,"CF33204","SUBJEFE TECNICO ESPECIALISTA","A",27,"N13","P",35550.120000000003,null,2,0,35550.120000000003]
[null,null,null,null,null,null,null,null,null,null,null,null,null,"Total Jornada:",{"$f":"SUBTOTAL(109,Tabla15[Monto mensual\npor plaza jornada])","v":3085760.8200000003},null,"Total Autorizado:",null,{"$f":"SUBTOTAL(109,Tabla15[Monto total autorizado])","v":7101916.0199999996}]
[null,null,null,null,null,null,null,null,null,null,null,null,null,"Total HSM",null,{"$f":"SUM(P17:P157)","v":4016155.1999999997}]
[]
[null,"Fuente : Información proporcionada por las Entidades Federativas"]
[]
[]
[null,null,null,null,null,null,null,null," "]

{"sheet":"II D) 7 2 ","index":12,"n_rows":167,"n_cols":18,"rows_kept":167,"cut":false,"hidden":false,"merged":[[14,8,15,8],[14,9,14,13],[14,14,14,16],[10,16,10,17],[11,1,11,9],[14,1,15,1],[14,2,15,2],[14,3,15,3],[14,17,15,17],[14,6,15,6],[14,7,15,7],[14,4,15,4],[14,5,15,5],[11,16,11,17]]}
[]
[]
[]
[]
[]
[]
[]
[]
[]
[]
[null,"Formato: Catálogo de Categorías y Tabuladores",null,null,null,null,null,null,null,null,null,null,null,null,null,"Entidad Federativa:",{"$f":"IF('1'!D21=\"Elige el Periodo…\",\"\",'1'!D21)","v":"CHIHUAHUA "}]
[null,{"$f":"IF('1'!D22=\"Elige el Periodo…\",\"\",'1'!D22)","v":"Fondo de Aportaciones para la Educación Tecnológica y de Adultos/Colegio Nacional de Educación Profesional Técnica (FAETA/CONALEP)"},null,null,null,null,null,null,null,null,null,null,null,null,null,null,"4to. Trimestre 2017"]
[]
[]
[null,"Identificador origen presupuestal de la plaza","Clave de categoría","Descripción de la categoría","Tipo de contratación","Tipo de categoría","Clave de concepto de pago","Clave de nivel de puesto","Clave de nivel de sueldo","Sueldo asignado por zona económica",null,null,null,null,"Datos adicionales de horas",null,null,"Fecha de actualización"]
[null,null,null,null,null,null,null,null,null,"Inicio de vigencia del sueldo","Fin de vigencia del sueldo","Monto Mensual Jornada ó de HSM\nZona A","Monto Mensual Jornada ó de HSM\nZona B","Monto Mensual Jornada ó de HSM\nZona C","Horas \nde compatibilidad","Horas de servicio (HSM)","Horas de docencia"]
[]
[null,"Identificador origen presupuestal de la plaza","Clave de categoría","Descripción de la categoría","Tipo de contratación","Tipo de categoría","Clave de concepto de pago","Clave de nivel de puesto","Clave de nivel de sueldo","Inicio de vigencia del sueldo","Fin de vigencia del sueldo","Monto Mensual Jornada ó de HSM\nZona A","Monto Mensual Jornada ó de HSM\nZona B","Monto Mensual Jornada ó de HSM\nZona C","Horas \nde compatibilidad","Horas de servicio (HSM)","Horas de docencia","Fecha de actualización"]
[null,1,"CF02103","DIRECTOR DE PLANTEL \"B\" Y \"C\"","P",5,1003,27,"NB1",199918,999999,0,0,5753.58,"00.0","40.0","00.0","20170201"]
[null,1,"CF02105","COORDINADOR EJECUTIVO II","P",5,1003,27,"OB2",199918,999999,0,0,5165.88,"00.0","40.0","00.0","20170201"]
[null,1,"CF33206","JEFE DE PROYECTO","P",2,1003,27,"N15",199918,999999,0,0,19992,"00.0","40.0","00.0","20170201"]
[null,1,"CF33206","JEFE DE PROYECTO","P",2,1003,27,"N15",199918,999999,0,0,22390.74,"00.0","40.0","00.0","20170201"]
[null,1,"CF33204","SUBJEFE TECNICO ESPECIALISTA","P",2,1003,27,"N13",199918,999999,0,0,12965.46,"00.0","40.0","00.0","20170201"]
[null,1,"CF33204","SUBJEFE TECNICO ESPECIALISTA","P",2,1003,27,"N13",199918,999999,0,0,13699.5,"00.0","40.0","00.0","20170201"]
[null,1,"CF33204","SUBJEFE TECNICO ESPECIALISTA","P",2,1003,27,"N13",199918,999999,0,0,14521.7,"00.0","40.0","00.0","20170201"]
[null,1,"CF33202","TECNICO EN CONTABILIDAD","P",2,1003,27,"N09",199918,999999,0,0,8210.94,"00.0","40.0","00.0","20170201"]
[null,1,"CF04201","SECRETARIA \"B\"","P",2,1003,27,"N07",199918,999999,0,0,7630.44,"00.0","40.0","00.0","20170201"]
[null,1,"A03202","SECRETARIA \"C\"","P",2,1003,27,"N05",199918,999999,0,0,7059.84,"00.0","40.0","00.0","20170201"]
[null,1,"S01201","ASISTENTE DE SERVICIOS BASICOS","P",2,1003,27,"N02",199918,999999,0,0,5553.66,"00.0","40.0","00.0","20170201"]
[null,1,"S01201","ASISTENTE DE SERVICIOS BASICOS","P",2,1003,27,"N02",199918,999999,0,0,6220.4,"00.0","40.0","00.0","20170201"]
[null,1,"S01202","AUXILIAR DE SERVICIOS GENERALES","P",2,1003,27,"N04",199918,999999,0,0,6394.9,"00.0","40.0","00.0","20170201"]
[null,1,"S01202","AUXILIAR DE SERVICIOS GENERALES","P",2,1003,27,"N04",199918,999999,0,0,6778.6,"00.0","40.0","00.0","20170201"]
[null,1,"CF18201","AUXILIAR DE SEGURIDAD","P",2,1003,27,"N02",199918,999999,0,0,5553.66,"00.0","40.0","00.0","20170201"]
[null,1,"CF18201","AUXILIAR DE SEGURIDAD","P",2,1003,27,"N02",199918,999999,0,0,5868.4,"00.0","40.0","00.0","20170201"]
[null,1,"CF34201","TECNICO BIBLIOTECARIO","P",2,1003,27,"N06",199918,999999,0,0,7343.6,"00.0","40.0","00.0","20170201"]
[null,1,"CF34202","PROMOTOR CULTURAL Y DEPORTIVO","P",2,1003,27,"N05",199918,999999,0,0,7059.84,"00.0","40.0","00.0","20170201"]
[null,1,"CF19201","TUTOR ESCOLAR","P",2,1003,27,"N06",199918,999999,0,0,7343.6,"00.0","40.0","00.0","20170201"]
[null,1,"CF18203","SUPERVISOR DE MANTENIMIENTO","P",2,1003,27,"N09",199918,999999,0,0,8210.94,"00.0","40.0","00.0","20170201"]
[null,1,"CF21202","ASISTENTE ESCOLAR Y SOCIAL","P",2,1003,27,"N07",199918,999999,0,0,7630.54,"00.0","40.0","00.0","20170201"]
[null,1,"T08201","TECNICO EN GRAFICACION","P",2,1003,27,"N08",199918,999999,0,0,7918.44,"00.0","40.0","00.0","20170201"]
[null,1,"CF02103","DIRECTOR DE PLANTEL \"B\" Y \"C\"","P",5,1003,27,"NB2",199918,999999,5753.58,0,0,"00.0","40.0","00.0","20170201"]
[null,1,"CF02105","COORDINADOR EJECUTIVO II","P",5,1003,27,"N14",199918,999999,5165.88,0,0,"00.0","40.0","00.0","20170201"]
[null,1,"CF33206","JEFE DE PROYECTO ","P",2,1003,27,"N15",199918,999999,25003.3,0,0,"00.0","40.0","00.0","20170201"]
[null,1,"CF33206","JEFE DE PROYECTO ","P",2,1003,27,"N15",199918,999999,24651.06,0,0,"00.0","40.0","00.0","20170201"]
[null,1,"CF33206","JEFE DE PROYECTO ","P",2,1003,27,"N15",199918,999999,24471.9,0,0,"00.0","40.0","00.0","20170201"]
[null,1,"CF33204","SUBJEFE TECNICO ESPECIALISTA","P",2,1003,27,"N13",199918,999999,17775.060000000001,0,0,"00.0","40.0","00.0","20170201"]
[null,1,"CF33204","SUBJEFE TECNICO ESPECIALISTA","P",2,1003,27,"N13",199918,999999,13610,0,0,"00.0","40.0","00.0","20170201"]
[null,1,"CF18203","SUPERVISOR DE MANTENIMIENTO","P",2,1003,27,"N09",199918,999999,10050.66,0,0,"00.0","40.0","00.0","20170201"]
[null,1,"CF04201","SECRETARIA \"B\"","P",2,1003,27,"N07",199918,999999,9340.1,0,0,"00.0","40.0","00.0","20170201"]
[null,1,"CF19201","TUTOR ESCOLAR","P",1,1003,27,"N06",199918,999999,8989.2999999999993,0,0,"00.0","40.0","00.0","20170201"]
[null,1,"CF19201","TUTOR ESCOLAR","P",1,1003,27,"N06",199918,999999,8025.66,0,0,"00.0","40.0","00.0","20170201"]
[null,1,"CF34202","PROMOTOR CULTURAL Y DEPORTIVO","P",2,1003,27,"N05",199918,999999,8769.9599999999991,0,0,"00.0","40.0","00.0","20170201"]
[null,1,"A03202","SECRETARIA C","P",2,1003,27,"N05",199918,999999,8769.9599999999991,0,0,"00.0","40.0","00.0","20170201"]
[null,1,"S01202","AUXILIAR DE SERVICIOS GENERALES","P",2,1003,27,"N04",199918,999999,8297.5,0,0,"00.0","40.0","00.0","20170201"]
[null,1,"CF34201","TECNICO BIBLIOTECARIO","P",2,1003,27,"N06",199918,999999,8989.2999999999993,0,0,"00.0","40.0","00.0","20170201"]
[null,1,"S01201","ASISTENTE DE SERVICIOS BASICOS","P",2,1003,27,"N02",199918,999999,7614.5,0,0,"00.0","40.0","00.0","20170201"]
[null,1,"S01201","ASISTENTE DE SERVICIOS BASICOS","P",2,1003,27,"N02",199918,999999,6798.5,0,0,"00.0","40.0","00.0","20170201"]
[null,1,"ED01201","TECNICO EN MATERIALES DIDACTICOS","P",2,1003,27,"N06",199918,999999,8989.2999999999993,0,0,"00.0","40.0","00.0","20170201"]
[null,1,"CF18201","AUXILIAR DE SEGURIDAD","P",2,1003,27,"N02",199918,999999,6798.5,0,0,"00.0","40.0","00.0","20170201"]
[null,1,"CF02103","DIRECTOR DE PLANTEL \"B\" Y \"C\"","P",5,1003,27,"NB1",199918,999999,0,0,5753.58,"00.0","40.0","00.0","20170201"]
[null,1,"CF02105","COORDINADOR EJECUTIVO II","P",5,1003,27,"OB2",199918,999999,0,0,5165.8900000000003,"00.0","40.0","00.0","20170201"]
[null,1,"CF33206","JEFE DE PROYECTO","P",2,1003,27,"N15",199918,999999,0,0,22390.74,"00.0","40.0","00.0","20170201"]
[null,1,"CF33206","JEFE DE PROYECTO","P",2,1003,27,"N15",199918,999999,0,0,21123.759999999998,"00.0","40.0","00.0","20170201"]
[null,1,"CF33206","JEFE DE PROYECTO","P",2,1003,27,"N15",199918,999999,0,0,20607.759999999998,"00.0","40.0","00.0","20170201"]
[null,1,"CF33204","SUBJEFE TECNICO ESPECIALISTA","P",2,1003,27,"N13",199918,999999,0,0,14521.7,"00.0","40.0","00.0","20170201"]
[null,1,"CF33204","SUBJEFE TECNICO ESPECIALISTA","P",2,1003,27,"N13",199918,999999,0,0,13699.5,"00.0","40.0","00.0","20170201"]
[null,1,"CF33204","SUBJEFE TECNICO ESPECIALISTA","P",2,1003,27,"N13",199918,999999,0,0,12965.46,"00.0","40.0","00.0","20170201"]
[null,1,"CF33203","TECNICO FINANCIERO","P",2,1003,27,"N09",199918,999999,0,0,8463.84,"00.0","40.0","00.0","20170201"]
[null,1,"CF34202","PROMOTOR CULTURAL Y DEPORTIVO","P",2,1003,27,"N05",199918,999999,0,0,7277.3,"00.0","40.0","00.0","20170201"]
[null,1,"CF21202","ASISTENTE ESCOLAR Y SOCIAL","P",2,1003,27,"N07",199918,999999,0,0,7865.46,"00.0","40.0","00.0","20170201"]
[null,1,"CF19201","TUTOR ESCOLAR","P",2,1003,27,"N06",199918,999999,0,0,7569.8,"00.0","40.0","00.0","20170201"]
[null,1,"A03202","SECRETARIA \"C\"","P",2,1003,27,"N05",199918,999999,0,0,6865.44,"00.0","40.0","00.0","20170201"]
[null,1,"A03202","SECRETARIA \"C\"","P",2,1003,27,"N05",199918,999999,0,0,6497.9,"00.0","40.0","00.0","20170201"]
[null,1,"CF04201","SECRETARIA \"B\"","P",2,1003,27,"N05",199918,999999,0,0,7865.46,"00.0","40.0","00.0","20170201"]
[null,1,"CF34201","TECNICO BIBLIOTECARIO","P",2,1003,27,"N06",199918,999999,0,0,7569.8,"00.0","40.0","00.0","20170201"]
[null,1,"S01201","ASISTENTE DE SERVICIOS BASICOS","P",2,1003,27,"N02",199918,999999,0,0,6412,"00.0","40.0","00.0","20170201"]
[null,1,"S01201","ASISTENTE DE SERVICIOS BASICOS","P",2,1003,27,"N02",199918,999999,0,0,6049.14,"00.0","40.0","00.0","20170201"]
[null,1,"S01201","ASISTENTE DE SERVICIOS BASICOS","P",2,1003,27,"N02",199918,999999,0,0,5724.7,"00.0","40.0","00.0","20170201"]
[null,1,"S01202","AUXILIAR DE SERVICIOS GENERALES","P",2,1003,27,"N04",199918,999999,0,0,6987.4,"00.0","40.0","00.0","20170201"]
[null,1,"CF18201","AUXILIAR DE SEGURIDAD","P",2,1003,27,"N02",199918,999999,0,0,6412,"00.0","40.0","00.0","20170201"]
[null,1,"S01201","ASISTENTE DE SERVICIOS BASICOS","P",1,1003,27,"N02",199918,999999,6798.5,0,0,"00.0","40.0","00.0","20170201"]
[null,1,"S01201","ASISTENTE DE SERVICIOS BASICOS","P",1,1003,27,"N02",199918,999999,6798.5,0,0,"00.0","40.0","00.0","20170201"]
[null,1,"S01202","AUXILIAR DE SERVICIOS GENERALES","P",2,1003,27,"N04",199918,999999,7408,0,0,"00.0","40.0","00.0","20170201"]
[null,1,"S01202","AUXILIAR DE SERVICIOS GENERALES","P",2,1003,27,"N04",199918,999999,8297.5,0,0,"00.0","40.0","00.0","20170201"]
[null,1,"S01202","AUXILIAR DE SERVICIOS GENERALES","P",2,1003,27,"N04",199918,999999,8297.5,0,0,"00.0","40.0","00.0","20170201"]
[null,1,"CF34202","PROMOTOR CULTURAL Y DEPORTIVO","P",1,1003,27,"N05",199918,999999,8769.9599999999991,0,0,"00.0","40.0","00.0","20170201"]
[null,1,"A03202","SECRETARIA  \"C\"","P",2,1003,27,"N05",199918,999999,8769.9599999999991,0,0,"00.0","40.0","00.0","20170201"]
[null,1,"A03202","SECRETARIA \"C\"","P",2,1003,27,"N05",199918,999999,8769.9599999999991,0,0,"00.0","40.0","00.0","20170201"]
[null,1,"A03202","SECRETARIA \"C\"","P",2,1003,27,"N05",199918,999999,8769.9599999999991,0,0,"00.0","40.0","00.0","20170201"]
[null,1,"A03202","SECRETARIA \"C\"","P",2,1003,27,"N05",199918,999999,8769.9599999999991,0,0,"00.0","40.0","00.0","20170201"]
[null,1,"CF19201","TUTOR ESCOLAR","P",1,1003,27,"N06",199918,999999,8989.2999999999993,0,0,"00.0","40.0","00.0","20170201"]
[null,1,"CF04201","SECRETARIA \"B\"","P",2,1003,27,"N07",199918,999999,9340.1,0,0,"00.0","40.0","00.0","20170201"]
[null,1,"CF18203","SUPERVISOR DE MANTENIMIENTO","P",1,1003,27,"N09",199918,999999,10050.66,0,0,"00.0","40.0","00.0","20170201"]
[null,1,"CF18203","SUPERVISOR DE MANTENIMIENTO","P",1,1003,27,"N09",199918,999999,10050.66,0,0,"00.0","40.0","00.0","20170201"]
[null,1,"CF33203","TECNICO FINANCIERO","P",2,1003,27,"N09",199918,999999,10050.66,0,0,"00.0","40.0","00.0","20170201"]
[null,1,"CF33204","SUBJEFE TECNICO ESPECIALISTA","P",2,1003,27,"N13",199918,999999,17775.060000000001,0,0,"00.0","40.0","00.0","20170201"]
[null,1,"CF33204","SUBJEFE TECNICO ESPECIALISTA","P",2,1003,27,"N13",199918,999999,17775.060000000001,0,0,"00.0","40.0","00.0","20170201"]
[null,1,"CF33204","SUBJEFE TECNICO ESPECIALISTA","P",2,1003,27,"N13",199918,999999,17775.060000000001,0,0,"00.0","40.0","00.0","20170201"]
[null,1,"CF33204","SUBJEFE TECNICO ESPECIALISTA","P",2,1003,27,"N13",199918,999999,17775.060000000001,0,0,"00.0","40.0","00.0","20170201"]
[null,1,"CF33204","SUBJEFE TECNICO ESPECIALISTA","P",2,1003,27,"N13",199918,999999,16768.8,0,0,"00.0","40.0","00.0","20170201"]
[null,1,"CF02105","COORDINADOR EJECUTIVO II","P",5,1003,27,"OB2",199918,999999,5165.88,0,0,"00.0","40.0","00.0","20170201"]
[null,1,"CF33206","JEFE DE PROYECTO","P",2,1003,27,"N15",199918,999999,24471.9,0,0,"00.0","40.0","00.0","20170201"]
[null,1,"CF33206","JEFE DE PROYECTO","P",2,1003,27,"N15",199918,999999,24471.9,0,0,"00.0","40.0","00.0","20170201"]
[null,1,"CF33206","JEFE DE PROYECTO","P",2,1003,27,"N15",199918,999999,25003.3,0,0,"00.0","40.0","00.0","20170201"]
[null,1,"CF33206","JEFE DE PROYECTO","P",2,1003,27,"N15",199918,999999,24471.9,0,0,"00.0","40.0","00.0","20170201"]
[null,1,"CF33206","JEFE DE PROYECTO","P",2,1003,27,"N15",199918,999999,24471.9,0,0,"00.0","40.0","00.0","20170201"]
[null,1,"CF33206","JEFE DE PROYECTO","P",2,1003,27,"N15",199918,999999,25003.3,0,0,"00.0","40.0","00.0","20170201"]
[null,1,"CF02103","DIRECTOR DE PLANTEL \"B\" Y \"C\"","P",5,1003,27,"NB2",199918,999999,5753.58,0,0,"00.0","40.0","00.0","20170201"]
[null,1,"CF02103","DIRECTOR DE PLANTEL \"B\" Y \"C\"","P",5,1003,27,"NB1",199918,999999,0,0,5753.58,"00.0","40.0","00.0","20170201"]
[null,1,"CF02105","COORDINADOR EJECUTIVO II","P",5,1003,27,"OB2",199918,999999,0,0,5165.8900000000003,"00.0","40.0","00.0","20170201"]
[null,1,"CF33206","JEFE DE PROYECTO ","P",2,1003,27,"N15",199918,999999,0,0,23080.400000000001,"00.0","40.0","00.0","20170201"]
[null,1,"CF33206","JEFE DE PROYECTO ","P",2,1003,27,"N15",199918,999999,0,0,20607.759999999998,"00.0","40.0","00.0","20170201"]
[null,1,"CF33203","TECNICO FINANCIERO","P",2,1003,27,"N09",199918,999999,0,0,8463.84,"00.0","40.0","00.0","20170201"]
[null,1,"CF04201","SECRETARIA \"B\"","P",2,1003,27,"N07",199918,999999,0,0,7865.46,"00.0","40.0","00.0","20170201"]
[null,1,"CF19201","TUTOR ESCOLAR","P",2,1003,27,"N04",199918,999999,0,0,7569.8,"00.0","40.0","00.0","20170201"]
[null,1,"A03202","SECRETARIA C","P",2,1003,27,"N09",199918,999999,0,0,7277.3,"00.0","40.0","00.0","20170201"]
[null,1,"S01202","AUXILIAR DE SERVICIOS GENERALES","P",2,1003,27,"N06",199918,999999,0,0,6987.4,"00.0","40.0","00.0","20170201"]
[null,1,"CF34201","TECNICO BIBLIOTECARIO","P",2,1003,27,"N06",199918,999999,0,0,6758.4,"00.0","40.0","00.0","20170201"]
[null,1,"S01201","ASISTENTE DE SERVICIOS BASICOS","P",2,1003,27,"N05",199918,999999,0,0,5724.7,"00.0","40.0","00.0","20170201"]
[null,1,"CF18201","AUXILIAR DE SEGURIDAD","P",2,1003,27,"N02",199918,999999,0,0,5724.7,"00.0","40.0","00.0","20170201"]
[null,1,"CF18201","AUXILIAR DE SEGURIDAD","P",2,1003,27,"N02",199918,999999,0,0,6412,"00.0","40.0","00.0","20170201"]
[null,1,"CF18203","SUPERVISOR DE MANTENIMIENTO","P",2,1003,27,"N02",199918,999999,0,0,8463.84,"00.0","40.0","00.0","20170201"]
[null,1,"A03202","SECRETARIA \"C\"","P",2,1003,27,"N05",199918,999999,0,0,7277.3,"00.0","40.0","00.0","20170201"]
[null,1,"CF33206","JEFE DE PROYECTO","P",2,1003,27,"N15",199918,999999,0,0,23080.400000000001,"00.0","40.0","00.0","20170201"]
[null,1,"CF33203","TECNICO FINANCIERO","P",2,1003,27,"N09",199918,999999,0,0,8463.84,"00.0","40.0","00.0","20170201"]
[null,1,"S01201","ASISTENTE DE SERVICIOS BASICOS","P",2,1003,27,"N02",199918,999999,0,0,5724.7,"00.0","40.0","00.0","20170201"]
[null,1,"CF02104","DIRECTOR DE PLANTEL \"D\" Y \"E\"","P",5,1003,27,"NA2",199918,999999,0,0,5165.88,"00.0","40.0","00.0","20170201"]
[null,1,"CF33204","SUBJEFE TECNICO ESPECIALISTA","P",2,1003,27,"N13",199918,999999,0,0,14968.96,"00.0","40.0","00.0","20170201"]
[null,1,"CF18203","SUPERVISOR DE MANTENIMIENTO","P",2,1003,27,"N09",199918,999999,0,0,8463.84,"00.0","40.0","00.0","20170201"]
[null,1,"CF18201","AUXILIAR DE SEGURIDAD","P",2,1003,27,"N02",199918,999999,0,0,6412,"00.0","40.0","00.0","20170201"]
[null,1,"CF04201","SECRETARIA \"B\"","P",2,1003,27,"N07",199918,999999,0,0,7865.46,"00.0","40.0","00.0","20170201"]
[null,1,"T08201","TECNICO EN GRAFICACION","P",2,1003,27,"N08",199918,999999,0,0,8162.34,"00.0","40.0","00.0","20170201"]
[null,1,"S01202","AUXILIAR DE SERVICIOS GENERALES","P",2,1003,27,"N04",199918,999999,0,0,6987.4,"00.0","40.0","00.0","20170201"]
[null,1,"CF19201","TUTOR ESCOLAR","P",2,1003,27,"N06",199918,999999,0,0,6758.4,"00.0","40.0","00.0","20170201"]
[null,1,"CF21202","ASISTENTE ESCOLAR Y SOCIAL","P",2,1003,27,"N07",199918,999999,0,0,7865.46,"00.0","40.0","00.0","20170201"]
[null,1,"CF02103","DIRECTOR DE PLANTEL \"B\" Y \"C\"","P",5,1003,27,"NB2",199918,999999,0,0,5753.58,"00.0","40.0","00.0","20170201"]
[null,1,"CF33206","JEFE DE PROYECTO","P",2,1003,27,"N15",199918,999999,0,0,20607.759999999998,"00.0","40.0","00.0","20170201"]
[null,1,"CF33206","JEFE DE PROYECTO","P",2,1003,27,"N15",199918,999999,0,0,23080.400000000001,"00.0","40.0","00.0","20170201"]
[null,1,"CF33204","SUBJEFE TECNICO ESPECIALISTA","P",2,1003,27,"N13",199918,999999,0,0,14968.96,"00.0","40.0","00.0","20170201"]
[null,1,"CF33204","SUBJEFE TECNICO ESPECIALISTA","P",2,1003,27,"N13",199918,999999,0,0,13364.8,"00.0","40.0","00.0","20170201"]
[null,1,"CF18203","SUPERVISOR DE MANTENIMIENTO","P",2,1003,27,"N09",199918,999999,0,0,8463.84,"00.0","40.0","00.0","20170201"]
[null,1,"CF19201","TUTOR ESCOLAR","P",2,1003,27,"N06",199918,999999,0,0,7569.8,"00.0","40.0","00.0","20170201"]
[null,1,"CF04201","SECRETARIA \"B\"","P",2,1003,27,"N07",199918,999999,0,0,7865.46,"00.0","40.0","00.0","20170201"]
[null,1,"A03202","SECRETARIA \"C\"","P",2,1003,27,"N05",199918,999999,0,0,7277.3,"00.0","40.0","00.0","20170201"]
[null,1,"S01201","ASISTENTE DE SERVICIOS BASICOS","P",2,1003,27,"N02",199918,999999,0,0,5724.7,"00.0","40.0","00.0","20170201"]
[null,1,"S01202","AUXILIAR DE SERVICIOS GENERALES","P",2,1003,27,"N04",199918,999999,0,0,6238.86,"00.0","40.0","00.0","20170201"]
[null,1,"S01202","AUXILIAR DE SERVICIOS GENERALES","P",2,1003,27,"N04",199918,999999,0,0,6987.4,"00.0","40.0","00.0","20170201"]
[null,1,"CF18201","AUXILIAR DE SEGURIDAD","P",2,1003,27,"N02",199918,999999,0,0,5724.7,"00.0","40.0","00.0","20170201"]
[null,1,"CF18201","AUXILIAR DE SEGURIDAD","P",2,1003,27,"N02",199918,999999,0,0,6412,"00.0","40.0","00.0","20170201"]
[null,1,"CF02100","SUBCOORDINADOR","P",5,1003,27,"OC2",199918,999999,0,0,5165.8900000000003,"00.0","40.0","00.0","20170201"]
[null,1,"CF33206","JEFE DE PROYECTO","P",2,1003,27,"N15",199918,999999,0,0,23080.400000000001,"00.0","40.0","00.0","20170201"]
[null,1,"CF33206","JEFE DE PROYECTO","P",2,1003,27,"N15",199918,999999,0,0,20607.75,"00.0","40.0","00.0","20170201"]
[null,1,"CF34201","TECNICO BIBLIOTECARIO","P",2,1003,27,"N06",199918,999999,0,0,7569.8,"00.0","40.0","00.0","20170201"]
[null,1,"CF33204","SUFJEFE TECNICO ESPECIALISTA","P",2,1003,27,"N13",199918,999999,0,0,14968.95,"00.0","40.0","00.0","20170201"]
[null,1,"CF11100","DIRECTOR GENERAL ESTATAL","P",5,1003,27,"MC2",199918,999999,0,0,11552.21,"00.0","40.0","00.0","20170201"]
[null,1,"S01201","ASISTENTE DE SERVICIOS BASICOS","P",2,1003,27,"N02",199918,999999,0,0,6049.15,"00.0","40.0","00.0","20170201"]
[null,1,"CF34205","ADMINISTRATIVO TECNICO ESPECIALISTA","P",2,1003,27,"N11",199918,999999,0,0,9075.4,"00.0","40.0","00.0","20170201"]
[null,1,"ED01201","TECNICO DE MATERIALES DIDACTICOS","P",2,1003,27,"N06",199918,999999,0,0,6758.4,"00.0","40.0","00.0","20170201"]
[null,1,"T08201","TECNICO EN GRAFICACION","P",2,1003,27,"N08",199918,999999,0,0,8162.35,"00.0","40.0","00.0","20170201"]
[null,1,"CF11102","DIRECTOR DEL CENTRO","P",5,1003,27,"NB2",199918,999999,5753.58,0,0,"00.0","40.0","00.0","20170201"]
[null,1,"CF01601","JEFE DE UNIDAD","P",5,1003,27,"OC1",199918,999999,5165.8900000000003,0,0,"00.0","40.0","00.0","20170201"]
[null,1,"CF33204","SUBJEFE TECNICO ESPECIALISTA","P",2,1003,27,"N13",199918,999999,17775.060000000001,0,0,"00.0","40.0","00.0","20170201"]
[null,null,null,null,null,null,null,null,null,null,"Total Zona A:",{"$f":"SUBTOTAL(109,Tabla16[Monto Mensual Jornada ó de HSM\nZona A])","v":623172.43000000005}]
[null,null,null,null,null,null,null,null,null,null,null,"Total Zona B:",{"$f":"SUM(M19:M163)","v":0}]
[null,null,null,null,null,null,null,null,null,null,null,null,"Total Zona C:",{"$f":"SUM(N19:N164)","v":903136.20000000007}]
[]
[null,"Fuente : Información proporcionada por las Entidades Federativas"]

{"sheet":"II D) 7 3","index":13,"n_rows":94,"n_cols":11,"rows_kept":94,"cut":false,"hidden":false,"merged":[[9,1,9,7],[8,9,8,10],[9,9,9,10]]}
[]
[]
[]
[]
[]
[]
[]
[]
[null,"Formato: Catálogo de Percepciones y Deducciones",null,null,null,null,null,null,"Entidad Federativa:",{"$f":"IF('1'!D21=\"Elige el Periodo…\",\"\",'1'!D21)","v":"CHIHUAHUA "}]
[null,{"$f":"IF('1'!D22=\"Elige el Periodo…\",\"\",'1'!D22)","v":"Fondo de Aportaciones para la Educación Tecnológica y de Adultos/Colegio Nacional de Educación Profesional Técnica (FAETA/CONALEP)"},null,null,null,null,null,null,null,"4to. Trimestre 2017"]
[]
[]
[null,"Identificador origen presupuestal de la plaza","Tipo de concepto de pago ","Origen de financiamiento del concepto de percepciones.","Porcentaje de participación federal por fuente de recursos","Grupo al que pertenece concepto de pago (Percepción y/o Deducción)","Clave de concepto de pago","Descripción del concepto de pago ","Partida presupuestal","Fecha del","Fecha  al"]
[]
[null,"Identificador origen presupuestal de la plaza","Tipo de concepto de pago ","Origen de financiamiento del concepto de percepciones.","Porcentaje de participación federal por fuente de recursos","Grupo al que pertenece concepto de pago (Percepción y/o Deducción)","Clave de concepto de pago","Descripción del concepto de pago ","Partida presupuestal","Fecha del","Fecha  al"]
[null,1,"P","F",100,"P2",1003,"SALARIO BASE",83301,19990918,99999999]
[null,1,"P","F",100,"P3",2766,"PRIMA DE ANTIGÜEDAD",83301,19990918,99999999]
[null,1,"P","F",100,"P1",5050,"EXCESO DE CREDITO AL SALARIO",83301,19990918,99999999]
[null,1,"P","F",100,"P3",2627,"ESTIMULO 10 DE MAYO",83301,19990918,99999999]
[null,1,"P","F",100,"P1",2517,"ESTIMULO POR PRODUCTIVIDAD",83301,19990918,99999999]
[null,1,"P","F",100,"P1",2800,"DESPENSA",83301,19990918,99999999]
[null,1,"P","F",100,"P2",3623,"PRIMA VACACIONAL",83301,19990918,99999999]
[null,1,"P","F",100,"P3",2600,"PUNTUALIDAD Y ASISTENCIA",83301,19990918,99999999]
[null,1,"P","F",100,"P3",4468,"HORAS EXTRAS",83301,19990918,99999999]
[null,1,"P","F",100,"P1",1602,"DESARROLLO Y CAPACITACION",83301,19990918,99999999]
[null,1,"P","F",100,"P3",1624,"PRIMA DOMINICAL",83301,19990918,99999999]
[null,1,"P","F",100,"P3",2754,"GUARDERIA",83301,19990918,99999999]
[null,1,"P","F",100,"P1",2518,"COMPENSACION GARANTIZADA",83301,19990918,99999999]
[null,1,"P","F",100,"P3",2850,"LABORES EN CONDICIONES INSALUBRES",83301,19990918,99999999]
[null,1,"P","F",100,"P3",2680,"ANTEOJOS O LENTES DE CONTACTO",83301,19990918,99999999]
[null,1,"P","F",100,"P3",2655,"APARATOS ORTOPEDICOS",83301,19990918,99999999]
[null,1,"P","F",100,"P3",2810,"AYUDA PARA TITULACION",83301,19990918,99999999]
[null,1,"P","F",100,"P3",2615,"CANASTILLA MATERNAL",83301,19990918,99999999]
[null,1,"P","F",100,"P3",2553,"DIAS ECONOMICOS",83301,19990918,99999999]
[null,1,"P","F",100,"P3",2565,"AJUSTE SALARIAL",83301,19990918,99999999]
[null,1,"P","F",100,"P3",2573,"DIAS DE DESCANSO OBLIGATORIO",83301,19990918,99999999]
[null,1,"P","F",100,"P3",2625,"AYUDA UTILES ESCOLARES",83301,19990918,99999999]
[null,1,"P","F",100,"P2",3613,"AGUINALDO",83301,19990918,99999999]
[null,1,"P","F",100,"P3",2830,"BONIFICACION IMPUESTO",83301,19990918,99999999]
[null,1,"P","F",100,"P3",1601,"NUPCIAS",83301,19990918,99999999]
[null,1,"P","F",100,"P3",2955,"OTRAS PERCEPCIONES",83301,19990918,99999999]
[null,1,"P","F",100,"P1",2805,"PREVISION MULTIPLE",83301,20111116,99999999]
[null,1,"D",null,100,"D3",2950,"OTRAS DEDUCCIONES",null,19990918,99999999]
[null,1,"D",null,100,"D2",5045,"I.S.P.T. A RETENER",null,19990918,99999999]
[null,1,"D",null,100,"D2",2735,"SEGURO DE VIDA AHISA",null,19990918,99999999]
[null,1,"D",null,100,"D1",8523,"CUOTA SINDICAL",null,19990918,99999999]
[null,1,"D",null,100,"D2",2920,"SEGURO DE RETIRO",null,19990918,99999999]
[null,1,"D",null,100,"D3",8135,"PRESTAMO ISSSTE",null,19990918,99999999]
[null,1,"D",null,100,"D3",8095,"CREDITO HIPOTECARIO",null,19990918,99999999]
[null,1,"D",null,100,"D3",5710,"ANTICIPO DE SUELDO",null,19990918,99999999]
[null,1,"D",null,100,"D3",8580,"PENSION ALIMENTICIA",null,19990918,99999999]
[null,1,"D",null,100,"D3",6044,"IMPUESTO A RETENER",null,19990918,99999999]
[null,1,"D",null,100,"D3",1927,"SEGURO DE DAÑOS FOVISSSTE",null,19990918,99999999]
[null,1,"D",null,100,"D3",2910,"SEGURO DE AUTOMOVIL",null,19990918,99999999]
[null,1,"D",null,100,"D3",2915,"SEGURO DE VIDA COMERCIAL AMERICA",null,19990918,99999999]
[null,1,"D",null,100,"D3",2929,"DEDUCCIONES EXTRAS",null,19990918,99999999]
[null,1,"D",null,100,"D2",6250,"ISSSTE SEG SALUD",null,19990918,99999999]
[null,1,"D",null,100,"D2",6251,"ISSSTE SEG SALUD PENSIONADO",null,19990918,99999999]
[null,1,"D",null,100,"D2",6252,"ISSSTE SEG INVALIDEZ Y VIDA",null,19990918,99999999]
[null,1,"D",null,100,"D2",6253,"ISSSTE SEG SOCIALES Y CULT",null,19990918,99999999]
[null,1,"D",null,100,"D2",6254,"ISSSTE SEG RET CESANTIA AVZDA",null,19990918,99999999]
[null,1,"D",null,100,"D3",2740,"PRESTAMO DIMEX",null,19990918,20150415]
[null,1,"D",null,100,"D3",2740,"OTRAS DEDUCCIONES",null,20150416,99999999]
[null,1,"D",null,100,"D3",2912,"AHORRO SOLIDARIO EMP",null,19990918,99999999]
[null,1,"D",null,100,"D3",2880,"CREDITO CREDIFIEL",null,20130601,99999999]
[null,1,"D",null,100,"D3",2717,"SEGURO GENERAL AUTO",null,20150416,99999999]
[null,1,"D",null,100,"D3",2748,"SEGURO GENERAL VIDA",null,20150416,99999999]
[null,1,"D",null,100,"D3",2965,"SEGURO GENERAL SALUD",null,20150416,99999999]
[null,4,"P","F",100,"P1",1001,"SALARIO BASE",83301,20111116,99999999]
[null,4,"P","F",100,"P2",1005,"ESTIMULO",83301,20111116,99999999]
[null,4,"P","F",100,"P2",1006,"HORAS RECUPERADAS",83301,20111116,99999999]
[null,4,"D",null,100,"D1",2001,"I.S.R.",null,20111116,99999999]
[null,4,"D",null,100,"D2",2002,"CUOTA SINDICAL LOCAL",null,20111116,99999999]
[null,4,"D",null,100,"D1",2003,"SEG. SALUD T. ACTIVO",null,20111116,99999999]
[null,4,"D",null,100,"D2",2005,"PENSION ALIMENTICIA",null,20111116,99999999]
[null,4,"D",null,100,"D2",2006,"HORAS NO IMPARTIDAS",null,20111116,99999999]
[null,4,"D",null,100,"D1",2007,"S. RET. CESANTIA AVANZADA",null,20111116,99999999]
[null,4,"D",null,100,"D2",2013,"PRESTAMO ISSSTE",null,20111116,99999999]
[null,4,"D",null,100,"D2",2014,"PRESTAMO ISSSTE CORTO PLAZO",null,20111116,99999999]
[null,4,"D",null,100,"D2",2015,"PRESTAMO HIPOTECARIO",null,20111116,99999999]
[null,4,"D",null,100,"D2",2016,"SEGURO DE DAÑOS FOVISSTE",null,20111116,99999999]
[null,4,"D",null,100,"D2",2019,"TELETON",null,20111116,99999999]
[null,4,"D",null,100,"D3",2020,"PRESTAMO PERSONAL",null,20111116,99999999]
[null,4,"D",null,100,"D3",2021,"PRESTAMO CREDIFIEL",null,20130601,99999999]
[null,4,"D",null,100,"D1",2023,"SEG. SALUD T. PENSIONADO",null,20111116,99999999]
[null,4,"D",null,100,"D2",2024,"APORT. VOL. CRUZ ROJA",null,20111116,99999999]
[null,4,"D",null,100,"D1",2025,"SEG. INV. Y VIDA",null,20111116,99999999]
[null,4,"D",null,100,"D1",2026,"S. SOCIEDAD Y CULT.",null,20111116,99999999]
[null,4,"D",null,100,"D2",2870,"PRESTAMO SALVADOR",null,20140916,99999999]
[null,4,"D",null,100,"D3",2004,"CREDITO SALVADOR",null,20140916,99999999]
[null,4,"P","F",100,"P1",1035,"RETROACTIVO DE AGUINALDO",83301,20141116,99999999]
[null,4,"D",null,100,"D3",2038,"SEGURO AUTO",null,20150416,99999999]
[null,4,"D",null,100,"D3",2039,"SEGURO VIDA",null,20150416,99999999]
[null,"Fuente : Información proporcionada por las Entidades Federativas"]

{"sheet":"E)","index":14,"n_rows":27,"n_cols":8,"rows_kept":27,"cut":false,"hidden":false,"merged":[[9,1,9,5],[12,1,14,1],[12,2,14,2],[13,7,14,7],[12,3,14,3],[12,4,14,4],[12,5,12,7],[13,5,14,5],[13,6,14,6],[9,6,9,7]]}
[]
[]
[]
[]
[]
[]
[]
[]
[null,"Formato: Trabajadores que Cobran con RFC / CURP con Formato Incorrecto"]
[null,{"$f":"IF('1'!D22=\"Elige el Periodo…\",\"\",'1'!D22)","v":"Fondo de Aportaciones para la Educación Tecnológica y de Adultos/Colegio Nacional de Educación Profesional Técnica (FAETA/CONALEP)"},null,null,null,null,"4to. Trimestre 2017"]
[]
[]
[null,"Entidad Federativa","RFC","CURP","NOMBRE TRABAJADOR","Motivo"]
[null,null,null,null,null,"Sin RFC o erroneo","RFC Sin Homoclave","Sin CURP o Erronea"]
[]
[]
[null,"Entidad Federativa","RFC","CURP","NOMBRE TRABAJADOR","Sin RFC o erroneo","RFC Sin Homoclave","Sin CURP o Erronea"]
[]
[]
[]
[]
[]
[]
[null,"Total Personas : ",null,null,"Total Sin RFC o Erroneo:"]
[null,null,null,null,null,"Total RFC Sin Homoclave:"]
[null,null,null,null,null,null,"Total Sin CURP o Erroneo:"]
[null,"Fuente : Información proporcionada por las Entidades Federativas"]

{"sheet":"F) 1","index":15,"n_rows":27,"n_cols":19,"rows_kept":27,"cut":false,"hidden":false,"merged":[[9,1,9,6],[12,15,13,15],[12,16,13,16],[12,17,12,18],[12,1,13,1],[12,2,13,2],[12,3,13,3],[12,4,13,4],[12,5,13,5],[12,6,13,6],[12,7,13,7],[12,8,12,14],[9,17,9,18]]}
[]
[]
[]
[]
[]
[]
[]
[]
[null,"Formato: Trabajadores con Doble Asignación Salarial en Municipios no Colindantes Geográficamente"]
[null,{"$f":"IF('1'!D22=\"Elige el Periodo…\",\"\",'1'!D22)","v":"Fondo de Aportaciones para la Educación Tecnológica y de Adultos/Colegio Nacional de Educación Profesional Técnica (FAETA/CONALEP)"},null,null,null,null,null,null,null,null,null,null,null,null,null,null,null,"4to. Trimestre 2017"]
[]
[]
[null,"Entidad Federativa","Municipio","Localidad","RFC","CURP","Nombre del Trabajador","Clave integrada","Clave Presupuestal",null,null,null,null,null,null,"Clave CT","Nombre CT","Periodo en el CT"]
[null,null,null,null,null,null,null,null,"Partida Presupuestal","Código de Pago","Clave de Unidad","Clave de Sub Unidad","Clave de Categoría","Horas Semana Mes ","Número de Plaza",null,null,"Desde","Hasta"]
[]
[null,"Entidad Federativa","Municipio","Localidad","RFC","CURP","Nombre del Trabajador","Clave integrada","Partida Presupuestal","Código de Pago","Clave de Unidad","Clave de Sub Unidad","Clave de Categoría","Horas semana mes","Número de Plaza","Clave CT","Nombre CT","Periodo en el CT\nDesde","Periodo en el CTH\nasta"]
[]
[]
[]
[]
[]
[]
[null,"Total Personas : ",null,null,null,null,null,null,null,null,null,null,"Total Plazas : "]
[]
[]
[null,"Fuente : Información proporcionada por las Entidades Federativas"]
[null,"Importante: Listar Sólo los Municipios no Colindantes"]

{"sheet":"F) 2","index":16,"n_rows":27,"n_cols":20,"rows_kept":27,"cut":false,"hidden":false,"merged":[[13,3,14,3],[13,4,14,4],[13,5,14,5],[10,1,10,9],[13,19,14,19],[13,18,14,18],[13,6,13,12],[13,13,14,13],[13,14,14,14],[13,15,14,15],[13,16,13,17],[13,1,14,1],[13,2,14,2]]}
[]
[]
[]
[]
[]
[]
[]
[]
[]
[null,"Formato: Trabajadores Ocupando Plazas que Superan el Número de Horas de Compatibilidad Autorizadas"]
[null,{"$f":"IF('1'!D22=\"Elige el Periodo…\",\"\",'1'!D22)","v":"Fondo de Aportaciones para la Educación Tecnológica y de Adultos/Colegio Nacional de Educación Profesional Técnica (FAETA/CONALEP)"},null,null,null,null,null,null,null,null,null,null,null,null,null,null,null,null,"4to. Trimestre 2017"]
[]
[]
[null,"Entidad Federativa","RFC","CURP","Nombre","Clave integrada","Clave Presupuestal",null,null,null,null,null,null,"CT","Nombre CT","Turno CT","Periodo",null,"Total de Horas en el CT","Horas de compatibilidad de la categoría"]
[null,null,null,null,null,null,"Partida Presupuestal","Código de Pago","Clave de Unidad","Clave de Sub Unidad","Clave de Categoría","Horas Semana Mes ","Número de Plaza",null,null,null,"Desde","Hasta"]
[]
[null,"Entidad Federativa","RFC","CURP","Nombre","Clave integrada","Partida Presupuestal","Código de Pago","Clave de Unidad","Clave de Sub Unidad","Clave de Categoría","Horas semana mes","Número de plaza","CT","Nombre CT","Turno CT","Periodo\nDesde","Periodo\nHasta","Total de Horas en el CT","Horas de compatibilidad de la categoría"]
[]
[]
[]
[]
[]
[]
[null,"Total Personas : ",null,null,null,null,null,null,null,null,"Total Plazas : "]
[]
[]
[null,"Fuente : Información proporcionada por las Entidades Federativas"]

{"sheet":"G)","index":17,"n_rows":28,"n_cols":20,"rows_kept":28,"cut":false,"hidden":false,"merged":[[10,1,10,8],[12,5,12,11],[13,1,14,1],[13,2,14,2],[13,3,14,3],[13,4,14,4],[13,5,14,5],[13,6,13,12],[10,18,10,19],[13,19,14,19],[13,13,14,13],[13,14,14,14],[13,15,13,16],[13,17,14,17],[13,18,14,18]]}
[]
[]
[]
[]
[]
[]
[]
[]
[]
[null,"Formato: Trabajadores Cuyo Salario Básico Supere los Ingresos Promedio de un Docente en la Categoría más Alta del Tabulador Salarial Correspondiente a Cada Entidad"]
[null,{"$f":"IF('1'!D22=\"Elige el Periodo…\",\"\",'1'!D22)","v":"Fondo de Aportaciones para la Educación Tecnológica y de Adultos/Colegio Nacional de Educación Profesional Técnica (FAETA/CONALEP)"},null,null,null,null,null,null,null,null,null,null,null,null,null,null,null,null,"4to. Trimestre 2017"]
[]
[]
[null,"Entidad Federativa","R.F.C.","CURP","Nombre","Clave integrada","Clave Presupuestal Integrada y Categoria aparte",null,null,null,null,null,null,"Clave CT Origen","Nombre CT","Periodo",null,"Monto de Remuneraciones Mensuales ","Monto de referencia","Diferencia\n(R-S)"]
[null,null,null,null,null,null,"Partida Presupuestal","Código de Pago","Clave de Unidad","Clave de Sub Unidad","Clave de Categoría","Horas Semana Mes ","Número de Plaza",null,null,"Desde","Hasta"]
[]
[null,"Entidad Federativa","R.F.C.","CURP","Nombre","Clave integrada","Partida Presupuestal","Código de Pago","Clave de Unidad","Clave de Sub Unidad","Clave de Categoría","Horas Semana Mes ","No. de plaza","CT","Nombre CT","Periodo\nDesde","Periodo\nHasta","Monto de Remuneraciones Mensuales ","Monto de referencia","Diferencia\n(R-S)"]
[]
[]
[]
[]
[]
[]
[null,"Total Personas : ",null,null,null,null,null,null,null,null,null,null,null,null,"Total Remuneraciones Mensuales:"]
[]
[null,null,null,null,null,null,null,null,null,null,null,null,null,null,null,null,null,"Total Diferencia:"]
[]
[null,"Fuente : Información proporcionada por las Entidades Federativas"]

{"sheet":"H)","index":18,"n_rows":13,"n_cols":8,"rows_kept":13,"cut":false,"hidden":false,"merged":[[0,1,0,2]]}
[null,"4to. Trimestre 2017"]
[null,"Movimientos de Personal por Centro de Trabajo"]
[null,"Personal Registrado en la Nómina Federalizada"]
[null,"Nómina","Plaza (Clave presupuestal)","Categoría de la plaza","RFC","CURP","Nombre","Movimientos"]
[]
[]
[]
[]
[]
[]
[null,"Información reportada por la Entidad Federativa, correspondiente al periodo"]
[null,"La Entidad Federativa pudo haber reportado pagos a más de una persona con la misma plaza por distintos motivos de carácter administrativo"]
[null,"Alta: Se refiere a la incorporación de la plaza a la Base de Datos en este sistema"]

{"sheet":"Listas","index":19,"n_rows":42,"n_cols":8,"rows_kept":42,"cut":false,"hidden":true,"merged":[]}
[]
[]
[]
[null,"Elige un Fondo…"]
[null,"Fondo de Aportaciones para la Educación Básica y Normal (FAEB)"]
[null,"Fondo de Aportaciones para la Educación Tecnológica y de Adultos/Colegio Nacional de Educación Profesional Técnica (FAETA/CONALEP)"]
[null,"Fondo de Aportaciones para la Educación Tecnológica y de Adultos/Instituto Nacional para la Educación de los Adultos (FAETA/INEA)"]
[]
[]
[null,null,null,null,null,null,null,"Elige la Entidad Federativa…"]
[null,"Elige el Periodo…",null,null,null,null,null,"AGUASCALIENTES"]
[null,"1er. Trimestre",null,null,null,null,null,"BAJA CALIFORNIA"]
[null,"2do. Trimestre",null,null,null,null,null,"BAJA CALIFORNIA SUR"]
[null,"3er. Trimestre",null,null,null,null,null,"CAMPECHE"]
[null,"4to. Trimestre",null,null,null,null,null,"COAHUILA "]
[null,null,null,"Elige el Año…",null,null,null,"COLIMA "]
[null,null,null,2013,null,null,null,"CHIAPAS "]
[null,null,null,2014,null,null,null,"CHIHUAHUA "]
[null,null,null,2015,null,null,null,"DISTRITO FEDERAL"]
[null,null,null,2016,null,null,null," DURANGO "]
[null,null,null,2017,null,null,null," GUANAJUATO "]
[null,null,null,2018,null,null,null," GUERRERO "]
[null,null,null,null,null,null,null," HIDALGO"]
[null,null,null,null,null,null,null," JALISCO "]
[null,null,null,null,null,null,null," MEXICO "]
[null,null,null,null,null,null,null," MICHOACAN "]
[null,null,null,null,null,null,null," MORELOS "]
[null,null,null,null,null,null,null," NAYARIT "]
[null,null,null,null,null,null,null," NUEVO LEON"]
[null,null,null,null,null,null,null," OAXACA "]
[null,null,null,null,null,null,null," PUEBLA "]
[null,null,null,null,null,null,null," QUERETARO "]
[null,null,null,null,null,null,null," QUINTANA ROO"]
[null,null,null,null,null,null,null," SAN LUIS"]
[null,null,null,null,null,null,null," SINALOA "]
[null,null,null,null,null,null,null," SONORA "]
[null,null,null,null,null,null,null," TABASCO "]
[null,null,null,null,null,null,null," TAMAULIPAS "]
[null,null,null,null,null,null,null," TLAXCALA "]
[null,null,null,null,null,null,null," VERACRUZ"]
[null,null,null,null,null,null,null," YUCATÁN "]
[null,null,null,null,null,null,null," ZACATECAS "]