{"text_format":"1","workbook":"xlsx","n_sheets":20,"sheets":["1","CARATULA RESUMEN","A Y  II D3","A Y II D4","B)","II B) Y 1","II C y 1_","II D) 2","II D) 4","II D) 4 A","II D) 6","II D) 7 1","II D) 7 2 ","II D) 7 3","E)","F) 1","F) 2","G)","H)","Listas"],"not_rendered":{"charts":0,"images":16,"macros":1,"external_links":0,"defined_names":18,"comments":16,"pivot_tables":0},"unopened":[],"bounds":{"document_bytes":16777216,"sheet_cells":100000,"rows_first":2000,"rows_last":500,"rows_between":2000,"halvings":0,"cell_chars":16384,"cell_head_chars":4096},"cells_cut":0,"cells_raw":0,"read":"whole","date_system":"1900"}

{"sheet":"1","index":0,"n_rows":73,"n_cols":18,"rows_kept":73,"cut":false,"hidden":false,"merged":[[36,3,36,6],[10,3,10,18],[11,3,11,18],[12,3,12,18],[34,3,34,6],[35,3,35,6],[46,3,46,6],[47,3,47,6],[48,3,48,6],[37,3,37,6],[38,3,38,6],[39,3,39,6],[40,3,40,6],[41,3,41,6],[42,3,42,6],[69,2,69,5],[71,2,71,5],[72,2,72,5],[73,2,73,5],[20,3,20,14],[21,3,21,14],[22,3,22,14],[49,3,49,6],[62,2,62,5],[63,2,63,5],[65,2,65,5],[66,2,66,5],[68,2,68,5],[43,3,43,6],[44,3,44,6],[45,3,45,6]]}
[]
[]
[]
[]
[]
[]
[]
[]
[]
[]
[]
[null,null,null,"FORMATOS ENTREGADOS PARA DAR CUMPLIMIENTO AL ARTICULO 73 DE \"LA LEY GENERAL DE CONTABILIDAD GUBERNAMENTAL\""]
[]
[]
[]
[]
[]
[]
[]
[]
[null,null,"Entidad Federativa :","CHIHUAHUA "]
[null,null,"Fondo :","Fondo de Aportaciones para la Educación Tecnológica y de Adultos/Colegio Nacional de Educación Profesional Técnica (FAETA/CONALEP)"]
[null,null,"Periodo :","2do. Trimestre"]
[]
[]
[]
[]
[]
[]
[]
[]
[null,null,null,null,null,null,null,"TOTAL REGISTROS ",null,"Num. de Paginas",null,"TOTAL PERSONAS",null,"TOTAL PLAZAS",null,"Total Pto. Federal",null,"Total Ppto. Otras Fuentes"]
[]
[]
[null,1,"A Y II D3","Personal Comisionado",null,null,null,null,null,null,null,null,null,null,null,null,null,0]
[null,2,"A Y II D4","Personal con Licencia",null,null,null,null,null,null,null,null,null,null,null,null,null,0]
[null,3,"B)   ","Registro Federal de Contribuyentes de Trabajadores con Pagos Retroactivos con un Periodo Mayor a 45 días",null,null,null,"N/A",null,"N/A",null,"N/A",null,"N/A",null,"N/A",null,"N/A"]
[null,4,"II B) Y 1","Plaza / Función",null,null,null,null,null,null,null,null,null,"N/A",null,"N/A",null,"N/A"]
[null,5,"II C y 1_","Personal Federalizado por Registro Federal de Contribuyentes",null,null,null,null,null,null,null,null,null,null,null,null,null,0]
[null,6,"II D) 2","Movimientos de Plazas",null,null,null,null,null,null,null,null,null,null,null,"N/A",null,"N/A"]
[null,7,"II D) 4","Trabajadores Jubilados en el Periodo",null,null,null,null,null,null,null,null,null,null,null,"N/A",null,"N/A"]
[null,8,"II D) 4 A","Trabajadores que Tramitaron Licencia Prejubilatoria en el Periodo",null,null,null,null,null,null,null,null,null,null,null,null,null,0]
[null,9,"II D) 6","Trabajadores Contratados por Honorarios en el Periodo",null,null,null,null,null,null,null,null,null,"N/A",null,"N/A",null,"N/A"]
[null,10,"II D) 7 1 ","Analítico de Categorías / Plazas Autorizadas con su Tabulador",null,null,null,null,null,null,null,"N/A",null,"N/A",null,"N/A",null,"N/A"]
[null,11,"II D) 7 2 ","Catálogo de Categorías y Tabuladores",null,null,null,null,null,null,null,"N/A",null,"N/A",null,"N/A",null,"N/A"]
[null,12,"II D) 7 3 ","Catálogo de Percepciones y Deducciones",null,null,null,null,null,null,null,"N/A",null,"N/A",null,"N/A",null,"N/A"]
[null,13,"E)","Trabajadores que Cobran con RFC / CURP con Formato Incorrecto",null,null,null,"N/A",null,"N/A",null,"N/A",null,"N/A",null,"N/A",null,"N/A"]
[null,14,"F) 1","Trabajadores con Doble Asignación Salarial en Municipios no Colindantes Geográficamente",null,null,null,"N/A",null,"N/A",null,"N/A",null,"N/A",null,"N/A",null,"N/A"]
[null,15,"F) 2","Trabajadores Ocupando Plazas que Superan el Número de Horas de Compatibilidad Autorizadas",null,null,null,"N/A",null,"N/A",null,"N/A",null,"N/A",null,"N/A",null,"N/A"]
[null,16,"G)","Trabajadores Cuyo Salario Básico Supere los Ingresos Promedio de un Docente en la Categoría más Alta del Tabulador Salarial Correspondiente a Cada Entidad",null,null,null,"N/A",null,"N/A",null,"N/A",null,"N/A",null,"N/A",null,"N/A"]
[]
[]
[]
[]
[]
[]
[]
[]
[]
[]
[]
[]
[null,null,"LIC. JESUS ALFONSO RAMIREZ MARRUFO"]
[null,null,"Nombre del  Responsable"]
[]
[null,null,"SUBJEFE TECNICO ESPECIALISTA DE RECURSOS HUMANOS"]
[null,null,"Cargo"]
[]
[]
[null,null,"Firma"]
[]
[null,null,"2016-04-13"]
[null,null,"Fecha"]

{"sheet":"CARATULA RESUMEN","index":1,"n_rows":73,"n_cols":18,"rows_kept":73,"cut":false,"hidden":false,"merged":[[22,3,22,14],[10,3,10,18],[11,3,11,18],[12,3,12,18],[20,3,20,14],[21,3,21,14],[45,3,45,6],[34,3,34,6],[35,3,35,6],[36,3,36,6],[37,3,37,6],[38,3,38,6],[39,3,39,6],[40,3,40,6],[41,3,41,6],[42,3,42,6],[43,3,43,6],[44,3,44,6],[46,3,46,6],[47,3,47,6],[48,3,48,6],[49,3,49,6],[62,2,62,5],[73,2,73,5],[50,3,50,6],[65,2,65,5],[66,2,66,5],[68,2,68,5],[69,2,69,5],[71,2,71,5],[72,2,72,5],[63,2,63,5]]}
[]
[]
[]
[]
[]
[]
[]
[]
[]
[]
[]
[null,null,null,"FORMATOS ENTREGADOS PARA DAR CUMPLIMIENTO AL ARTICULO 73 DE \"LA LEY GENERAL DE CONTABILIDAD GUBERNAMENTAL\""]
[]
[]
[]
[]
[]
[]
[]
[]
[null,null,"Entidad Federativa :","CHIHUAHUA "]
[null,null,"Fondo :","Fondo de Aportaciones para la Educación Tecnológica y de Adultos/Colegio Nacional de Educación Profesional Técnica (FAETA/CONALEP)"]
[null,null,"Periodo :","3er. Trimestre 2019"]
[]
[]
[]
[]
[]
[]
[]
[]
[null,null,null,null,null,null,null,"TOTAL REGISTROS ",null,"Num. de Paginas",null,"TOTAL PERSONAS",null,"TOTAL PLAZAS",null,"Total Pto. Federal",null,"Total Ppto. Otras Fuentes"]
[]
[]
[null,1,"A Y II D3","Personal Comisionado",null,null,null,11,null,1,null,11,null,11,null,879018.66999999993,null,"N/A"]
[null,2,"A Y II D4","Personal con Licencia",null,null,null,22,null,1,null,22,null,8,null,271161.56999999995,null,"N/A"]
[null,3,"B)   ","Registro Federal de Contribuyentes de Trabajadores con Pagos Retroactivos con un Periodo Mayor a 45 días",null,null,null,"N/A",null,"N/A",null,"N/A",null,"N/A",null,"N/A",null,"N/A"]
[null,4,"II B) Y 1","Plaza / Función",null,null,null,851,null,17,null,851,null,"N/A",null,34153907.42920088,null,"N/A"]
[null,5,"II C y 1_","Personal Federalizado por Registro Federal de Contribuyentes",null,null,null,851,null,20,null,851,null,243,null,34153907.429200888,null,"N/A"]
[null,6,"II D) 2","Movimientos de Plazas",null,null,null,56,null,2,null,56,null,14,null,"N/A",null,"N/A"]
[null,7,"II D) 4","Trabajadores Jubilados en el Periodo",null,null,null,"N/A",null,"N/A",null,"N/A",null,"N/A",null,"N/A",null,"N/A"]
[null,8,"II D) 4 A","Trabajadores que Tramitaron Licencia Prejubilatoria en el Periodo",null,null,null,"N/A",null,"N/A",null,"N/A",null,"N/A",null,"N/A",null,"N/A"]
[null,9,"II D) 6","Trabajadores Contratados por Honorarios en el Periodo",null,null,null,30,null,1,null,30,null,"N/A",null,1039239.2,null,"N/A"]
[null,10,"II D) 7 1 ","Analítico de Categorías / Plazas Autorizadas con su Tabulador",null,null,null,146,null,3,null,"N/A",null,"N/A",null,"N/A",null,"N/A"]
[null,11,"II D) 7 2 ","Catálogo de Categorías y Tabuladores",null,null,null,151,null,5,null,"N/A",null,"N/A",null,"N/A",null,"N/A"]
[null,12,"II D) 7 3 ","Catálogo de Percepciones y Deducciones",null,null,null,79,null,3,null,"N/A",null,"N/A",null,"N/A",null,"N/A"]
[null,13,"E)","Trabajadores que Cobran con RFC / CURP con Formato Incorrecto",null,null,null,"N/A",null,"N/A",null,"N/A",null,"N/A",null,"N/A",null,"N/A"]
[null,14,"F) 1","Trabajadores con Doble Asignación Salarial en Municipios no Colindantes Geográficamente",null,null,null,"N/A",null,"N/A",null,"N/A",null,"N/A",null,"N/A",null,"N/A"]
[null,15,"F) 2","Trabajadores Ocupando Plazas que Superan el Número de Horas de Compatibilidad Autorizadas",null,null,null,"N/A",null,"N/A",null,"N/A",null,"N/A",null,"N/A",null,"N/A"]
[null,16,"G)","Trabajadores Cuyo Salario Básico Supere los Ingresos Promedio de un Docente en la Categoría más Alta del Tabulador Salarial Correspondiente a Cada Entidad",null,null,null,"N/A",null,"N/A",null,"N/A",null,"N/A",null,"N/A",null,"N/A"]
[null,17,"H) ","Movimientos de Personal por Centro de Trabajo",null,null,null,"N/A",null,"N/A",null,"N/A",null,"N/A",null,"N/A",null,"N/A"]
[]
[]
[]
[]
[]
[]
[]
[]
[]
[]
[]
[null,null,"LIC. JESUS ALFONSO RAMIREZ MARRUFO"]
[null,null,"Nombre del  Responsable"]
[]
[null,null,"SUBJEFE TECNICO ESPECIALISTA DE RECURSOS HUMANOS"]
[null,null,"Cargo"]
[]
[]
[null,null,"Firma"]
[]
[null,null,"2019-10-09"]
[null,null,"Fecha"]

{"sheet":"A Y  II D3","index":2,"n_rows":33,"n_cols":25,"rows_kept":33,"cut":false,"hidden":false,"merged":[[29,12,29,14],[12,24,13,24],[12,13,12,14],[12,15,13,15],[12,16,13,16],[12,17,13,17],[12,18,12,19],[12,20,13,20],[27,13,27,14],[12,21,13,21],[12,22,13,22],[12,23,13,23],[9,1,9,7],[12,6,12,12],[12,1,13,1],[12,2,13,2],[12,3,13,3],[12,4,13,4],[12,5,13,5]]}
[]
[]
[]
[]
[]
[]
[]
[]
[null,"Formato: Personal Comisionado"]
[null,{"$f":"IF('1'!D22=\"Elige el Periodo…\",\"\",'1'!D22)","v":"Fondo de Aportaciones para la Educación Tecnológica y de Adultos/Colegio Nacional de Educación Profesional Técnica (FAETA/CONALEP)"},null,null,null,null,null,null,null,null,null,null,null,null,null,null,null,null,null,null,null,null,null,"3er. Trimestre 2019"]
[]
[]
[null,"Entidad Federativa","R.F.C.","CURP","Nombre","Clave integrada","Clave Presupuestal",null,null,null,null,null,null,"Fecha Comisión",null,"Percepciones pagadas en el Periodo de Comisión con Presupuesto Federal*","Percepciones pagadas en el Periodo de Comisión con Presupuesto de otra fuente*","Clave CT Origen","CT Destino dentro del sector",null,"Lugar de la comisión fuera del sector educativo","Tipo de Comisión","Función Específica","Objeto de la comision","No. Oficio"]
[null,null,null,null,null,null,"Partida Presupuestal","Código de Pago","Clave de Unidad","Clave de Sub Unidad","Clave de Categoría","Horas Semana Mes ","Número de Plaza","Inicio","Conclusión",null,null,null,"Clave","Turno"]
[]
[null,"Entidad Federativa","R.F.C.","CURP","Nombre","Clave integrada","Partida Presupuestal","Código de Pago","Clave de Unidad","Clave de Sub Unidad","Clave de Categoría","Horas Semana Mes ","Número de Plaza","Fecha Comisión\nInicio","Fecha Comisión\nConclusión","Percepciones pagadas en el Periodo de Comisión con Presupuesto Federal*","Percepciones pagadas en el Periodo de Comisión con Presupuesto de otra fuente*","Clave CT Origen","Clave","Turno","Lugar de la comisión fuera del sector educativo","Tipo de Comisión","Función Específica","Objeto de la comision","No. Oficio"]
[null,"CHIHUAHUA","CIBA710920FVA","CIBA710920MDGTRL04","ALMA ROSA CITAL BERTAHUD","8310110030026CF3320600.014304",83101,1003,"00",26,"CF33206","00.0",14304,20100716,99999999,136446.96,0,"08DPT0002B","08DPT0013H",123,"/","h","DIRECCION DEL PLANTEL ","APOYO PARA EL DEPARTAMENTO","DGE/515/2010"]
[null,"CHIHUAHUA","LOCJ681030V96","LOCJ681030HCHZLS07","JESUS EDUARDO LOZOYA CALDERON","8310110030026A0320200.02419",83101,1003,"00",26,"A03202","00.0",2419,20130216,99999999,54620.14,0,"08DPT0002B","08DPT0007X",230,"/","h","AUXILIAR DE SERVICIOS GENERALES","APOYO PARA EL DEPARTAMENTO","RH/087/2013"]
[null,"CHIHUAHUA","ROGJ6511161S5","ROGJ651116HDGCRN00","JUAN JESUS ROCHA GARCIA","8310110030026CF1820300.0131",83101,1003,"00",26,"CF18203","00.0",131,20120216,99999999,50307.02,0,"08DPT0002B","08DPT0007X",200,"/","h","SUPERVISOR DE MANTENIMIENTO","APOYO PARA EL DEPARTAMENTO","DGE/156-B/2012"]
[null,"CHIHUAHUA","VASC8109266G6","VASC810926MCHLLL08","CLAUDIA VALVERDE SALAZAR","8310110030026ED0120100.02445",83101,1003,"00",26,"ED01201","00.0",2445,20160701,99999999,53565.2,0,"08DPT0002B","08DPT0007X",700,"/","h","DELEGADA SINDICAL ESTATAL","APOYO PARA EL DEPARTAMENTO","DP/1086/2016"]
[null,"CHIHUAHUA","LOCJ6307091T8","LOCJ630709HCHPRS08","JESUS MARTIN LOPEZ CARO","8310110030026CF3320600.013757",83101,1003,"00",26,"CF33206","00.0",13757,20170316,99999999,141788.14000000001,0,"08DPT0002B","00XXX0000X",100,"/","h","JEFE DE PROYECTO","APOYO PARA EL DEPARTAMENTO","DGE/109/2017"]
[null,"CHIHUAHUA","HEGJ620729F26","HEGJ620729HCHRNV07","JOSE JAVIER HERNANDEZ GONZALEZ","8310110030207CF3320600.014112",83101,1003,"02","07","CF33206","00.0",14112,20170201,99999999,94258.74,0,"08DPT0007X","08DPT0002B",100,"/","h","JEFE DE PROYECTO INFORMATICA","APOYO PARA EL DEPARTAMENTO","AJ/OFC/03/2017"]
[null,"CHIHUAHUA","MACE880915VB1","MACE880915HCHRNR04","MARTELL CONTRERAS ERICK ","8330110030219CF3320400.09705",83301,1003,"02",19,"CF33204","00.0",9705,20170201,20190915,47120.57,0,"08DPT0011J","00XXX0000X",120,"/","h","SUBJEFE TECNICO ESPECIALISTA","APOYO PARA EL DEPARTAMENTO","AJ/OFC/02/2017"]
[null,"CHIHUAHUA","CATC7205274V8","CATC720527HCHNRR09","CARLOS CANO TORRES","8310110030704CF3320400.010990",83101,1003,"07","04","CF33204","00.0",10990,20110104,99999999,108391.78,0,"00XXX0000X","08DPT0013H",124,"/","h","SUBJEFE TECNICO ESPECIALISTA","APOYO PARA EL DEPARTAMENTO","DGE/001-B/2011"]
[null,"CHIHUAHUA","MONL710121CT7","MONL710121MSLGVR08","LORENA INES MOGUEL NOVELO","8310110030704CF0160100.010993",83101,1003,"07","04","CF01601","00.0",10993,20170201,20190815,33229.949999999997,0,"00XXX0000X","08DPT0007X",124,"/","h","JEFE DE UNIDAD","APOYO PARA EL DEPARTAMENTO","DGE/105/2017"]
[null,"CHIHUAHUA","PALU750621U84","PAXL750621HCHLXS05","LUIS ENRIQUE PALACIOS","8310110030704CF3320400.010995",83101,1003,"07","04","CF33204","00.0",10995,20170201,99999999,92830.27,0,"00XXX0000X","08DPT0002B",124,"/","h","SUBJEFE TECNICO ESPECIALISTA","APOYO PARA EL DEPARTAMENTO","DGE/104/2017"]
[null,"CHIHUAHUA","QUEG630216GA8","QUEG630216MCHXSR02","QUIÑONEZ ESTRADA GRACIELA","8310110030704CF0160100.011822",83101,1003,"07","04","CF01601","00.0",11822,20171016,99999999,66459.899999999994,0,"00XXX0000X","00XXX0000X",124,"/","h","JEFE DE UNIDAD","APOYO PARA EL DEPARTAMENTO","RH/105/2017"]
[null,"Total Personas : ",11,null,null,null,null,null,null,null,"Total Plazas : ",null,11,"Total Pto. Federal",null,{"$f":"SUBTOTAL(109,Tabla1[Percepciones pagadas en el Periodo de Comisión con Presupuesto Federal*])","v":879018.66999999993}]
[]
[null,null,null,null,null,null,null,null,null,null,null,null,"Total Ppto. Otras Fuentes",null,null,null,0]
[]
[null,"*Total de Percepciones reportadas por la Entidad Federativa como pagadas al trabajador durante la comisión."]
[null,"Fuente : Información proporcionada por las Entidades Federativas."]

{"sheet":"A Y II D4","index":3,"n_rows":44,"n_cols":21,"rows_kept":44,"cut":false,"hidden":false,"merged":[[9,1,9,6],[38,13,38,14],[12,16,13,16],[12,17,13,17],[12,20,13,20],[12,1,13,1],[12,3,13,3],[12,4,13,4],[12,5,13,5],[12,6,12,12],[12,13,12,14],[12,2,13,2],[12,18,12,19],[12,15,13,15]]}
[]
[]
[]
[]
[]
[]
[]
[]
[null,"Formato: Personal con Licencia"]
[null,{"$f":"IF('1'!D22=\"Elige el Periodo…\",\"\",'1'!D22)","v":"Fondo de Aportaciones para la Educación Tecnológica y de Adultos/Colegio Nacional de Educación Profesional Técnica (FAETA/CONALEP)"},null,null,null,null,null,null,null,null,null,null,null,null,null,null,null,null,null,null,"3er. Trimestre 2019"]
[]
[]
[null,"Entidad Federativa","R.F.C.","CURP","NOMBRE","Clave integrada","Clave Presupuestal",null,null,null,null,null,null,"Periodo Licencia",null,"Percepciones pagadas en el Periodo de la Licencia con Presupuesto Federal*","Percepciones pagadas en el Periodo de la Licencia con Presupuesto de otra fuente*","Clave CT Origen","Licencia",null,"Descripción de la Licencia"]
[null,null,null,null,null,null,"Partida Presupuestal","Código de Pago","Clave de Unidad","Clave de Sub Unidad","Clave de Categoría","Horas Semana Mes ","Número de Plaza","Inicio","Conclusión",null,null,null,"Clave","Tipo"]
[]
[null,"Entidad Federativa","R.F.C.","CURP","NOMBRE","Clave integrada","Partida Presupuestal","Código de Pago","Clave de Unidad","Clave de Sub Unidad","Clave de Categoría","Horas Semana Mes ","Número de Plaza","Periodo Licencia\nInicio","Periodo Licencia\nConclusión","Percepciones pagadas en el Periodo de la Licencia con Presupuesto Federal*","Percepciones pagadas en el Periodo de la Licencia con Presupuesto de otra fuente*","Clave CT Origen","Licencia\nClave","Licencia\nTipo","Descripción de la Licencia"]
[null,"CHIHUAHUA","CAAI5611206JA","CAAI561120MCHSRD05","IDELIA CASTRO ARMENDARIZ","8310110010025E372520.00",83101,1001,"00","25","E3725","20.0",0,20190901,20190915,0,0,"08DPT0001C",16,"SIN GOCE","SIN GOCE DE SUELDO"]
[null,"CHIHUAHUA","LORJ800906MC9","LORJ800906HCHYDS03","JESUS ARTURO LOYA RODRIGUEZ","8310110010025E371315.00",83101,1001,"00","25","E3713","15.0",0,20190816,20200131,0,0,"08DPT0001C",16,"SIN GOCE","SIN GOCE DE SUELDO"]
[null,"CHIHUAHUA","TAAD800122GU1","TAAD800122HCHRRL07","DELFINO TARIN ARMENDARIZ","8310110010025E372518.00",83101,1001,"00","25","E3725","18.0",0,20190902,20190913,4398.3,0,"08DPT0001C",22,"GOCE","POR INCAPACIDAD MEDICA"]
[null,"CHIHUAHUA","LOLG6105041C1","LOLG610504HCHZPR03","GERARDO LOZANO LOPEZ","8310110030025CF3420200.02415",83101,1003,"00","25","CF34202","00.0",2415,20190708,20190818,29997.91,0,"08DPT0001C",22,"GOCE","POR INCAPACIDAD MEDICA"]
[null,"CHIHUAHUA","MERE811126DU3","MERE811126MCHLMD02","EDNA MELINA MELERO RAMIREZ","8310110010226E372519.00",83101,1001,"02","26","E3725","19.0",0,20190802,20190930,0,0,"08DPT0002B",16,"SIN GOCE","SIN GOCE DE SUELDO"]
[null,"CHIHUAHUA","AUPC720823662","AUPC720823MZSGLL09","CLARA AGUERO PALACIOS","8310110030226CF3420200.02457",83101,1003,"02","26","CF34202","00.0",2457,20190701,20190930,0,0,"08DPT0002B",16,"SIN GOCE","SIN GOCE DE SUELDO"]
[null,"CHIHUAHUA","LIHJ9107073M0","LIHJ910707HCHRRS09","JASSON RAYMUNDO LIRA HERRERA","8310110030226S0120100.02428",83101,1003,"02","26","S01201","00.0",2428,20190816,20190930,0,0,"08DPT0002B",16,"SIN GOCE","SIN GOCE DE SUELDO"]
[null,"CHIHUAHUA","CALA591128150","CALA591128HCHNSB00","ABRAHAM CANO LEOS","8310110010156E372520.00",83101,1001,"01","56","E3725","20.0",0,20190828,20191009,11001.65,0,"08DPT0003A",22,"GOCE","POR INCAPACIDAD MEDICA"]
[null,"CHIHUAHUA","HOOJ841127R23","HOOJ841127HCHLJS04","JESUS MANUEL HOLGUIN OJEDA","8310110010156E372520.00",83101,1001,"01","56","E3725","20.0",0,20190812,20190825,4886.9799999999996,0,"08DPT0003A",22,"GOCE","POR INCAPACIDAD MEDICA"]
[null,"CHIHUAHUA","MOIR7306072Z5","MOIR730607HCHLBM08","RAMON HUMBERTO MOLINA IBARRA","8310110030156CF3420200.07491",83101,1003,"01","56","CF34202","00.0",7491,20190805,20190821,5193.6099999999997,0,"08DPT0003A",22,"GOCE","POR INCAPACIDAD MEDICA"]
[null,"CHIHUAHUA","ROQR510228S57","ROQR510228MCHGZF01","MARIA DEL REFUGIO ROGERO QUEZADA","8310110010207CF0210500.012864",83101,1001,"02","07","CF02105","00.0",12864,20190628,20190905,0,0,"08DPT0007X",22,"SIN GOCE","POR INCAPACIDAD MEDICA"]
[null,"CHIHUAHUA","MOMM791027B8A","MOMM791027MCHRRY08","MAYRA MARGARITA MORALES MORENO","8310110010207E372519.00",83101,1001,"02","07","E3725","19.0",0,20190906,20191004,14125.35,0,"08DPT0007X",22,"GOCE","POR INCAPACIDAD MEDICA"]
[null,"CHIHUAHUA","AAOG811026Q47","AAOG811026MCHRRB02","GABRIELA MARIA ARAGON ORTIZ","8310110010218E372520.00",83101,1001,"02","18","E3725","20.0",0,20190829,20191127,9937.5,0,"08DPT0012I",25,"GOCE","POR GRAVIDEZ"]
[null,"CHIHUAHUA","MATM841124GU1","MATM841124MCHRLY00","MAYTEE ABRIL MARQUEZ TELLO","8310110010218E372514.00",83101,1001,"02","18","E3725","14.0",0,20190702,20190929,20639.849999999999,0,"08DPT0012I",25,"GOCE","POR GRAVIDEZ"]
[null,"CHIHUAHUA","PEMC8412061M5","PEMC841206HCHXRR02","CARLOS DE LA PEÑA MERAZ","8310110010218E372520.00",83101,1001,"02","18","E3725","20.0",0,20190816,20200131,0,0,"08DPT0012I",16,"SIN GOCE","SIN GOCE DE SUELDO"]
[null,"CHIHUAHUA","IIOF8012093M1","IIOF801209HCHRLR08","FRANCISCO IRIGOYEN OLIVAS","8310110010218E372520.00",83101,1001,"02","18","E3725","20.0",0,20190816,20200131,0,0,"08DPT0012I",16,"SIN GOCE","SIN GOCE DE SUELDO"]
[null,"CHIHUAHUA","VIMG940827G9A","VIMG940827MCHLNL05","GUILLE LIZBETH VILLALOBOS MONTAﾑO","8310110010218E371120.00",83101,1001,"02","18","E3711","20.0",0,20190901,20200131,0,0,"08DPT0012I",16,"SIN GOCE","SIN GOCE DE SUELDO"]
[null,"CHIHUAHUA","OIAA580304QJA","OIAA580304HCHRRB04","ABRAHAM ORTIZ ARMENDARIZ","8310110030219S0120200.09722",83101,1003,"02","19","S01202","00.0",9722,20190805,20191020,43965.75,0,"08DPT0011J",22,"GOCE","POR INCAPACIDAD MEDICA"]
[null,"CHIHUAHUA","VILA590828MZ1","VILA590828HCHLZG06","AGUSTIN VILLAGRAN LOZOYA","8310110030219S0120200.09737",83101,1003,"02","19","S01202","00.0",9737,20190805,20191022,38763.449999999997,0,"08DPT0011J",22,"GOCE","POR INCAPACIDAD MEDICA"]
[null,"CHIHUAHUA","SIRS640927FF8","SIRS640927MCHLDL09","SILVIA SILVA RODRIGUEZ ","8310110030512CF3320600.014135",83101,1003,"05","12","CF33206","00.0",14135,20190718,20190816,40559.22,0,"00XXX0000X",22,"GOCE","POR INCAPACIDAD MEDICA"]
[null,"CHIHUAHUA","HEPM870418QNA","HEPM870418MDFRRR08","MARY CARMEN HERNANDEZ PERALES","8310110010323E372520.00",83101,1001,"03","23","E3725","20.0",0,20190730,20190927,23846,0,"08DPTOO13H",22,"GOCE","POR INCAPACIDAD MEDICA"]
[null,"CHIHUAHUA","QUPK7804119NA","QUPK780411MSRVRR11","KARLA LIZETTE  QUEVEDO PRECIADO","8310110010323E372520.00",83101,1001,"03","23","E3725","20.0",0,20190808,20190913,23846,0,"08DPTOO13H",22,"GOCE","POR INCAPACIDAD MEDICA"]
[null,"Total Personas : ",22,null,null,null,null,null,null,null,"Total Plazas : ",null,8,"Total Pto. Federal",null,{"$f":"SUBTOTAL(109,Tabla3[Percepciones pagadas en el Periodo de la Licencia con Presupuesto Federal*])","v":271161.56999999995}]
[]
[null,null,null,null,null,null,null,null,null,null,null,null,null,"Total Ppto. Otras Fuentes",null,null,{"$f":"SUM(Q17:Q40)","v":0}]
[]
[null,"*Total de Percepciones reportadas por la Entidad Federativa como pagadas al trabajador durante la Licencia."]
[null,"Fuente : Información proporcionada por las Entidades Federativas."]

{"sheet":"B)","index":4,"n_rows":26,"n_cols":19,"rows_kept":26,"cut":false,"hidden":false,"merged":[[12,18,13,18],[12,12,13,12],[12,13,13,13],[12,14,13,14],[12,15,12,16],[12,17,13,17],[9,1,9,10],[12,1,13,1],[12,2,13,2],[12,3,13,3],[12,4,13,4],[12,5,12,11]]}
[]
[]
[]
[]
[]
[]
[]
[]
[null,"Formato: Registro Federal de Contribuyentes de Trabajadores con Pagos Retroactivos con un Periodo Mayor a 45 días"]
[null,{"$f":"IF('1'!D22=\"Elige el Periodo…\",\"\",'1'!D22)","v":"Fondo de Aportaciones para la Educación Tecnológica y de Adultos/Colegio Nacional de Educación Profesional Técnica (FAETA/CONALEP)"},null,null,null,null,null,null,null,null,null,null,null,null,null,null,null,"3er. Trimestre 2019"]
[]
[]
[null,"Entidad Federativa","RFC","CURP","Nombre","Clave Presupuestal",null,null,null,null,null,null,"Clave de Centro de Trabajo","Fecha de emisión de pago","Motivo del Pago Retroactivo","Periodo pagado",null,"Días transcurridos para el pago","Percepciones pagadas en el periodo reportado *"]
[null,null,null,null,null,"Partida Presupuestal","Código de Pago","Clave de Unidad","Clave de Sub Unidad","Clave de Categoría","Horas Semana Mes ","Número de Plaza",null,null,null,"Desde","Hasta"]
[]
[null,"Entidad Federativa","RFC","CURP","Nombre","Partida Presupuestal","Código de Pago","Clave de Unidad","Clave de Sub Unidad","Clave de Categoría","Horas semana mes","Número de plaza","Clave de Centro de Trabajo","Fecha de emisión de pago","Motivo del Pago Retroactivo","Periodo pagado\nDesde","Periodo pagado\nHasta","Días transcurridos para el pago","Percepciones pagadas en el periodo reportado *"]
[]
[]
[]
[]
[null,"Total Personas : ",null,null,null,null,null,null,null,null,"Total Plazas : ",null,null,null,null,"Total Percepciones Pagadas:"]
[]
[]
[]
[null,"*Total de Percepciones reportadas por la Entidad Federativa como pagadas en el periodo "]
[null,"Fuente : Información proporcionada por las Entidades Federativas"]

{"sheet":"II B) Y 1","index":5,"n_rows":871,"n_cols":25,"rows_kept":871,"cut":false,"hidden":false,"merged":[[12,4,14,4],[12,3,14,3],[12,2,14,2],[9,1,9,9],[868,21,868,23],[12,1,14,1],[12,5,14,5],[12,24,14,24],[13,6,13,8],[13,9,13,11],[13,12,13,14],[13,15,13,17],[13,18,13,20],[12,6,12,20],[12,21,14,21],[12,22,14,22],[12,23,14,23]]}
[]
[]
[]
[]
[]
[]
[]
[]
[null,"Formato: Plaza / Función"]
[null,{"$f":"IF('1'!D22=\"Elige el Periodo…\",\"\",'1'!D22)","v":"Fondo de Aportaciones para la Educación Tecnológica y de Adultos/Colegio Nacional de Educación Profesional Técnica (FAETA/CONALEP)"},null,null,null,null,null,null,null,null,null,null,null,null,null,null,null,null,null,null,null,null,null,"3er. Trimestre 2019"]
[]
[]
[null,"Entidad Federativa","RFC","CURP","Nombre","Centros de Trabajo","Plazas por tipo de función",null,null,null,null,null,null,null,null,null,null,null,null,null,null,"Total plazas Jornada","Total \nHSM","Total de Honorarios","Total de recursos presupuestales ejercidos en servicios personales en el periodo\n(2)"]
[null,null,null,null,null,null,"Apoyo a la labor educativa",null,null,"Administrativo y de servicio",null,null,"Docente y Apoyo Técnico Pedagógico",null,null,"Directivos y Supervisión",null,null,"Mandos medios y superiores"]
[null,null,null,null,null,null,"Jornada","HSM","Honorarios","Jornada","HSM","Honorarios","Jornada","HSM","Honorarios","Jornada","HSM","Honorarios","Jornada","HSM","Honorarios"]
[]
[null,"Columna1","Columna2","Columna3","Columna4","Columna5","Columna6","Columna7","Columna8","Columna9","Columna10","Columna11","Columna12","Columna13","Columna14","Columna15","Columna16","Columna17","Columna18","Columna19","Columna20","Columna21","Columna22","Columna23","Columna24"]
[null,"CHIHUAHUA","AEEF700614J96","AEEF700614HCHLNR00","JOSE FRANCISCO ALDERETE ENRIQUEZ","08DPT0001C",null,null,null,1,0,0,null,null,null,null,null,null,null,null,null,1,0,0,140883.18]
[null,"CHIHUAHUA","CACM660522B70","CACM660522HCHNHR08","MARIO RUBEN CANO CHEW","08DPT0001C",null,null,null,1,0,0,null,null,null,null,null,null,null,null,null,1,0,0,84539.39]
[null,"CHIHUAHUA","DIAM641007CI5","DIAM641007HCHZCN00","MANUEL DIAZ ACOSTA","08DPT0001C",null,null,null,1,0,0,null,null,null,null,null,null,null,null,null,1,0,0,48112.11]
[null,"CHIHUAHUA","FEPH590719P2A","FEPH590719MCHRRR08","HORTENSIA FERNANDEZ PARGA","08DPT0001C",null,null,null,1,0,0,null,null,null,null,null,null,null,null,null,1,0,0,39052.019999999997]
[null,"CHIHUAHUA","GADE730513AY2","GADE730513HCHRZL06","ELIAS GARCIA DIAZ","08DPT0001C",null,null,null,1,0,0,null,null,null,null,null,null,null,null,null,1,0,0,48719.92]
[null,"CHIHUAHUA","GAVL610223PN1","GAVL610223MGTRLN08","LEONOR GARZON VALDEZ","08DPT0001C",null,null,null,null,null,null,null,null,null,null,null,null,1,0,0,1,0,0,85992.48]
[null,"CHIHUAHUA","GOBS630720GU7","GOBS630720MCHNLL02","SILVIA CECILIA GONZALEZ BALDERRAMA","08DPT0001C",null,null,null,1,0,0,null,null,null,null,null,null,null,null,null,1,0,0,36782.25]
[null,"CHIHUAHUA","GUSL800307M72","GUSL800307MCHTNL01","LILIANA GUTIERREZ SANDOVAL","08DPT0001C",null,null,null,1,0,0,null,null,null,null,null,null,null,null,null,1,0,0,35814.129999999997]
[null,"CHIHUAHUA","HEFA581028JT6","HEFA581028HSRRLR03","ARISTEO HERNANDEZ FLORES","08DPT0001C",null,null,null,1,0,0,null,null,null,null,null,null,null,null,null,1,0,0,38207.410000000003]
[null,"CHIHUAHUA","HEMM670602FX4","HEMM670602HCHRRL08","MELCHOR HERNANDEZ MORALES","08DPT0001C",null,null,null,1,0,0,null,null,null,null,null,null,null,null,null,1,0,0,135826.29]
[null,"CHIHUAHUA","IAAM650713G14","IAAM650713HCLBRR06","MARTIN GENARO IBARRA ARREDONDO","08DPT0001C",null,null,null,1,0,0,null,null,null,null,null,null,null,null,null,1,0,0,36666.19]
[null,"CHIHUAHUA","JUVD951202BR4","JUVD951202HCHRLN06","DANIEL FRANCISCO JUAREZ VILLALOBOS","08DPT0001C",null,null,null,1,0,0,null,null,null,null,null,null,null,null,null,1,0,0,32508.44]
[null,"CHIHUAHUA","JUGA720809R10","JUGA720809MCHRRL05","ALMA VERONICA JURADO GARCIA","08DPT0001C",null,null,null,1,0,0,null,null,null,null,null,null,null,null,null,1,0,0,30796.37]
[null,"CHIHUAHUA","LOCS740722BY1","LOCS740722MCHYSN03","SANDRA LOYA CASTAÑEDA","08DPT0001C",null,null,null,1,0,0,null,null,null,null,null,null,null,null,null,1,0,0,57813.15]
[null,"CHIHUAHUA","LOLG6105041C1","LOLG610504HCHZPR03","GERARDO LOZANO LOPEZ","08DPT0001C",null,null,null,1,0,0,null,null,null,null,null,null,null,null,null,1,0,0,49282.59]
[null,"CHIHUAHUA","MASS920625T67","MASS920625MCHNTT05","STEPHANIE MANCHA SOTO","08DPT0001C",null,null,null,1,0,0,null,null,null,null,null,null,null,null,null,1,0,0,35775.550000000003]
[null,"CHIHUAHUA","MACN5607036J8","MACN560703MCHRHR01","NORMA MARGARITA MARRUFO CHAPARRO","08DPT0001C",null,null,null,1,0,0,null,null,null,null,null,null,null,null,null,1,0,0,122692.39]
[null,"CHIHUAHUA","MERA640505HY3","MERA640505HCHNYR01","ARMANDO MENDEZ REYES","08DPT0001C",null,null,null,1,0,0,null,null,null,null,null,null,null,null,null,1,0,0,35041.26]
[null,"CHIHUAHUA","MOAP870129UT9","MOAP870129MCHLCT09","PATRICIA ARALI MOLINA ACOSTA","08DPT0001C",null,null,null,1,0,0,null,null,null,null,null,null,null,null,null,1,0,0,79864.08]
[null,"CHIHUAHUA","MOTJ521007RU5","MOTJ521007HCHRRS02","JESUS ALBERTO MORENO TORRES","08DPT0001C",null,null,null,1,0,0,null,null,null,null,null,null,null,null,null,1,0,0,47588.72]
[null,"CHIHUAHUA","NAOG680625QA5","NAOG680625HCHRRL00","GUILLERMO NICOLAS NARVAEZ ORDAZ","08DPT0001C",null,null,null,1,0,0,null,null,null,null,null,null,null,null,null,1,0,0,53553.15]
[null,"CHIHUAHUA","NAWA860622JI6","NAWA860622HCHVGL05","ALEJANDRO MAURICIO NAVARRO WAGNER","08DPT0001C",null,null,null,null,null,null,null,null,null,null,null,null,1,0,0,1,0,0,66459.899999999994]
[null,"CHIHUAHUA","PIRE860510KC2","PIRE860510HCHZBS00","PIZANO RUBIO ESTALI","08DPT0001C",null,null,null,1,0,0,null,null,null,null,null,null,null,null,null,1,0,0,37099.480000000003]
[null,"CHIHUAHUA","PODM630929V60","PODM630929HCHRZG02","MIGUEL PORTILLO DIAZ","08DPT0001C",null,null,null,1,0,0,null,null,null,null,null,null,null,null,null,1,0,0,42931.68]
[null,"CHIHUAHUA","QUHM750313QX2","QUHM750313HZSNZN02","MANUEL QUINTERO HUIZAR","08DPT0001C",null,null,null,1,0,0,null,null,null,null,null,null,null,null,null,1,0,0,31496.51]
[null,"CHIHUAHUA","RAGN6608306N3","RAGN660830MCHMMR01","NORMA RAMIREZ GOMEZ","08DPT0001C",null,null,null,1,0,0,null,null,null,null,null,null,null,null,null,1,0,0,52195.29]
[null,"CHIHUAHUA","REMV840531384","REMV840531HCHYRC03","VICTOR MANUEL REYES MURILLO","08DPT0001C",null,null,null,1,0,0,null,null,null,null,null,null,null,null,null,1,0,0,70830.38]
[null,"CHIHUAHUA","REOS610731NK2","REOS610731MCHZLL01","SILVIA PATRICIA REZA OLIVAS","08DPT0001C",null,null,null,1,0,0,null,null,null,null,null,null,null,null,null,1,0,0,137643.95000000001]
[null,"CHIHUAHUA","ROCG710423BI2","ROCG710423MCHDNL05","GILDA ALEJANDRINA RODRIGUEZ CANO","08DPT0001C",null,null,null,1,0,0,null,null,null,null,null,null,null,null,null,1,0,0,49067.93]
[null,"CHIHUAHUA","ROVB9202105WA","ROVB920210HCHDLR05","BRYAN ARMANDO RODRIGUEZ VALVERDE","08DPT0001C",null,null,null,1,0,0,null,null,null,null,null,null,null,null,null,1,0,0,34551.89]
[null,"CHIHUAHUA","RUDA711227IH4","RUDA711227HCHLLR08","ARTURO RUELAS DELGADO","08DPT0001C",null,null,null,1,0,0,null,null,null,null,null,null,null,null,null,1,0,0,104661.44]
[null,"CHIHUAHUA","SOPF600927M49","SOPF600927MCHTRR08","FERNANDA SOTELO PEREZ","08DPT0001C",null,null,null,1,0,0,null,null,null,null,null,null,null,null,null,1,0,0,40484.410000000003]
[null,"CHIHUAHUA","TOEB620314DK2","TOEB620314HCHRNR09","BERNARDO TORRES ENRIQUEZ","08DPT0001C",null,null,null,1,0,0,null,null,null,null,null,null,null,null,null,1,0,0,43380.25]
[null,"CHIHUAHUA","TOLF901203UG1","TOLF901203HCHRZR07","FRANCISCO JAVIER TORRES LOZOYA","08DPT0001C",null,null,null,1,0,0,null,null,null,null,null,null,null,null,null,1,0,0,25029.93]
[null,"CHIHUAHUA","VAAH770519CJ9","VAAH770519HCHZRC04","HECTOR MANUEL VAZQUEZ ARMENDARIZ","08DPT0001C",null,null,null,1,0,0,null,null,null,null,null,null,null,null,null,1,0,0,41694.71]
[null,"CHIHUAHUA","VIRC720302LS1","VIRC720302MCHLVR06","MARIA CRISTINA VILLAGRAN RIVERA","08DPT0001C",null,null,null,1,0,0,null,null,null,null,null,null,null,null,null,1,0,0,56431.58]
[null,"CHIHUAHUA","VIJD921113BZ7","VIJD921113HCHLRG00","DIEGO EMMANUEL VILLALBA JUAREZ","08DPT0001C",null,null,null,1,0,0,null,null,null,null,null,null,null,null,null,1,0,0,73440.17]
[null,"CHIHUAHUA","AOZL821127LL7","AOZL821127HCHCVS03","ACOSTA ZAVALA LUIS ALBERTO","08DPT0001C",null,null,null,null,null,null,0,120,0,null,null,null,null,null,null,0,120,0,18020.599999999999]
[null,"CHIHUAHUA","AUAJ750122A5A","AUAJ750122HCHGGS03","JESUS AGUILAR AGUILAR","08DPT0001C",null,null,null,null,null,null,0,120,0,null,null,null,null,null,null,0,120,0,19320.599999999999]
[null,"CHIHUAHUA","AULE8612293K4","AULE861229MCHGRL05","ELDA EUNICE AGUIRRE LOERA","08DPT0001C",null,null,null,null,null,null,0,228,0,null,null,null,null,null,null,0,228,0,24935.9]
[null,"CHIHUAHUA","AAMF560125R89","AAMF560125HCHLNL07","FLAVIO RAUL ALVAREZ MONTOYA","08DPT0001C",null,null,null,null,null,null,0,240,0,null,null,null,null,null,null,0,240,0,31354.28]
[null,"CHIHUAHUA","AATL801210PB4","AATL801210MCHLNR06","LOURDES ALVAREZ TINTORI","08DPT0001C",null,null,null,null,null,null,0,216,0,null,null,null,null,null,null,0,216,0,29920.95]
[null,"CHIHUAHUA","AIOM820517TC5","AIOM820517MCHVLR08","MARIANA AVILA OLIVAS","08DPT0001C",null,null,null,null,null,null,0,228,0,null,null,null,null,null,null,0,228,0,34281.089999999997]
[null,"CHIHUAHUA","AAGJ821023VC5","AAGJ821023MCHZZS17","JESSICA CORAL AZAETA GUZMAN","08DPT0001C",null,null,null,null,null,null,0,228,0,null,null,null,null,null,null,0,228,0,26943.51]
[null,"CHIHUAHUA","BAFR630210M78","BAFR630210HCHQRC02","RICARDO BAQUERA FRESCAS","08DPT0001C",null,null,null,null,null,null,0,192,0,null,null,null,null,null,null,0,192,0,24658.59]
[null,"CHIHUAHUA","BAAA801202930","BAAA801202HCHRLL09","ALBERTO GUERRERO BARRAZA ALVAREZ","08DPT0001C",null,null,null,null,null,null,0,240,0,null,null,null,null,null,null,0,240,0,35291.21]
[null,"CHIHUAHUA","BOME911008BP7","BOME911008MCHNRR09","ERIKA CECILIA BONILLA MARILES","08DPT0001C",null,null,null,null,null,null,0,90,0,null,null,null,null,null,null,0,90,0,8842.6299999999992]
[null,"CHIHUAHUA","BURS661015RT6","BURS661015HCHSSL07","SALVADOR BUSTILLOS RASCON","08DPT0001C",null,null,null,null,null,null,0,144,0,null,null,null,null,null,null,0,144,0,19164.73]
[null,"CHIHUAHUA","CAAM640422S63","CAAM640422MSRMRR03","MARTHA LETICIA CAMPOS ARISMEDI","08DPT0001C",null,null,null,null,null,null,0,240,0,null,null,null,null,null,null,0,240,0,33467.360000000001]
[null,"CHIHUAHUA","CARG7105218G9","CARG710521HCHMMR07","GERARDO CAMPOS RAMIREZ","08DPT0001C",null,null,null,null,null,null,0,192,0,null,null,null,null,null,null,0,192,0,29489.9]
[null,"CHIHUAHUA","CASR730827BZ2","CASR730827HCHNTM09","RAMON ARMANDO CANO SOTO","08DPT0001C",null,null,null,null,null,null,0,180,0,null,null,null,null,null,null,0,180,0,26650.46]
[null,"CHIHUAHUA","CABA600225IW2","CABA600225MCHRRR09","ARACELI CARRASCO BARRAZA","08DPT0001C",null,null,null,null,null,null,0,192,0,null,null,null,null,null,null,0,192,0,24966.04]
[null,"CHIHUAHUA","CAON860317HL0","CAON860317MCHRCL00","NALLELY YESENIACARRASCO OCHOA","08DPT0001C",null,null,null,null,null,null,0,108,0,null,null,null,null,null,null,0,108,0,14373.55]
[null,"CHIHUAHUA","CAJM671130A58","CAJM671130HCHRRR04","CARRILLO JUAREZ MAURO GERARDO","08DPT0001C",null,null,null,null,null,null,0,240,0,null,null,null,null,null,null,0,240,0,30376.83]
[null,"CHIHUAHUA","CAAI5611206JA","CAAI561120MCHSRD05","IDELIA CASTRO ARMENDARIZ","08DPT0001C",null,null,null,null,null,null,0,240,0,null,null,null,null,null,null,0,240,0,28940.5]
[null,"CHIHUAHUA","CAFL660707EI1","CAFL660707MCHZLY06","LYDIA CAZARES FLORES","08DPT0001C",null,null,null,null,null,null,0,180,0,null,null,null,null,null,null,0,180,0,20757.650000000001]
[null,"CHIHUAHUA","CEBE680921RL5","CEBE680921HCHNCL06","ELEAZAR MATEO CENICEROS BECERRA","08DPT0001C",null,null,null,null,null,null,0,180,0,null,null,null,null,null,null,0,180,0,26068.98]
[null,"CHIHUAHUA","CEMC581222Q78","CEMC581222MCHRLL09","CLARA CERVANTES MELENDEZ","08DPT0001C",null,null,null,null,null,null,0,192,0,null,null,null,null,null,null,0,192,0,28316.04]
[null,"CHIHUAHUA","CAJF670208887","CAJF670208HCHHRR03","FERNANDO CHACON JURADO","08DPT0001C",null,null,null,null,null,null,0,216,0,null,null,null,null,null,null,0,216,0,32097.09]
[null,"CHIHUAHUA","CAGL640918UT9","CAGL640918MCHHMR07","MARIA DE LOURDES CHAVIRA GOMEZ","08DPT0001C",null,null,null,null,null,null,0,216,0,null,null,null,null,null,null,0,216,0,33270.949999999997]
[null,"CHIHUAHUA","CULT860821MM2","CULT860821MDFDGN17","TANIA CUADROS LUGO","08DPT0001C",null,null,null,null,null,null,0,90,0,null,null,null,null,null,null,0,90,0,8819.6299999999992]
[null,"CHIHUAHUA","DOTM5605051B1","DOTM560505MCHMRR05","MARGARITA DOMINGUEZ TREVIZO","08DPT0001C",null,null,null,null,null,null,0,120,0,null,null,null,null,null,null,0,120,0,19320.599999999999]
[null,"CHIHUAHUA","EARE580710MW7","EARE580710MDFRQL19","ELSA AMALIA ERRAQUIN ROQUE","08DPT0001C",null,null,null,null,null,null,0,120,0,null,null,null,null,null,null,0,120,0,15383.68]
[null,"CHIHUAHUA","EOOC700117F69","EOOC700117HCHSRR08","CARLOS ESCOBEDO ORTEGA","08DPT0001C",null,null,null,null,null,null,0,192,0,null,null,null,null,null,null,0,192,0,25905.25]
[null,"CHIHUAHUA","EACM621211KN0","EACM621211HCHSHR04","JOSE MARTIN ESPARZA CHAVEZ","08DPT0001C",null,null,null,null,null,null,0,228,0,null,null,null,null,null,null,0,228,0,32520.3]
[null,"CHIHUAHUA","EADR661019BU9","EADR661019HCHSZM08","ESPARZA DIAZ RAMON","08DPT0001C",null,null,null,null,null,null,0,120,0,null,null,null,null,null,null,0,120,0,17188.41]
[null,"CHIHUAHUA","EILJ680419MG0","EILJ680419HCHSNR05","JORGE ALBERTO ESPINOZA LUNA","08DPT0001C",null,null,null,null,null,null,0,240,0,null,null,null,null,null,null,0,240,0,31941.21]
[null,"CHIHUAHUA","FECA6103137A4","FECA610313HDFRLB09","ABELARDO FERNANDEZ CALDERON","08DPT0001C",null,null,null,null,null,null,0,216,0,null,null,null,null,null,null,0,216,0,27609.15]
[null,"CHIHUAHUA","FOFL641113DP1","FOFL641113HCHLLS06","LUIS FLORES FLORES","08DPT0001C",null,null,null,null,null,null,0,204,0,null,null,null,null,null,null,0,204,0,32260.82]
[null,"CHIHUAHUA","GAMR760920E78","GAMR760920MCHLNT06","RUTH GALLEGOS MONARCA","08DPT0001C",null,null,null,null,null,null,0,216,0,null,null,null,null,null,null,0,216,0,33270.949999999997]
[null,"CHIHUAHUA","GAVF750826318","GAVF750826HCHLLR05","FRANCISCO AGUSTIN GALLEGOS VILLASEÑOR","08DPT0001C",null,null,null,null,null,null,0,144,0,null,null,null,null,null,null,0,144,0,21864.73]
[null,"CHIHUAHUA","GALR830327972","GALR830327MCHRYS00","ROSA HERLINDA GARCIA LOYA","08DPT0001C",null,null,null,null,null,null,0,240,0,null,null,null,null,null,null,0,240,0,28026.18]
[null,"CHIHUAHUA","GALJ810323DN3","GALJ810323HCHRZS03","JESUS SAUL GARCIA LOZANO","08DPT0001C",null,null,null,null,null,null,0,240,0,null,null,null,null,null,null,0,240,0,34054.28]
[null,"CHIHUAHUA","GAMG821026JM8","GAMG821026HDGRRB08","GABINO GARCIA MARRUFO","08DPT0001C",null,null,null,null,null,null,0,204,0,null,null,null,null,null,null,0,204,0,35291.21]
[null,"CHIHUAHUA","GAOM870316CN9","GAOM870316HCHRRG00","JOSE MIGUEL GARCIA ORTIZ","08DPT0001C",null,null,null,null,null,null,0,240,0,null,null,null,null,null,null,0,240,0,35291.22]
[null,"CHIHUAHUA","GAVV7810103W7","GAVV781010MCHRSR04","VERONICA GARDEA VASQUEZ","08DPT0001C",null,null,null,null,null,null,0,192,0,null,null,null,null,null,null,0,192,0,30076.83]
[null,"CHIHUAHUA","GOAC860518J59","GOAC860518HCHMVR06","CARLOS JOEL GOMEZ AVILA","08DPT0001C",null,null,null,null,null,null,0,180,0,null,null,null,null,null,null,0,180,0,29003.63]
[null,"CHIHUAHUA","GOHS731228LU7","GOHS731228HCHNLM00","SIMON GONZALEZ HOLGUIN","08DPT0001C",null,null,null,null,null,null,0,156,0,null,null,null,null,null,null,0,156,0,19784.77]
[null,"CHIHUAHUA","HEAM7409112X6","HEAM740911MCHRRR00","MARCELA HERNANDEZ ARMENDARIZ","08DPT0001C",null,null,null,null,null,null,0,240,0,null,null,null,null,null,null,0,240,0,33530.43]
[null,"CHIHUAHUA","HERA781214D5A","HERA781214HCHRMR02","AARON TERCERO HERNANDEZ ROMO","08DPT0001C",null,null,null,null,null,null,0,216,0,null,null,null,null,null,null,0,216,0,32097.09]
[null,"CHIHUAHUA","HESM4812063X7","HESM481206HDFRGR09","MARIO HERNANDEZ SEGURA","08DPT0001C",null,null,null,null,null,null,0,240,0,null,null,null,null,null,null,0,240,0,35941.21]
[null,"CHIHUAHUA","HEMB811018BN2","HEMB811018MCHRNT06","BEATRIZ ELENA HERRERA MENDOZA","08DPT0001C",null,null,null,null,null,null,0,216,0,null,null,null,null,null,null,0,216,0,30336.3]
[null,"CHIHUAHUA","JIVG670122BN0","JIVG670122HVZMLD07","GAUDENCIO JIMENEZ VALENTIN","08DPT0001C",null,null,null,null,null,null,0,216,0,null,null,null,null,null,null,0,216,0,29686.3]
[null,"CHIHUAHUA","LESO760401T71","LESO760401HCHLXM07","OMAR LEAL SEAÑEZ","08DPT0001C",null,null,null,null,null,null,0,120,0,null,null,null,null,null,null,0,120,0,18083.68]
[null,"CHIHUAHUA","LOGM811218IW7","LOGM811218MCHRNY01","MYRNA GUADALUPE LOERA GONZALEZ","08DPT0001C",null,null,null,null,null,null,0,228,0,null,null,null,null,null,null,0,228,0,30151.57]
[null,"CHIHUAHUA","LOMM630709QH3","LOMM630709MCHPRR06","MIRIAM CAROLINA LOPEZ MARQUEZ","08DPT0001C",null,null,null,null,null,null,0,192,0,null,null,null,null,null,null,0,192,0,27142.18]
[null,"CHIHUAHUA","LOCJ610711AFA","LOCJ610711HCHYHV06","JAVIER BENJAMIN LOYA CHAVIRA","08DPT0001C",null,null,null,null,null,null,0,228,0,null,null,null,null,null,null,0,228,0,30931.09]
[null,"CHIHUAHUA","LOHL711219AQ3","LOHL711219MCHYRL02","LILIANA IVONNE LOYA HERNANDEZ","08DPT0001C",null,null,null,null,null,null,0,180,0,null,null,null,null,null,null,0,180,0,27305.91]
[null,"CHIHUAHUA","LORJ800906MC9","LORJ800906HCHYDS03","JESUS ARTURO LOYA RODRIGUEZ","08DPT0001C",null,null,null,null,null,null,0,180,0,null,null,null,null,null,null,0,180,0,11577.64]
[null,"CHIHUAHUA","MAGP631129C83","MAGP631129HCHRNR03","PERFECTO MARQUEZ GONZALEZ","08DPT0001C",null,null,null,null,null,null,0,240,0,null,null,null,null,null,null,0,240,0,29359.7]
[null,"CHIHUAHUA","MACC861013NB9","MACC861013HCHRLR03","CARLOS ISAAC MARRUFO CALDERON","08DPT0001C",null,null,null,null,null,null,0,180,0,null,null,null,null,null,null,0,180,0,26655.91]
[null,"CHIHUAHUA","MEPP891226PB1","MEPP891226MCHNZT02","PATSY MENDEZ PAZ","08DPT0001C",null,null,null,null,null,null,0,180,0,null,null,null,null,null,null,0,180,0,14481.6]
[null,"CHIHUAHUA","MEMM770410518","MEMM770410HCHRNN08","MANUEL MERAZ MENDEZ","08DPT0001C",null,null,null,null,null,null,0,168,0,null,null,null,null,null,null,0,168,0,26295.78]
[null,"CHIHUAHUA","MURE810806BI4","MURE810806HCHXJM08","EMMANUEL MUÑOZ ROJAS","08DPT0001C",null,null,null,null,null,null,0,240,0,null,null,null,null,null,null,0,240,0,34641.21]
[null,"CHIHUAHUA","NAME521010PW5","NAME521010HCHVNN03","ENRIQUE NAVARRO MENDOZA","08DPT0001C",null,null,null,null,null,null,0,240,0,null,null,null,null,null,null,0,240,0,33991.21]
[null,"CHIHUAHUA","OIAO791026IM2","OIAO791026HCHLPS00","OSCAR ERNESTO OLIVAS APONTE","08DPT0001C",null,null,null,null,null,null,0,120,0,null,null,null,null,null,null,0,120,0,18670.599999999999]
[null,"CHIHUAHUA","OILR550330775","OILR550330HCHLPG01","ROGELIO ANASTACIO OLIVAS LOPEZ","08DPT0001C",null,null,null,null,null,null,0,216,0,null,null,null,null,null,null,0,216,0,4398.3]
[null,"CHIHUAHUA","OEZH720627D54","OEZH720627HCHRBG04","HUGO SOCORRO ORTEGA ZUBIATE","08DPT0001C",null,null,null,null,null,null,0,180,0,null,null,null,null,null,null,0,180,0,23955.91]
[null,"CHIHUAHUA","PARM520707MY1","PARM520707HPLLCG03","MIGUEL ANGEL PALMA ROCHA","08DPT0001C",null,null,null,null,null,null,0,96,0,null,null,null,null,null,null,0,96,0,11900.96]
[null,"CHIHUAHUA","PAGM7008098P1","PAGM700809HCHRRR01","MAURO RUBEN PARADA GRANADOS","08DPT0001C",null,null,null,null,null,null,0,96,0,null,null,null,null,null,null,0,96,0,12776.48]
[null,"CHIHUAHUA","PARF590815ED3","PARF590815MVZVSL20","FELICITAS PAVON ROSAS","08DPT0001C",null,null,null,null,null,null,0,240,0,null,null,null,null,null,null,0,240,0,27834.03]
[null,"CHIHUAHUA","PAVE830228SH0","PAVE830228HCHZLN00","ENRIQUE PAZOS VALLES","08DPT0001C",null,null,null,null,null,null,0,240,0,null,null,null,null,null,null,0,240,0,27168.28]
[null,"CHIHUAHUA","PECA750727I8A","PECA750727HJCRRL03","JOSE ALEJANDRO PEREZ CORTES","08DPT0001C",null,null,null,null,null,null,0,168,0,null,null,null,null,null,null,0,168,0,21900.45]
[null,"CHIHUAHUA","PICN620328PA0","PICN620328HVZNRR07","JOSE NORBERTO PINEDA CRUZ","08DPT0001C",null,null,null,null,null,null,0,144,0,null,null,null,null,null,null,0,144,0,19164.73]
[null,"CHIHUAHUA","PIRL7804262E7","PIRL780426MCHXZZ09","MARIA LIZETH PIÑON RUIZ","08DPT0001C",null,null,null,null,null,null,0,216,0,null,null,null,null,null,null,0,216,0,33270.949999999997]
[null,"CHIHUAHUA","QURM640822CE7","QURM640822MCHNZR02","MARTINA LILIA QUINTANA RUIZ","08DPT0001C",null,null,null,null,null,null,0,240,0,null,null,null,null,null,null,0,240,0,35291.21]
[null,"CHIHUAHUA","RAGG600206G85","RAGG600206MCHMTR04","GRACIELA IMELDA RAMIREZ GUTIERREZ","08DPT0001C",null,null,null,null,null,null,0,180,0,null,null,null,null,null,null,0,180,0,23368.98]
[null,"CHIHUAHUA","RAMA741011N9A","RAMA741011MCHMRN00","ANABEL RAMOS MORALES","08DPT0001C",null,null,null,null,null,null,0,216,0,null,null,null,null,null,null,0,216,0,32620.95]
[null,"CHIHUAHUA","RARN711008BK5","RARN711008MCHSMR09","NORMA PATRICIA RASCON RAMIREZ","08DPT0001C",null,null,null,null,null,null,0,180,0,null,null,null,null,null,null,0,180,0,26592.84]
[null,"CHIHUAHUA","RECN560808KM6","RECN560808MCHYRR00","MARIA NORMA REYES CARREON","08DPT0001C",null,null,null,null,null,null,0,192,0,null,null,null,null,null,null,0,192,0,28776.83]
[null,"CHIHUAHUA","REOL730620M72","REOL730620MCHYRC05","LUCIA REYES ORTIZ","08DPT0001C",null,null,null,null,null,null,0,204,0,null,null,null,null,null,null,0,204,0,32260.82]
[null,"CHIHUAHUA","RIMI820220GQ7","RIMI820220HCHVCV02","IVAN JOEL RIVERA MACIAS","08DPT0001C",null,null,null,null,null,null,0,180,0,null,null,null,null,null,null,0,180,0,24958.2]
[null,"CHIHUAHUA","ROSL660422DP2","ROSL660422HCHDLZ09","MARIA DE LA LUZ RODARTE SOLIS","08DPT0001C",null,null,null,null,null,null,0,204,0,null,null,null,null,null,null,0,204,0,30499.72]
[null,"CHIHUAHUA","ROAA871025FU9","ROAA871025HCHDGL07","ALBERTO RODRIGUEZ AGUIRRE","08DPT0001C",null,null,null,null,null,null,0,216,0,null,null,null,null,null,null,0,216,0,23383.47]
[null,"CHIHUAHUA","ROGJ6301201E0","ROGJ630120MCHDZS08","MA DE JESUS RODRIGUEZ GUZMAN","08DPT0001C",null,null,null,null,null,null,0,192,0,null,null,null,null,null,null,0,192,0,28902.97]
[null,"CHIHUAHUA","ROAL730412EQ6","ROAL730412HCHJRS01","LUIS JAVIER ROJAS ARAGONEZ","08DPT0001C",null,null,null,null,null,null,0,192,0,null,null,null,null,null,null,0,192,0,29426.83]
[null,"CHIHUAHUA","ROPV750812QL5","ROPV750812HCHMCC00","VICTOR MANUEL ROMERO PACHECO","08DPT0001C",null,null,null,null,null,null,0,132,0,null,null,null,null,null,null,0,132,0,18430.84]
[null,"CHIHUAHUA","ROTO850629550","ROTO850629HCHNRS06","OSCAR ARMANDO RONQUILLO TERAN ","08DPT0001C",null,null,null,null,null,null,0,180,0,null,null,null,null,null,null,0,180,0,22075.63]
[null,"CHIHUAHUA","ROVI820310797","ROVI820310HCLNLV07","IVAN RAMON RONQUILLO VILLALBA","08DPT0001C",null,null,null,null,null,null,0,204,0,null,null,null,null,null,null,0,204,0,29263.11]
[null,"CHIHUAHUA","RUNH860818SE6","RUNH860818HCHBJM07","HUMERTO ALONSO RUBIO NAJERA","08DPT0001C",null,null,null,null,null,null,0,120,0,null,null,null,null,null,null,0,120,0,15013.71]
[null,"CHIHUAHUA","RUMS740226UR4","RUMS740226MCHZRL09","MARIA SOLEDAD RUIZ MARQUEZ","08DPT0001C",null,null,null,null,null,null,0,240,0,null,null,null,null,null,null,0,240,0,32356.57]
[null,"CHIHUAHUA","SAQG720512BW2","SAQG720512MCHNXD07","MARIA GUADALUPE SAENZ QUIÑONEZ","08DPT0001C",null,null,null,null,null,null,0,240,0,null,null,null,null,null,null,0,240,0,34704.28]
[null,"CHIHUAHUA","SIML5803182A8","SIML580318HCHLJS14","JOSE LUIS CARLOS SILVEYRA MEJIA","08DPT0001C",null,null,null,null,null,null,0,240,0,null,null,null,null,null,null,0,240,0,30767.360000000001]
[null,"CHIHUAHUA","TAAD800122GU1","TAAD800122HCHRRL07","DELFINO TARIN ARMENDARIZ","08DPT0001C",null,null,null,null,null,null,0,216,0,null,null,null,null,null,null,0,216,0,31510.16]
[null,"CHIHUAHUA","UIOM910617AH6","UIOM910617MCHRRR00","MARIBEL URIZA ORTIZ","08DPT0001C",null,null,null,null,null,null,0,216,0,null,null,null,null,null,null,0,216,0,27609.15]
[null,"CHIHUAHUA","VACA610212RT2","VXCA610212HCHLHD03","ADOLFO VALLES CHAVEZ","08DPT0001C",null,null,null,null,null,null,0,168,0,null,null,null,null,null,null,0,168,0,27469.63]
[null,"CHIHUAHUA","VADS631230CN3","VADS631230MCHLVL06","SILVIA LETICIA VALVERDE DAVILA","08DPT0001C",null,null,null,null,null,null,0,240,0,null,null,null,null,null,null,0,240,0,35291.21]
[null,"CHIHUAHUA","VIRR710926945","VIRR710926HCHLDB12","RUBEN VILLALOBOS RODRIGUEZ","08DPT0001C",null,null,null,null,null,null,0,240,0,null,null,null,null,null,null,0,240,0,31941.21]
[null,"CHIHUAHUA","VIPR570927K44","VIPR570927HCHLYF07","RAFAEL JESUS VILLEGAS PAYAN","08DPT0001C",null,null,null,null,null,null,0,240,0,null,null,null,null,null,null,0,240,0,34641.21]
[null,"CHIHUAHUA","AUSL630319SG0","AUSL630319HZSGFC09","JOSE LUCIANO AGUILERA SIFUENTES","08DPT0002B",null,null,null,1,0,0,null,null,null,null,null,null,null,null,null,1,0,0,147243.59000000003]
[null,"CHIHUAHUA","AAAJ9101208M3","AAAJ910120HCHLCS03","JESUS FABIAN ALVARADO  ACOSTA","08DPT0002B",null,null,null,1,0,0,null,null,null,null,null,null,null,null,null,1,0,0,45940.58]
[null,"CHIHUAHUA","AAAN671110TZ0","AAAN671110MCHLCC06","NICOLASA ALVARADO  ACOSTA","08DPT0002B",null,null,null,1,0,0,null,null,null,null,null,null,null,null,null,1,0,0,127989.61000000002]
[null,"CHIHUAHUA","AAEM620508I55","AAEM620508HCLLSG04","MIGUEL ANGEL ALVARADO  ESPARZA","08DPT0002B",null,null,null,1,0,0,null,null,null,null,null,null,null,null,null,1,0,0,49170.619999999995]
[null,"CHIHUAHUA","AISJ790419494","AISJ790419HCHRTN04","JUAN MANUEL ARIAS  SOTELO","08DPT0002B",null,null,null,1,0,0,null,null,null,null,null,null,null,null,null,1,0,0,94958.5]
[null,"CHIHUAHUA","AIBC800120C20","AIBC800120HCHVLS02","CESAR NOE AVILA BOLIVAR","08DPT0002B",null,null,null,1,0,0,null,null,null,null,null,null,null,null,null,1,0,0,47097.357999999993]
[null,"CHIHUAHUA","BAML650601B92","BAML650601HDFRLS03","JOSE LUIS  BARRIENTOS MILAN","08DPT0002B",null,null,null,1,0,0,null,null,null,null,null,null,null,null,null,1,0,0,44175.34]
[null,"CHIHUAHUA","BOMA6710214E1","BOMA671021HDFLXR07","ARMANDO BOLAÑOS MUÑOZ","08DPT0002B",null,null,null,1,0,0,null,null,null,null,null,null,null,null,null,1,0,0,116891.06]
[null,"CHIHUAHUA","CAPL820818LQ5","CAPL820818HCHMRS04","LUIS ROBERTO CAMPOS PORTILLO","08DPT0002B",null,null,null,1,0,0,null,null,null,null,null,null,null,null,null,1,0,0,46660.19]
[null,"CHIHUAHUA","CACL731031A17","CACL731031MCHRNR01","LORENA CARRILLO CANO","08DPT0002B",null,null,null,1,0,0,null,null,null,null,null,null,null,null,null,1,0,0,41582.289999999994]
[null,"CHIHUAHUA","CARJ6012178GA","CARJ601217HCHRLS07","JOSE DE JESUS CARRILLO RUELAS","08DPT0002B",null,null,null,1,0,0,null,null,null,null,null,null,null,null,null,1,0,0,64391.719999999994]
[null,"CHIHUAHUA","CARP8408274S7","CARP840827MCHHCR02","PERLA CHAVEZ ROCHA","08DPT0002B",null,null,null,1,0,0,null,null,null,null,null,null,null,null,null,1,0,0,109198.65333333335]
[null,"CHIHUAHUA","CIBA710920FVA","CIBA710920MDGTRL04","ALMA ROSA CITAL BERTAHUD","08DPT0002B",null,null,null,1,0,0,null,null,null,null,null,null,null,null,null,1,0,0,136446.96000000002]
[null,"CHIHUAHUA","COMA6908143J5","COXM690814HCHNXR11","MARIO CONTRERAS N/A","08DPT0002B",null,null,null,1,0,0,null,null,null,null,null,null,null,null,null,1,0,0,66426.86]
[null,"CHIHUAHUA","COCR830702UW4","COCR830702HVZRDB00","RUBEN OMAR CORTEZ CADENA","08DPT0002B",null,null,null,1,0,0,null,null,null,null,null,null,null,null,null,1,0,0,26612.98]
[null,"CHIHUAHUA","DEMA661118M56","DEMA661118HCHLRB07","JOSE ABELARDO DELGADO  MORALES","08DPT0002B",null,null,null,1,0,0,null,null,null,null,null,null,null,null,null,1,0,0,109828.02000000002]
[null,"CHIHUAHUA","EAGK7806257R9","EAGK780625MCHSBR04","KARLA ESPARZA GABALDON","08DPT0002B",null,null,null,1,0,0,null,null,null,null,null,null,null,null,null,1,0,0,112718.48000000001]
[null,"CHIHUAHUA","FACF8611101I7","FACF861110HCHVNR02","FERNANDO FAVELA  CONTRERAS","08DPT0002B",null,null,null,1,0,0,null,null,null,null,null,null,null,null,null,1,0,0,48245.146666666667]
[null,"CHIHUAHUA","FIGS610608SA8","FIGS610608MJCGNL02","SILVIA FIGUEROA GONZALEZ","08DPT0002B",null,null,null,1,0,0,null,null,null,null,null,null,null,null,null,1,0,0,103689.28]
[null,"CHIHUAHUA","GAMA6609167M4","GAXM660916MCHLXR06","MARIBEL GALLARDO N/A","08DPT0002B",null,null,null,1,0,0,null,null,null,null,null,null,null,null,null,1,0,0,55815.093999999997]
[null,"CHIHUAHUA","GAAD780823AVA","GAAD780823MCHRLL01","DULCE AURORA DEL CONSUELO GARCIA ALEMAN","08DPT0002B",null,null,null,1,0,0,null,null,null,null,null,null,null,null,null,1,0,0,75125.927333333326]
[null,"CHIHUAHUA","GALE580105G5A","GALE580105HCHRNN03","ENRIQUE GARCIA DE LUNA","08DPT0002B",null,null,null,1,0,0,null,null,null,null,null,null,null,null,null,1,0,0,50014.17]
[null,"CHIHUAHUA","LAGP591112155","LAGP591112HCHRYD07","PEDRO LARES GAYTAN","08DPT0002B",null,null,null,1,0,0,null,null,null,null,null,null,null,null,null,1,0,0,49758.87]
[null,"CHIHUAHUA","LIHJ9107073M0","LIHJ910707HCHRRS09","JASSON RAYMUNDO LIRA HERRERA","08DPT0002B",null,null,null,1,0,0,null,null,null,null,null,null,null,null,null,1,0,0,19711.14]
[null,"CHIHUAHUA","LOCJ6307091T8","LOCJ630709HCHPRS08","JESUS MARTIN LOPEZ CARO","08DPT0002B",null,null,null,1,0,0,null,null,null,null,null,null,null,null,null,1,0,0,141788.13549333334]
[null,"CHIHUAHUA","LORE9304089K5","LORE930408HCHYSR01","EARVIN MANUEL LOYA  RIOS","08DPT0002B",null,null,null,1,0,0,null,null,null,null,null,null,null,null,null,1,0,0,39903.57]
[null,"CHIHUAHUA","LOCJ681030V96","LOCJ681030HCHZLS07","JESUS EDUARDO LOZOYA  CALDERON","08DPT0002B",null,null,null,1,0,0,null,null,null,null,null,null,null,null,null,1,0,0,54620.14]
[null,"CHIHUAHUA","MALL890207EW5","MALL890207MVZRRY06","LEIDY YAZMIN MARTINEZ LORENZO","08DPT0002B",null,null,null,1,0,0,null,null,null,null,null,null,null,null,null,1,0,0,30182.82]
[null,"CHIHUAHUA","MOMN850815I1A","MOMN850815HCLNRX07","NOE MONSIVAIS MARIN","08DPT0002B",null,null,null,1,0,0,null,null,null,null,null,null,null,null,null,1,0,0,13098.810000000001]
[null,"CHIHUAHUA","MODC711228F67","MODC711228HCLNRR07","CARLOS EDUARDO MONTANO DURAN","08DPT0002B",null,null,null,null,null,null,null,null,null,null,null,null,1,0,0,1,0,0,100611.18]
[null,"CHIHUAHUA","MOSG761016858","MOSG761016HCLNNR06","GERARDO MONTOYA SANCHEZ","08DPT0002B",null,null,null,1,0,0,null,null,null,null,null,null,null,null,null,1,0,0,46762.21]
[null,"CHIHUAHUA","OOGL660522NA4","OOGL660522HCHCRS08","LUIS FELIX OCHOA GARCIA","08DPT0002B",null,null,null,1,0,0,null,null,null,null,null,null,null,null,null,1,0,0,68757.179999999993]
[null,"CHIHUAHUA","OORE7405071DA","OORE740507MCHRYS00","MARIA ESTHER OROZCO REYES","08DPT0002B",null,null,null,1,0,0,null,null,null,null,null,null,null,null,null,1,0,0,55415.344000000005]
[null,"CHIHUAHUA","RARF8407015TA","RARF840701MCHMML00","FLOR MINERVA RAMIREZ RAMIREZ","08DPT0002B",null,null,null,1,0,0,null,null,null,null,null,null,null,null,null,1,0,0,56414.184000000001]
[null,"CHIHUAHUA","ROGJ6511161S5","ROGJ651116HDGCRN00","JUAN JESUS ROCHA GARCIA","08DPT0002B",null,null,null,1,0,0,null,null,null,null,null,null,null,null,null,1,0,0,50307.02]
[null,"CHIHUAHUA","ROGM631230AD4","ROGM631230MCHMRR18","MARCIA IMELDA ROMERO GARCIA","08DPT0002B",null,null,null,1,0,0,null,null,null,null,null,null,null,null,null,1,0,0,65776.679999999993]
[null,"CHIHUAHUA","SAPP7109042V0","SAPP710904HCHLLD06","PEDRO SALAS PALOMINO","08DPT0002B",null,null,null,1,0,0,null,null,null,null,null,null,null,null,null,1,0,0,109874.20000000001]
[null,"CHIHUAHUA","TULO5510064A6","TULO551006MCHDYL01","OLGA ESPERANZA TUDA LEYVA","08DPT0002B",null,null,null,1,0,0,null,null,null,null,null,null,null,null,null,1,0,0,98421.68]
[null,"CHIHUAHUA","VASC8109266G6","VASC810926MCHLLL08","CLAUDIA VALVERDE SALAZAR","08DPT0002B",null,null,null,1,0,0,null,null,null,null,null,null,null,null,null,1,0,0,53565.2]
[null,"CHIHUAHUA","VAFM681203S84","VAFM681203MCHZGR05","MARICRUZ VAZQUEZ FIGUEROA","08DPT0002B",null,null,null,1,0,0,null,null,null,null,null,null,null,null,null,1,0,0,102919.30486666667]
[null,"CHIHUAHUA","AARL701222GC6","AARL701222MCHRVB04","LIBIA GABRIELA ARAGON RIVERA","08DPT0002B",null,null,null,null,null,null,0,240,0,null,null,null,null,null,null,0,240,0,41340.78]
[null,"CHIHUAHUA","BAGR640911VB4","BAGR640911HCHRND09","RODOLFO ELI BARONA GONZALEZ","08DPT0002B",null,null,null,null,null,null,0,160,0,null,null,null,null,null,null,0,160,0,24153.170000000006]
[null,"CHIHUAHUA","BOAI840527A86","BOAI840527MCHRGN00","MARIA INES BORUNDA AGUILAR","08DPT0002B",null,null,null,null,null,null,0,240,0,null,null,null,null,null,null,0,240,0,38640.78]
[null,"CHIHUAHUA","CACS480226NE5","CACS480226HGTMPL06","SALVADOR CAMPOS CAPETILLO","08DPT0002B",null,null,null,null,null,null,0,232,0,null,null,null,null,null,null,0,232,0,39270.71]
[null,"CHIHUAHUA","CAPH630209KZ0","CAPH630209MCHRSL06","HILDA MARGARITA CARRASCO POSADA","08DPT0002B",null,null,null,null,null,null,0,120,0,null,null,null,null,null,null,0,120,0,22020.39]
[null,"CHIHUAHUA","COCD901004DB8","COCD901004MCHRHN09","DAINA ROCIO CORTES CHAVEZ","08DPT0002B",null,null,null,null,null,null,0,232,0,null,null,null,null,null,null,0,232,0,35700.82]
[null,"CHIHUAHUA","EABM680229EQ9","EABM680229MCHSDR08","MARTHA GUADALUPE ESCALANTE BADILLO","08DPT0002B",null,null,null,null,null,null,0,224,0,null,null,null,null,null,null,0,224,0,35998.700000000004]
[null,"CHIHUAHUA","EOHA790831RH0","EOHA790831MZSSRN01","MARIA DE LOS ANGELES ESCOBAR DE HARO","08DPT0002B",null,null,null,null,null,null,0,232,0,null,null,null,null,null,null,0,232,0,40768.770000000004]
[null,"CHIHUAHUA","EAML780807EM2","EAML780807MCHSRR05","LORENA ESTRADA MURILLO","08DPT0002B",null,null,null,null,null,null,0,144,0,null,null,null,null,null,null,0,144,0,21996.140000000003]
[null,"CHIHUAHUA","FAMA641105R5A","FAMA641105MCHVRL07","ALMA ISABEL FAVELA MARTINEZ","08DPT0002B",null,null,null,null,null,null,0,232,0,null,null,null,null,null,null,0,232,0,40570.71]
[null,"CHIHUAHUA","FOLS800726I38","FOLS800726MCHLCN07","SANDYANA FLORES LUCERO","08DPT0002B",null,null,null,null,null,null,0,240,0,null,null,null,null,null,null,0,240,0,41990.78]
[null,"CHIHUAHUA","FONE671109ME3","FONE671109MCHLVS06","ESPERANZA FLORES NAVARRO","08DPT0002B",null,null,null,null,null,null,0,232,0,null,null,null,null,null,null,0,232,0,41220.71]
[null,"CHIHUAHUA","GAGC810607AX3","GAGC810607MCHRRH07","CHRISTIAN BELEN GARCIA GARCIA","08DPT0002B",null,null,null,null,null,null,0,232,0,null,null,null,null,null,null,0,232,0,40118.770000000004]
[null,"CHIHUAHUA","GALJ860302G54","GALJ860302HGTRNV04","JAVIER GARCIA LUNA","08DPT0002B",null,null,null,null,null,null,0,240,0,null,null,null,null,null,null,0,240,0,40690.78]
[null,"CHIHUAHUA","GOLC890608AQ0","GOLC890608MCHMRY05","CYNTHIA LILIANA GOMEZ LARA","08DPT0002B",null,null,null,null,null,null,0,232,0,null,null,null,null,null,null,0,232,0,32126.364000000001]
[null,"CHIHUAHUA","GOAJ891103DFA","GOAJ891103HCHNLR08","JORGE OMAR GONZALEZ ALVIDREZ","08DPT0002B",null,null,null,null,null,null,0,204,0,null,null,null,null,null,null,0,204,0,27958.720000000001]
[null,"CHIHUAHUA","GOCY840110NQ4","GOCY840110MCHNLS07","YSELA GONZALEZ CALDERA","08DPT0002B",null,null,null,null,null,null,0,232,0,null,null,null,null,null,null,0,232,0,40730.71]
[null,"CHIHUAHUA","GOMA851115JC8","GOMA851115HCHNRR07","AARON ROBERTO GONZALEZ MORAN","08DPT0002B",null,null,null,null,null,null,0,228,0,null,null,null,null,null,null,0,228,0,38560.68]
[null,"CHIHUAHUA","GOPS780818LH4","GOPS780818HCHNRR01","SERGIO GONZALEZ PEREZ","08DPT0002B",null,null,null,null,null,null,0,232,0,null,null,null,null,null,null,0,232,0,40768.770000000004]
[null,"CHIHUAHUA","GOCE790701I32","GOXC790701MCHNXL06","CELIA BRISA GONZALEZ ","08DPT0002B",null,null,null,null,null,null,0,224,0,null,null,null,null,null,null,0,224,0,39348.700000000004]
[null,"CHIHUAHUA","GUFD63111111A","GUFD631111MSLVRN17","DINA YESENIA GUEVARA FIERRO","08DPT0002B",null,null,null,null,null,null,0,240,0,null,null,null,null,null,null,0,240,0,41340.78]
[null,"CHIHUAHUA","HEDC640302NR2","HEDC640302HZSRZR01","CARLOS HERNANDEZ DIAZ","08DPT0002B",null,null,null,null,null,null,0,232,0,null,null,null,null,null,null,0,232,0,40118.770000000004]
[null,"CHIHUAHUA","IARL8304031L7","IARL830403HZSBMS09","LUIS ROMAN IBARRA  RAMOS","08DPT0002B",null,null,null,null,null,null,0,240,0,null,null,null,null,null,null,0,240,0,41340.78]
[null,"CHIHUAHUA","JAAZ890626IJ1","JAAZ890626MCHSVM08","ZIMRI DANIEL JASSO AVILA","08DPT0002B",null,null,null,null,null,null,0,228,0,null,null,null,null,null,null,0,228,0,34765.870000000003]
[null,"CHIHUAHUA","LAOE880302RW2","LAOE880302MCHZRL08","ELIZA ARELY LAZALDE ORTIZ","08DPT0002B",null,null,null,null,null,null,0,220,0,null,null,null,null,null,null,0,220,0,34193.730000000003]
[null,"CHIHUAHUA","LEGF590530LW9","LEGF590530HCHNTR00","FERNANDO LEON GUTIERREZ","08DPT0002B",null,null,null,null,null,null,0,224,0,null,null,null,null,null,null,0,224,0,37596.759999999995]
[null,"CHIHUAHUA","LOCA790201FP3","LXCA790201HCHRSD09","ADRIAN FRANCISCO LOERA  CASTRO","08DPT0002B",null,null,null,null,null,null,0,232,0,null,null,null,null,null,null,0,232,0,41418.770000000004]
[null,"CHIHUAHUA","LORF830406762","LORF830406HCHPML02","FELIPE LOPEZ RAMIREZ","08DPT0002B",null,null,null,null,null,null,0,232,0,null,null,null,null,null,null,0,232,0,32350.82]
[null,"CHIHUAHUA","LURG880415UKA","LURG880415MCHNVB04","GABRIELA ALEJANDRA LUNA  RIVAS","08DPT0002B",null,null,null,null,null,null,0,216,0,null,null,null,null,null,null,0,216,0,38126.699999999997]
[null,"CHIHUAHUA","LURY8009223V9","LURY800922MSPNBJ02","YAJAIRA ALEJANDRA LUNA ROBLEDO","08DPT0002B",null,null,null,null,null,null,0,72,0,null,null,null,null,null,null,0,72,0,9006.27]
[null,"CHIHUAHUA","MARJ6706253G1","MARJ670625HCHRSN08","JUAN FRANCISCO MARQUEZ DE LA ROSA","08DPT0002B",null,null,null,null,null,null,0,240,0,null,null,null,null,null,null,0,240,0,35635.089999999997]
[null,"CHIHUAHUA","MAHR7303052U1","MAHR730305HCHRRG05","RIGOBERTO MARTINEZ HERNANDEZ","08DPT0002B",null,null,null,null,null,null,0,224,0,null,null,null,null,null,null,0,224,0,39546.759999999995]
[null,"CHIHUAHUA","MARE920423KX8","MARE920423MCHRNR05","ERIKA ELIZABETH MARTINEZ RANGEL","08DPT0002B",null,null,null,null,null,null,0,216,0,null,null,null,null,null,null,0,216,0,32926.58]
[null,"CHIHUAHUA","MAER7001128F3","MAER700112MCHTSQ04","RAQUEL  MATA ESPARZA","08DPT0002B",null,null,null,null,null,null,0,240,0,null,null,null,null,null,null,0,240,0,41990.78]
[null,"CHIHUAHUA","MAMJ7909266H9","MAMJ790926HNLTDV08","JAVIER MATA MEDINA","08DPT0002B",null,null,null,null,null,null,0,152,0,null,null,null,null,null,null,0,152,0,17855.66]
[null,"CHIHUAHUA","MEMA740518TM8","MEMA740518HCHLLL03","ALFONSO NATANAEL MELENDEZ MELENDEZ","08DPT0002B",null,null,null,null,null,null,0,236,0,null,null,null,null,null,null,0,236,0,40630.740000000005]
[null,"CHIHUAHUA","MEPF691219UT3","MEPF691219HCHLRR06","FRANCISCO JAVIER MELENDEZ PEREYRA","08DPT0002B",null,null,null,null,null,null,0,204,0,null,null,null,null,null,null,0,204,0,35996.599999999991]
[null,"CHIHUAHUA","MERE811126DU3","MERE811126MCHLMD02","EDNA MELINA MELERO RAMIREZ","08DPT0002B",null,null,null,null,null,null,0,224,0,null,null,null,null,null,null,0,224,0,38858.700000000004]
[null,"CHIHUAHUA","MEMN800616CH0","MEMN800616MZSNRR04","NORA DE LOURDES MENDEZ MARRUFO","08DPT0002B",null,null,null,null,null,null,0,208,0,null,null,null,null,null,null,0,208,0,37102.74]
[null,"CHIHUAHUA","MEPM521007BW0","MEPM521007MSPNTR05","MARINA MENDOZA PATIÑO","08DPT0002B",null,null,null,null,null,null,0,224,0,null,null,null,null,null,null,0,224,0,41113.759999999995]
[null,"CHIHUAHUA","MEHE771226AK0","MEHE771226MCHZRM07","EMMA MARINA MEZA HERNANDEZ","08DPT0002B",null,null,null,null,null,null,0,120,0,null,null,null,null,null,null,0,120,0,22670.39]
[null,"CHIHUAHUA","MONJ730522LH4","MONJ730522HCHLXN04","JUAN BENJAMIN MOLINA NUÑEZ","08DPT0002B",null,null,null,null,null,null,0,216,0,null,null,null,null,null,null,0,216,0,28794.5]
[null,"CHIHUAHUA","MOMC840319BC9","MOMC840319MCHRRR01","CARMINA SARA MORENO MORALES","08DPT0002B",null,null,null,null,null,null,0,160,0,null,null,null,null,null,null,0,160,0,23503.170000000006]
[null,"CHIHUAHUA","NARE6212101N2","NARE621210HCHVDL15","ELISEO MANUEL NAVA RODRIGUEZ","08DPT0002B",null,null,null,null,null,null,0,176,0,null,null,null,null,null,null,0,176,0,30518.600000000002]
[null,"CHIHUAHUA","NAMR911217QR2","NAMR911217MCHVRY09","REYNA GUADALUPE NAVARRETE MARROQUIN","08DPT0002B",null,null,null,null,null,null,0,232,0,null,null,null,null,null,null,0,232,0,35222.990000000005]
[null,"CHIHUAHUA","OICT750827I13","OICT750827MCHLRR05","MARIA TERESA OLIVAS  CORONADO","08DPT0002B",null,null,null,null,null,null,0,176,0,null,null,null,null,null,null,0,176,0,31620.55]
[null,"CHIHUAHUA","OEZA770117EH9","OEZA770117HCHRPL04","ALFREDO LORENZO ORTEGA ZEPEDA","08DPT0002B",null,null,null,null,null,null,0,224,0,null,null,null,null,null,null,0,224,0,39546.759999999995]
[null,"CHIHUAHUA","PAVM750409GD9","PAVM750409HCLLRR05","JOSE MARIA PALACIOS VARELA","08DPT0002B",null,null,null,null,null,null,0,128,0,null,null,null,null,null,null,0,128,0,18000.12]
[null,"CHIHUAHUA","PEGC920119FE4","PEGC920119MCHXRL07","CLAUDIA SELENE PEÑA GUARDADO","08DPT0002B",null,null,null,null,null,null,0,140,0,null,null,null,null,null,null,0,140,0,20288.240000000002]
[null,"CHIHUAHUA","PEGF4912049U3","PEGF491204HCHRRR02","FRANCISCO PEREZ GUERRERO","08DPT0002B",null,null,null,null,null,null,0,236,0,null,null,null,null,null,null,0,236,0,40630.740000000005]
[null,"CHIHUAHUA","PIMR770113LW6","PIMR770113MCLNXC04","ROCIO PINTO MUÑOZ","08DPT0002B",null,null,null,null,null,null,0,240,0,null,null,null,null,null,null,0,240,0,41990.78]
[null,"CHIHUAHUA","POGH680928E46","POGH680928HCHRTC09","HECTOR MIGUEL PORRAS GUTIERREZ","08DPT0002B",null,null,null,null,null,null,0,208,0,null,null,null,null,null,null,0,208,0,35152.74]
[null,"CHIHUAHUA","RABM8107186R9","RABM810718MCHMRR16","MIRIAM SUSANA RAMIREZ BARRERA","08DPT0002B",null,null,null,null,null,null,0,240,0,null,null,null,null,null,null,0,240,0,41990.78]
[null,"CHIHUAHUA","RACJ670625F74","RACJ670625HCHMRN00","JUAN RAMON RAMIREZ CORRAL","08DPT0002B",null,null,null,null,null,null,0,156,0,null,null,null,null,null,null,0,156,0,26714.560000000001]
[null,"CHIHUAHUA","RAVJ750924S61","RAVJ750924HCHMLN06","JUAN GABRIEL RAMIREZ VELA","08DPT0002B",null,null,null,null,null,null,0,236,0,null,null,null,null,null,null,0,236,0,36317.97]
[null,"CHIHUAHUA","REFG8206303T2","REFG820630MCLYLR05","GRISELDA REYES FLORES","08DPT0002B",null,null,null,null,null,null,0,212,0,null,null,null,null,null,null,0,212,0,29556.190000000002]
[null,"CHIHUAHUA","RIOH600504T14","RIOH600504HCHVLC08","HECTOR RAMON RIVERA OLIVAS","08DPT0002B",null,null,null,null,null,null,0,184,0,null,null,null,null,null,null,0,184,0,29690.61]
[null,"CHIHUAHUA","ROAL7201241P5","ROAL720124MCHDVD01","LIDIA ANGELICA RODRIGUEZ AVILA","08DPT0002B",null,null,null,null,null,null,0,220,0,null,null,null,null,null,null,0,220,0,38836.729999999996]
[null,"CHIHUAHUA","ROMM8706134U5","ROMM870613HCHDNN05","MANUEL ANTONIO RODRIGUEZ MONREAL","08DPT0002B",null,null,null,null,null,null,0,208,0,null,null,null,null,null,null,0,208,0,28504.74]
[null,"CHIHUAHUA","ROPE5908038V9","ROPE590803HCHDRL01","ELIGIO RODRIGUEZ PRIETO","08DPT0002B",null,null,null,null,null,null,0,224,0,null,null,null,null,null,null,0,224,0,32860.85]
[null,"CHIHUAHUA","SAVY820923BCA","SAVY820923MCHLLM00","YAMET VERENICE SALAZAR VELAZQUEZ","08DPT0002B",null,null,null,null,null,null,0,240,0,null,null,null,null,null,null,0,240,0,39450.78]
[null,"CHIHUAHUA","SELV800114DJ4","SELV800114HCHGZC03","VICTOR ANDRES SEGOVIA LOZOYA","08DPT0002B",null,null,null,null,null,null,0,232,0,null,null,null,null,null,null,0,232,0,40118.770000000004]
[null,"CHIHUAHUA","SOOA7210299X8","SOOA721029MCHLLN06","ANA LUISA SOLIS OLIVAS","08DPT0002B",null,null,null,null,null,null,0,168,0,null,null,null,null,null,null,0,168,0,30002.430000000004]
[null,"CHIHUAHUA","TERG520428J43","TERG520428HDFLVL09","GUILLERMO TELLEZ REVILLA","08DPT0002B",null,null,null,null,null,null,0,224,0,null,null,null,null,null,null,0,224,0,38896.759999999995]
[null,"CHIHUAHUA","VAOA630813IE8","VAOA630813MDGLRN07","ANGELA MARIA VALTIERRA  ORTEGA","08DPT0002B",null,null,null,null,null,null,0,240,0,null,null,null,null,null,null,0,240,0,41340.78]
[null,"CHIHUAHUA","VEGD970725699","VEGD970725HCHNNN08","DANIEL ARTURO VENZOR GONZALEZ","08DPT0002B",null,null,null,null,null,null,0,120,0,null,null,null,null,null,null,0,120,0,12426.21]
[null,"CHIHUAHUA","YAGC851128SX6","YAGC851128MCHXNY03","CYNTHIA AURORA YAÑEZ GONZALEZ","08DPT0002B",null,null,null,null,null,null,0,220,0,null,null,null,null,null,null,0,220,0,37790.620000000003]
[null,"CHIHUAHUA","AUVJ9103083J2","AUVJ910308HCHGLN15","AGUIRRE VILLARREAL JUAN DE DIOS","08DPT0003A",null,null,null,1,0,0,null,null,null,null,null,null,null,null,null,1,0,0,35473.370000000003]
[null,"CHIHUAHUA","AAIV730701KH6","AAIV730701MCHLTR08","ALARCON ITURRALDE VERONICA","08DPT0003A",null,null,null,null,null,null,null,null,null,null,null,null,1,0,0,1,0,0,75459.899999999994]
[null,"CHIHUAHUA","AOOC791125GF8","AOOC791125HCHLRR17","ALOR ORTEGA CRISTHIAN OMAR","08DPT0003A",null,null,null,1,0,0,null,null,null,null,null,null,null,null,null,1,0,0,85260.71]
[null,"CHIHUAHUA","AEHL721013358","AEHL721013MCHRRR04","ARMENDARIZ HUERTA LAURA ELENA","08DPT0003A",null,null,null,1,0,0,null,null,null,null,null,null,null,null,null,1,0,0,46403.03]
[null,"CHIHUAHUA","AOGA850323MS8","AOGA850323MCHRRD09","ARZOLA GARIBAY ADRIANA","08DPT0003A",null,null,null,1,0,0,null,null,null,null,null,null,null,null,null,1,0,0,49543.02]
[null,"CHIHUAHUA","BALJ741015QJ5","BALJ741015HNTCPR09","BACA LOPEZ JORGE GERARDO","08DPT0003A",null,null,null,null,null,null,null,null,null,null,null,null,1,0,0,1,0,0,95992.48]
[null,"CHIHUAHUA","CALS630411D26","CALS630411HCHNSL01","CANO LEOS SALVADOR","08DPT0003A",null,null,null,1,0,0,null,null,null,null,null,null,null,null,null,1,0,0,108553.12]
[null,"CHIHUAHUA","COSC761202AU8","COSC761202MCHRNL00","CORONADO SAENZ CLAUDIA","08DPT0003A",null,null,null,1,0,0,null,null,null,null,null,null,null,null,null,1,0,0,53547.55]
[null,"CHIHUAHUA","CORE740806FH5","CORE740806HCHRYN08","CORRAL REYES ENCARNACION","08DPT0003A",null,null,null,1,0,0,null,null,null,null,null,null,null,null,null,1,0,0,40239.71]
[null,"CHIHUAHUA","EABJ810502G45","EABJ810502HCHSYR08","ESPARZA BAYLON JORGE HUMBERTO","08DPT0003A",null,null,null,1,0,0,null,null,null,null,null,null,null,null,null,1,0,0,45547.09]
[null,"CHIHUAHUA","EIHE740513ST9","EIHE740513MCHSRV03","ESPINOSA HERNANDEZ EVA CELINA","08DPT0003A",null,null,null,1,0,0,null,null,null,null,null,null,null,null,null,1,0,0,88943.59]
[null,"CHIHUAHUA","FOEA490908UE3","FOEA490908HCHLND09","FLORES ENRIQUEZ ADRIAN GUADALUPE","08DPT0003A",null,null,null,1,0,0,null,null,null,null,null,null,null,null,null,1,0,0,26170.26]
[null,"CHIHUAHUA","FAJA861008RA4","FAJA861008MCHRRL05","FRANCO JURADO MARIA ALEJANDRA","08DPT0003A",null,null,null,1,0,0,null,null,null,null,null,null,null,null,null,1,0,0,62775.43]
[null,"CHIHUAHUA","GAFS650908R84","GAFS650908HCHRLR07","GARCIA FLORES SERGIO MARTIN","08DPT0003A",null,null,null,1,0,0,null,null,null,null,null,null,null,null,null,1,0,0,46600.56]
[null,"CHIHUAHUA","GAAV670716S40","GAAV670716HCHRRC06","GARDEA ARREDONDO VICTOR MANUEL","08DPT0003A",null,null,null,1,0,0,null,null,null,null,null,null,null,null,null,1,0,0,81129.440000000002]
[null,"CHIHUAHUA","GAHA8701284V2","GAHA870128HCHRRL07","GARDEA HEREDIA ALVARO","08DPT0003A",null,null,null,1,0,0,null,null,null,null,null,null,null,null,null,1,0,0,36397.22]
[null,"CHIHUAHUA","GOVJ720801R43","GOVJ720801MCHNLD09","GONZALEZ VALLES JUDITH","08DPT0003A",null,null,null,1,0,0,null,null,null,null,null,null,null,null,null,1,0,0,141614.43]
[null,"CHIHUAHUA","HECG831209L74","HECG831209MCHRBB09","HEREDIA CABALLERO GABRIELA JUDITH","08DPT0003A",null,null,null,1,0,0,null,null,null,null,null,null,null,null,null,1,0,0,11377.59]
[null,"CHIHUAHUA","HESH611022NF3","HESH611022HCHRNL03","HEREDIA SAENZ HILADRIO","08DPT0003A",null,null,null,1,0,0,null,null,null,null,null,null,null,null,null,1,0,0,45629.08]
[null,"CHIHUAHUA","HEGM7510295L3","HEGM751029MCHRTY07","HERNANDEZ GUTIERREZ MAYRA VERONICA","08DPT0003A",null,null,null,1,0,0,null,null,null,null,null,null,null,null,null,1,0,0,55329.01]
[null,"CHIHUAHUA","MEHP811017GD5","MEHP811017HCHNRL02","MENDEZ HERRERA PAUL ALONSO","08DPT0003A",null,null,null,1,0,0,null,null,null,null,null,null,null,null,null,1,0,0,41807.33]
[null,"CHIHUAHUA","MEMD550401S32","MEMD550401HCHNTL01","MENDEZ MOTA JOSE DOLORES","08DPT0003A",null,null,null,1,0,0,null,null,null,null,null,null,null,null,null,1,0,0,43282.67]
[null,"CHIHUAHUA","MOIR7306072Z5","MOIR730607HCHLBM08","MOLINA IBARRA RAMON HUMBERTO","08DPT0003A",null,null,null,1,0,0,null,null,null,null,null,null,null,null,null,1,0,0,36265.199999999997]
[null,"CHIHUAHUA","MOME900109M68","MOHR810216HCHNLN06","MONTES HOLGUIN RENE GUADALUPE","08DPT0003A",null,null,null,1,0,0,null,null,null,null,null,null,null,null,null,1,0,0,34367.79]
[null,"CHIHUAHUA","MOHR810216267","MOME900109MCHNNS03","MONTES MONTES ESMERALDA JANETH","08DPT0003A",null,null,null,1,0,0,null,null,null,null,null,null,null,null,null,1,0,0,38407.54]
[null,"CHIHUAHUA","MOCY820701FR6","MOCY820701MCHRHS01","ORTIZ CHAVEZ MARTHA ELVIRA","08DPT0003A",null,null,null,1,0,0,null,null,null,null,null,null,null,null,null,1,0,0,66140.36]
[null,"CHIHUAHUA","PESB570420393","PESB570420HCHRSN03","PEREZ SOSA BENJAMIN","08DPT0003A",null,null,null,1,0,0,null,null,null,null,null,null,null,null,null,1,0,0,44459.22]
[null,"CHIHUAHUA","QURM641112699","QURM641112HCHXMR08","QUIÑONEZ RAMIREZ MARTIN RENE","08DPT0003A",null,null,null,1,0,0,null,null,null,null,null,null,null,null,null,1,0,0,51230.04]
[null,"CHIHUAHUA","QUYA890925Q52","QUYA890925MCHXXN07","QUIÑONEZ YAÑEZ ANABEL","08DPT0003A",null,null,null,1,0,0,null,null,null,null,null,null,null,null,null,1,0,0,41032.85]
[null,"CHIHUAHUA","SUCM720601QH7","SUCM720601MCHRRY01","SUAREZ CORRAL MYRNA MANUELA","08DPT0003A",null,null,null,1,0,0,null,null,null,null,null,null,null,null,null,1,0,0,96510.95]
[null,"CHIHUAHUA","VATA751225F38","VATA751225HCHLRL00","VALLES TORRES ALFREDO","08DPT0003A",null,null,null,1,0,0,null,null,null,null,null,null,null,null,null,1,0,0,89378.34]
[null,"CHIHUAHUA","YADR7710046J3","YADR771004MCHXZS02","YAÑEZ DIAZ ROSA IVONNE","08DPT0003A",null,null,null,1,0,0,null,null,null,null,null,null,null,null,null,1,0,0,69592.88]
[null,"CHIHUAHUA","AOCF7610047IA","AOCF761204HCHCBR06","FRANCISCO ACOSTA CONTRERAS","08DPT0003A",null,null,null,null,null,null,0,229,0,null,null,null,null,null,null,0,229,0,28100.68]
[null,"CHIHUAHUA","AOMM7702115QA","AOMM770211MCHCRD18","MIDIAM LOURDES ACOSTA MERAZ","08DPT0003A",null,null,null,null,null,null,0,220,0,null,null,null,null,null,null,0,220,0,26515.919999999998]
[null,"CHIHUAHUA","AUQN701229G72","AUQN701229MCHGNR05","NORMA AGUIRRE QUINTANA ","08DPT0003A",null,null,null,null,null,null,0,264,0,null,null,null,null,null,null,0,264,0,30434.97]
[null,"CHIHUAHUA","AAHE730629HA8","AAHE730629HDGLRD05","EDGAR JESUS ALBA HERNANDEZ","08DPT0003A",null,null,null,null,null,null,0,228,0,null,null,null,null,null,null,0,228,0,27391.22]
[null,"CHIHUAHUA","AEOP850816BU5","AEOP850816HCHRLD08","PEDRO RAFAEL ARMENDARIZ OLIVAS","08DPT0003A",null,null,null,null,null,null,0,238,0,null,null,null,null,null,null,0,238,0,30997.09]
[null,"CHIHUAHUA","AERG670801H43","AERG670801HCHRVB09","GABRIEL ARMENDARIZ RIVAS","08DPT0003A",null,null,null,null,null,null,0,246,0,null,null,null,null,null,null,0,246,0,31885.03]
[null,"CHIHUAHUA","BASJ720920637","BASJ720920HCHCMV04","JAVIER BACA SAMPER","08DPT0003A",null,null,null,null,null,null,0,237,0,null,null,null,null,null,null,0,237,0,32174.89]
[null,"CHIHUAHUA","BAMF820909BC1","BAMF820909MCHLRT08","FATIMA DEL CARMEN BALDERAS MORALES","08DPT0003A",null,null,null,null,null,null,0,224,0,null,null,null,null,null,null,0,224,0,32156.3]
[null,"CHIHUAHUA","CACF650131IUA","CACF650131HCHNHL00","FILIBERTO CANO CHAVEZ","08DPT0003A",null,null,null,null,null,null,0,245,0,null,null,null,null,null,null,0,245,0,23269.25]
[null,"CHIHUAHUA","CALA591128150","CALA591128HCHNSB00","ABRAHAM CANO LEOS","08DPT0003A",null,null,null,null,null,null,0,132,0,null,null,null,null,null,null,0,132,0,18807.03]
[null,"CHIHUAHUA","CATI910806HS0","CATI910806HCHRRV03","IVAN DOROTEO CARRERA DE LA TORRE","08DPT0003A",null,null,null,null,null,null,0,264,0,null,null,null,null,null,null,0,264,0,30434.97]
[null,"CHIHUAHUA","CATN8302135X1","CATN830213MCHRRD06","NADIA BEATRIZ CARRERA DE LA TORRE","08DPT0003A",null,null,null,null,null,null,0,259,0,null,null,null,null,null,null,0,259,0,34840.720000000001]
[null,"CHIHUAHUA","CAGG681119QE9","CAGG681119MCHRRB25","MARIA GABRIELA CARRILLO GARDEA","08DPT0003A",null,null,null,null,null,null,0,239,0,null,null,null,null,null,null,0,239,0,32493.01]
[null,"CHIHUAHUA","CAMA550415A18","CAMA550415HCHRLR08","ARISTEO CARRILLO MALDONADO","08DPT0003A",null,null,null,null,null,null,0,46,0,null,null,null,null,null,null,0,46,0,6618.72]
[null,"CHIHUAHUA","CATA900830PFA","CATA900830MCHRRL03","ALEJANDRA IVETTE  CARRILLO TRUJILLO","08DPT0003A",null,null,null,null,null,null,0,258,0,null,null,null,null,null,null,0,258,0,29301.759999999998]
[null,"CHIHUAHUA","CATI851219KEA","CATI851219MCHRRR12","IRMA RAQUEL CARRILLO TRUJILLO","08DPT0003A",null,null,null,null,null,null,0,160,0,null,null,null,null,null,null,0,160,0,21766.59]
[null,"CHIHUAHUA","CAGL680404GU5","CAGL680404MCHSTT08","LETICIA CASILLAS GUTIERREZ","08DPT0003A",null,null,null,null,null,null,0,246,0,null,null,null,null,null,null,0,246,0,33079.94]
[null,"CHIHUAHUA","CEBC880121MJ0","CEBC880121MCHBCL06","CLAUDIA INES CEBALLOS BACA","08DPT0003A",null,null,null,null,null,null,0,256,0,null,null,null,null,null,null,0,256,0,33181.089999999997]
[null,"CHIHUAHUA","CEHF701204P69","CEHF701204HDGRRR02","FRANCISCO JAVIER CERENIL HERRERA","08DPT0003A",null,null,null,null,null,null,0,255,0,null,null,null,null,null,null,0,255,0,32953.800000000003]
[null,"CHIHUAHUA","CASC781201J96","CASC781201MCHHNR02","CORINA CHAVEZ SANCHEZ","08DPT0003A",null,null,null,null,null,null,0,237,0,null,null,null,null,null,null,0,237,0,33107.089999999997]
[null,"CHIHUAHUA","DERI7801118J5","DEXR780111HCHLXC03","RICARDO DELGADO","08DPT0003A",null,null,null,null,null,null,0,238,0,null,null,null,null,null,null,0,238,0,30997.09]
[null,"CHIHUAHUA","LEPJ860727765","LEPJ860727HCHNRV08","JAVIER EDUVIGES DE LEON PARADA","08DPT0003A",null,null,null,null,null,null,0,223,0,null,null,null,null,null,null,0,223,0,24758.59]
[null,"CHIHUAHUA","EARD8007284EA","EARD800728MCHSCL06","DULCE MARGARITA ELIZABETH ESCALANTE ROCHA","08DPT0003A",null,null,null,null,null,null,0,265,0,null,null,null,null,null,null,0,265,0,36237.65]
[null,"CHIHUAHUA","FEAL8707295J5","DUPB710508MCHRRR02","LUIS RAUL FERNANDEZ ACOSTA","08DPT0003A",null,null,null,null,null,null,0,244,0,null,null,null,null,null,null,0,244,0,33729.94]
[null,"CHIHUAHUA","GAQL770122HI2","GAQL770122MCHLXZ06","LUZ ELIZABETH GALVAN QUIÑONEZ","08DPT0003A",null,null,null,null,null,null,0,223,0,null,null,null,null,null,null,0,223,0,26676.13]
[null,"CHIHUAHUA","GACP590517MU6","GACP590517MCHRHT05","PATRICIA EUGENIA GARCIA CHAVEZ","08DPT0003A",null,null,null,null,null,null,0,225,0,null,null,null,null,null,null,0,225,0,30472.73]
[null,"CHIHUAHUA","GARJ67122131A","GARJ671221HCHRZM09","JAIME GARCIA RUIZ","08DPT0003A",null,null,null,null,null,null,0,256,0,null,null,null,null,null,null,0,256,0,33767.53]
[null,"CHIHUAHUA","GODK810903VC5","GODK810903MCHNVN04","KENIS GONZALEZ DAVILA","08DPT0003A",null,null,null,null,null,null,0,233,0,null,null,null,null,null,null,0,233,0,31706.44]
[null,"CHIHUAHUA","GOGA810922999","GOGA810922HCHNRG02","AGUSTIN GONZALEZ GARCIA","08DPT0003A",null,null,null,null,null,null,0,267,0,null,null,null,null,null,null,0,267,0,34191.21]
[null,"CHIHUAHUA","GOGJ8811064X6","GOGJ881106MCHNTS09","JESSICA JANETH GONZALEZ GUTIERREZ","08DPT0003A",null,null,null,null,null,null,0,240,0,null,null,null,null,null,null,0,240,0,32820.46]
[null,"CHIHUAHUA","GOHD580525IP0","GOHD580525HCHNRV01","DAVID GONZALEZ HERNANDEZ","08DPT0003A",null,null,null,null,null,null,0,263,0,null,null,null,null,null,null,0,263,0,26227.42]
[null,"CHIHUAHUA","GUCG610126B56","GUCG610126HCHTNR03","JOSE GERARDO GUTIERREZ CONTRERAS","08DPT0003A",null,null,null,null,null,null,0,149,0,null,null,null,null,null,null,0,149,0,20240.87]
[null,"CHIHUAHUA","HEAV711202QZ8","HEAV711202MCHRGV01","VIVIANA HERNANDEZ AGUILERA","08DPT0003A",null,null,null,null,null,null,0,129,0,null,null,null,null,null,null,0,129,0,17633.68]
[null,"CHIHUAHUA","HEAA900716PY3","HEAA900716HCHRGL00","ALFREDO HERNANDEZ AGUIRRE","08DPT0003A",null,null,null,null,null,null,0,230,0,null,null,null,null,null,null,0,230,0,23283.89]
[null,"CHIHUAHUA","HEAA881029IG6","HEAA881029MCHRNN04","ANGELICA HERNANDEZ ANGEL","08DPT0003A",null,null,null,null,null,null,0,261,0,null,null,null,null,null,null,0,261,0,35064.28]
[null,"CHIHUAHUA","HERM720618VE6","HERM720618MCHRMN07","MANUELA OLIVIA HERNANDEZ RAMIREZ","08DPT0003A",null,null,null,null,null,null,0,53,0,null,null,null,null,null,null,0,53,0,2260.8000000000002]
[null,"CHIHUAHUA","HISE750912LP7","HISE750912MCHNNT05","ETHEL JANETH HINOJOS SANCHEZ","08DPT0003A",null,null,null,null,null,null,0,261,0,null,null,null,null,null,null,0,261,0,35427.65]
[null,"CHIHUAHUA","HOOJ841127R23","HOOJ841127HCHLJS04","JESUS MANUEL HOLGUIN OJEDA","08DPT0003A",null,null,null,null,null,null,0,248,0,null,null,null,null,null,null,0,248,0,33407.39]
[null,"CHIHUAHUA","HOQS841119E44","HOQS841119MCHLNL02","SILVIA HOLGUIN QUINTANA","08DPT0003A",null,null,null,null,null,null,0,255,0,null,null,null,null,null,null,0,255,0,33667.360000000001]
[null,"CHIHUAHUA","IEPA690710Q2A","IEPA690710HZSRRL07","ALEJANDRO IRENE PEREZ","08DPT0003A",null,null,null,null,null,null,0,253,0,null,null,null,null,null,null,0,253,0,34254.28]
[null,"CHIHUAHUA","JUEM870729SW2","JUEM870729MCHRSR04","MARINA JUAREZ ESPARZA","08DPT0003A",null,null,null,null,null,null,0,143,0,null,null,null,null,null,null,0,143,0,15071.26]
[null,"CHIHUAHUA","JUGE790622JJ2","JUGE790622HCHRRD03","EDGAR ELIEL JUAREZ GRAJEDA","08DPT0003A",null,null,null,null,null,null,0,262,0,null,null,null,null,null,null,0,262,0,34191.21]
[null,"CHIHUAHUA","LARJ611212G44","LARJ611212HCHZDL03","JOEL GUADALUPE LAZCANO RODRIGUEZ","08DPT0003A",null,null,null,null,null,null,0,199,0,null,null,null,null,null,null,0,199,0,21082.29]
[null,"CHIHUAHUA","LISA761208237","LISA761208HCHCLN05","ANGEL LICERIO SILVEYRA","08DPT0003A",null,null,null,null,null,null,0,246,0,null,null,null,null,null,null,0,246,0,26079]
[null,"CHIHUAHUA","LOGJ770422620","LOGJ770422HCHPRL08","JOEL ALONSO LOPEZ GRANADOS","08DPT0003A",null,null,null,null,null,null,0,245,0,null,null,null,null,null,null,0,245,0,33079.94]
[null,"CHIHUAHUA","LOSS7606157X9","LOSS760615MCHPLL02","SILVIA LOPEZ SALCIDO","08DPT0003A",null,null,null,null,null,null,0,199,0,null,null,null,null,null,null,0,199,0,24505.91]
[null,"CHIHUAHUA","LOCM7912081Q9","LOCM791208MCHYLR09","MARTHA LAURA LOYA CELESTIN","08DPT0003A",null,null,null,null,null,null,0,242,0,null,null,null,null,null,null,0,242,0,32493.5]
[null,"CHIHUAHUA","MAAK800331I60","MAAK800331MCHCGR00","KAREN LOURDES MACIAS AGUIRRE","08DPT0003A",null,null,null,null,null,null,0,175,0,null,null,null,null,null,null,0,175,0,22784.29]
[null,"CHIHUAHUA","MAMF571028UH3","MAMF571028HCHRCR08","FRANCISCO ROBERTO MARTINEZ MACIAS","08DPT0003A",null,null,null,null,null,null,0,239,0,null,null,null,null,null,null,0,239,0,31420.3]
[null,"CHIHUAHUA","MAMS761009L43","MASS761009HCHRCR04","SERGIO RENE MARTINEZ MACIAS","08DPT0003A",null,null,null,null,null,null,0,198,0,null,null,null,null,null,null,0,198,0,23149.48]
[null,"CHIHUAHUA","MAML781222TP2","MAML781222MCHRNR05","LAURA GABRIELA MARTINEZ MONARREZ","08DPT0003A",null,null,null,null,null,null,0,229,0,null,null,null,null,null,null,0,229,0,29336.959999999999]
[null,"CHIHUAHUA","MAPJ881207NN8","MAPJ881207MCHRRN07","JANETH DERAT MARTINEZ PROSPERO","08DPT0003A",null,null,null,null,null,null,0,264,0,null,null,null,null,null,null,0,264,0,35651.21]
[null,"CHIHUAHUA","MARB780909MG5","MARB780909MCHRSR07","BRENDA SOCORRO MARTINEZ RIOS","08DPT0003A",null,null,null,null,null,null,0,262,0,null,null,null,null,null,null,0,262,0,34191.21]
[null,"CHIHUAHUA","MEMP850117HB8","MEMP850117MCHNNL01","PALOMA DEL CARMEN MENDEZ MENDEZ","08DPT0003A",null,null,null,null,null,null,0,244,0,null,null,null,null,null,null,0,244,0,32657.22]
[null,"CHIHUAHUA","MOHE7612192R9","MOHE761219HCHNLD06","EDGAR OBEK MONTES HOLGUIN","08DPT0003A",null,null,null,null,null,null,0,193,0,null,null,null,null,null,null,0,193,0,29544.5]
[null,"CHIHUAHUA","MOMA830930QR2","MOMA830930MCHRRN04","ANTONIA MORENO MORALES","08DPT0003A",null,null,null,null,null,null,0,242,0,null,null,null,null,null,null,0,242,0,32883.53]
[null,"CHIHUAHUA","NASG7104118K1","NASG710411MDGJNR04","GRISELDA NAJERA SAENZ","08DPT0003A",null,null,null,null,null,null,0,43,0,null,null,null,null,null,null,0,43,0,1695.6]
[null,"CHIHUAHUA","NAMR830722I63","NAMR830722MCHXNB01","REBECA DIANA NANEZ MENDOZA","08DPT0003A",null,null,null,null,null,null,0,255,0,null,null,null,null,null,null,0,255,0,31019.71]
[null,"CHIHUAHUA","PAQR840612BHA","PAQR840612HCHLXM03","JOSE RAMON PALMA QUIÑONEZ","08DPT0003A",null,null,null,null,null,null,0,253,0,null,null,null,null,null,null,0,253,0,25861.01]
[null,"CHIHUAHUA","PAMZ880803S42","PAMZ880803MCHTRM09","ZAMISH GABRIELA PATIÑO MORALES","08DPT0003A",null,null,null,null,null,null,0,223,0,null,null,null,null,null,null,0,223,0,25977.06]
[null,"CHIHUAHUA","PERO820514295","PERO820514HCHRMM06","OMAR ARMANDO PEREZ RAMIREZ","08DPT0003A",null,null,null,null,null,null,0,248,0,null,null,null,null,null,null,0,248,0,32429.94]
[null,"CHIHUAHUA","QUVC860208IX4","QUVC860208MCHNLR06","CRISTINA QUINTANA VILLEGAS","08DPT0003A",null,null,null,null,null,null,0,242,0,null,null,null,null,null,null,0,242,0,25517.21]
[null,"CHIHUAHUA","QUGG830326LY2","QUGG830326MCHXRR05","GEORGINA ALHELI QUIÑONEZ GARCIA","08DPT0003A",null,null,null,null,null,null,0,240,0,null,null,null,null,null,null,0,240,0,32493]
[null,"CHIHUAHUA","QUYD920620SG7","QUYD920620MCHXXN07","DANIA ANGELICA QUIÑONEZ YAÑEZ","08DPT0003A",null,null,null,null,null,null,0,260,0,null,null,null,null,null,null,0,260,0,31386.42]
[null,"CHIHUAHUA","RACG650805Q12","RACG650805HSRMNM07","GAMALIEL RAMOS CONTRERAS","08DPT0003A",null,null,null,null,null,null,0,232,0,null,null,null,null,null,null,0,232,0,25633.89]
[null,"CHIHUAHUA","RACA620817IU7","RACA620817HCHSHN09","ANTONIO RASCON CHAVEZ","08DPT0003A",null,null,null,null,null,null,0,255,0,null,null,null,null,null,null,0,255,0,25332.34]
[null,"CHIHUAHUA","RERH8005305SA","RERH800530HCHNDC03","HECTOR RAUL RENTERIA RODRIGUEZ","08DPT0003A",null,null,null,null,null,null,0,201,0,null,null,null,null,null,null,0,201,0,21040.639999999999]
[null,"CHIHUAHUA","RIPS680731I67","RIPS680731HCHCRR07","SERGIO RICO PEREZ","08DPT0003A",null,null,null,null,null,null,0,246,0,null,null,null,null,null,null,0,246,0,25121.91]
[null,"CHIHUAHUA","RIAJ830525SU3","RIAJ830525HCHVCM08","JAIME MICHAEL RIVERA ACOSTA","08DPT0003A",null,null,null,null,null,null,0,267,0,null,null,null,null,null,null,0,267,0,34191.21]
[null,"CHIHUAHUA","ROSL891018R33","ROSL891018HCHDNS03","LUIS ISIDRO RODRIGUEZ SAENZ","08DPT0003A",null,null,null,null,null,null,0,220,0,null,null,null,null,null,null,0,220,0,25673.27]
[null,"CHIHUAHUA","ROSL8112066G9","ROSL811206HCHDFS05","LUIS CARLOS RODRIGUEZ SIFUENTES","08DPT0003A",null,null,null,null,null,null,0,256,0,null,null,null,null,null,null,0,256,0,35067.53]
[null,"CHIHUAHUA","ROMC790529SQ8","ROMC790529HCHJZR03","CARLOS GERMAN ROJAS MEZA","08DPT0003A",null,null,null,null,null,null,0,233,0,null,null,null,null,null,null,0,233,0,33080.43]
[null,"CHIHUAHUA","ROMJ820824341","ROMJ820824HCHMRN09","JUAN PABLO ROMO MARTINEZ","08DPT0003A",null,null,null,null,null,null,0,132,0,null,null,null,null,null,null,0,132,0,17570.599999999999]
[null,"CHIHUAHUA","ROQM800726NK3","ROQM800726MCHNXR09","MARISA JUDITH RONQUILLO QUIÑONEZ","08DPT0003A",null,null,null,null,null,null,0,201,0,null,null,null,null,null,null,0,201,0,24339.83]
[null,"CHIHUAHUA","SARJ830528CW0","SARJ830528HCHLDR12","JORGE ARTURO SALAS RODRIGUEZ","08DPT0003A",null,null,null,null,null,null,0,235,0,null,null,null,null,null,null,0,235,0,27159.15]
[null,"CHIHUAHUA","SADC810906EH7","SADC810906MCHNZR07","MARIA CRISTINA SANCHEZ DIAZ","08DPT0003A",null,null,null,null,null,null,0,264,0,null,null,null,null,null,null,0,264,0,29926.83]
[null,"CHIHUAHUA","SERM730609876","SERM730609MCHPYY01","MYRIAM SEPULVEDA REYES","08DPT0003A",null,null,null,null,null,null,0,240,0,null,null,null,null,null,null,0,240,0,32204.21]
[null,"CHIHUAHUA","TEAR760610A38","TEAR760610HCHRGL01","RAUL FELIPE TERRAZAS AGUIRRE","08DPT0003A",null,null,null,null,null,null,0,132,0,null,null,null,null,null,null,0,132,0,19457.03]
[null,"CHIHUAHUA","TOBT8310246R6","TOBT831024MCHRRH05","THELMA GUADALUPE TORRES BARRETO","08DPT0003A",null,null,null,null,null,null,0,260,0,null,null,null,null,null,null,0,260,0,34574.28]
[null,"CHIHUAHUA","UUAJ8910286B1","UUAJ891028HCHRRL00","JOEL URTUZUASTEGUI ARZOLA","08DPT0003A",null,null,null,null,null,null,0,247,0,null,null,null,null,null,null,0,247,0,31387.119999999999]
[null,"CHIHUAHUA","VASM721005K88","VASM721005HCHLRR06","MARIO ALBERTO VALDEZ SIERRA","08DPT0003A",null,null,null,null,null,null,0,127,0,null,null,null,null,null,null,0,127,0,17926.900000000001]
[null,"CHIHUAHUA","VATE6505053PA","VATE650505HCHLRR02","ERNESTO VALLEJO TERRAZAS","08DPT0003A",null,null,null,null,null,null,0,216,0,null,null,null,null,null,null,0,216,0,28976.34]
[null,"CHIHUAHUA","VAGS580921NS3","VAGS580921MCHZRL04","SOLEDAD VAZQUEZ GARCIA","08DPT0003A",null,null,null,null,null,null,0,248,0,null,null,null,null,null,null,0,248,0,33079.94]
[null,"CHIHUAHUA","VASI870422IA8","VASI870422MCHZVS04","ISIS KRYSTAL VAZQUEZ SAENZ","08DPT0003A",null,null,null,null,null,null,0,242,0,null,null,null,null,null,null,0,242,0,32493]
[null,"CHIHUAHUA","VEMA770621BW5","VEMA770621MCHLRN02","ANA ISABEL VELAZQUEZ MARTINEZ","08DPT0003A",null,null,null,null,null,null,0,238,0,null,null,null,null,null,null,0,238,0,32460.82]
[null,"CHIHUAHUA","VEDA870119GY2","VEDA870119MDGRMD03","ADRIANA VERGARA DOMINGUEZ","08DPT0003A",null,null,null,null,null,null,0,162,0,null,null,null,null,null,null,0,162,0,19487.46]
[null,"CHIHUAHUA","VILJ810613D4A","VILJ810613HCHLRR06","JORGE ANTONIO VILLAR LOERA","08DPT0003A",null,null,null,null,null,null,0,265,0,null,null,null,null,null,null,0,265,0,29926.83]
[null,"CHIHUAHUA","VIGR710609UT2","VIGR710609HCHLRF00","RAFAEL VILLEGAS GARCIA","08DPT0003A",null,null,null,null,null,null,0,241,0,null,null,null,null,null,null,0,241,0,33793]
[null,"CHIHUAHUA","AUAC800520NRA","AUAC800520HDGGNS04","CESAR ALEJANDRO AGUILAR ANTUNEZ","08DPT0007X",null,null,null,1,0,0,null,null,null,null,null,null,null,null,null,1,0,0,62930.3]
[null,"CHIHUAHUA","AARJ7003036F2","AARJ700303MCHNMS07","MARIA DE JESUS ANAYA RAMIREZ","08DPT0007X",null,null,null,1,0,0,null,null,null,null,null,null,null,null,null,1,0,0,101776.76]
[null,"CHIHUAHUA","AIEL6711121J4","AIXE671112MCHRXL03","MARIA ELIZABETTH ARRIETA","08DPT0007X",null,null,null,1,0,0,null,null,null,null,null,null,null,null,null,1,0,0,38921.89]
[null,"CHIHUAHUA","BELH630930M26","BELH630930HCHNNM06","JOSE HUMBERTO BENITEZ LONGORIA","08DPT0007X",null,null,null,1,0,0,null,null,null,null,null,null,null,null,null,1,0,0,62510.96]
[null,"CHIHUAHUA","CADE710915BB6","CADE710915MCHRZL02","ELVIRA CARRASCO DIAZ","08DPT0007X",null,null,null,null,null,null,null,null,null,null,null,null,1,0,0,1,0,0,100611.18]
[null,"CHIHUAHUA","CACI7205151S9","CACI720515HOCHRS01","ISIDRO MANUEL CHAVEZ CARRERA","08DPT0007X",null,null,null,1,0,0,null,null,null,null,null,null,null,null,null,1,0,0,96148.05]
[null,"CHIHUAHUA","DEML700812U65","DEML700812MDGLRR03","LAURA DIANA DELGADO MARRERO","08DPT0007X",null,null,null,1,0,0,null,null,null,null,null,null,null,null,null,1,0,0,56490.68]
[null,"CHIHUAHUA","EALJ731221FM3","EALJ731221HSLSRN06","JUAN DE DIOS ESCALANTE LAUREAN","08DPT0007X",null,null,null,1,0,0,null,null,null,null,null,null,null,null,null,1,0,0,49325.75]
[null,"CHIHUAHUA","GAEM680908Q97","GAEC680908MCLLSN03","MA CONCEPCION GALLARDO ESPARZA","08DPT0007X",null,null,null,1,0,0,null,null,null,null,null,null,null,null,null,1,0,0,43417.73]
[null,"CHIHUAHUA","GADA760726L20","GADA760726MCHRZD02","ADRIANA GARCIA DIAZ","08DPT0007X",null,null,null,1,0,0,null,null,null,null,null,null,null,null,null,1,0,0,55127.48]
[null,"CHIHUAHUA","HEGJ620729F26","HEGJ620729HCHRNV07","JOSE JAVIER HERNANDEZ GONZALEZ","08DPT0007X",null,null,null,1,0,0,null,null,null,null,null,null,null,null,null,1,0,0,94258.74]
[null,"CHIHUAHUA","HEGL611117FN5","HEGL611117MCHRNZ00","LUZ MARIA HERNANDEZ GONZALEZ","08DPT0007X",null,null,null,1,0,0,null,null,null,null,null,null,null,null,null,1,0,0,108278.23]
[null,"CHIHUAHUA","HEPH660312FI8","HEPH660312HCHRRC02","HECTOR HERNANDEZ PEREZ","08DPT0007X",null,null,null,1,0,0,null,null,null,null,null,null,null,null,null,1,0,0,68698.94]
[null,"CHIHUAHUA","LIMR6608162E8","LIMR660816HZSRNY01","RAYMUNDO LIRA MENDOZA","08DPT0007X",null,null,null,1,0,0,null,null,null,null,null,null,null,null,null,1,0,0,148721]
[null,"CHIHUAHUA","MASF580311IY9","MASF580311HDGGCR04","FRANCISCO MAGDALENO SAUCEDO","08DPT0007X",null,null,null,1,0,0,null,null,null,null,null,null,null,null,null,1,0,0,94937.17]
[null,"CHIHUAHUA","MARL701010AR4","MARL701010MCLRBD02","LUDIVINA MARTINEZ REBOLLOSO","08DPT0007X",null,null,null,1,0,0,null,null,null,null,null,null,null,null,null,1,0,0,62381.95]
[null,"CHIHUAHUA","MECL790627CP7","MEXC790627MCHJXL02","CLAUDIA FABIOLA MEJIA","08DPT0007X",null,null,null,1,0,0,null,null,null,null,null,null,null,null,null,1,0,0,55873.78]
[null,"CHIHUAHUA","MONL710121CT7","MONL710121MSLGVR08","LORENA INES MOGUEL NOVELO","08DPT0007X",null,null,null,1,0,0,null,null,null,null,null,null,null,null,null,1,0,0,47812.79]
[null,"CHIHUAHUA","MONM720514D8A","MONM720514HCHRXR04","MARCIAL EZEQUIEL MORALES NUÑEZ","08DPT0007X",null,null,null,1,0,0,null,null,null,null,null,null,null,null,null,1,0,0,130617.22]
[null,"CHIHUAHUA","OIPL750706829","OIPL750706HNTRXS09","LUIS ALBERTO ORTIZ PEÑA","08DPT0007X",null,null,null,1,0,0,null,null,null,null,null,null,null,null,null,1,0,0,85262.25]
[null,"CHIHUAHUA","PECG710113QA8","PECG710113MCHRRB06","GABRIELA PEREZ CRUZ","08DPT0007X",null,null,null,1,0,0,null,null,null,null,null,null,null,null,null,1,0,0,51246.13]
[null,"CHIHUAHUA","ROCS700130LMA","ROCS700130MDGDLL00","SILVIA ESTELA RODRIGUEZ CALVILLO","08DPT0007X",null,null,null,1,0,0,null,null,null,null,null,null,null,null,null,1,0,0,94258.74]
[null,"CHIHUAHUA","ROMA711015CL1","ROMA711015MDFDLN06","ANA LUISA RODRIGUEZ MILAN","08DPT0007X",null,null,null,1,0,0,null,null,null,null,null,null,null,null,null,1,0,0,63958.83]
[null,"CHIHUAHUA","ROME6706013EA","ROME670601MDFJLD04","MARIA EDITH ROJAS MELENDEZ","08DPT0007X",null,null,null,1,0,0,null,null,null,null,null,null,null,null,null,1,0,0,55809.07]
[null,"CHIHUAHUA","SOGC711207N65","SOGC711207MCHTRN06","MARIA CONCEPCION SOTO GUERRERO","08DPT0007X",null,null,null,1,0,0,null,null,null,null,null,null,null,null,null,1,0,0,138380.26999999999]
[null,"CHIHUAHUA","SOHJ7805045P4","SOHJ780504HCHTRS02","JOSE DE JESUS SOTO HERNANDEZ","08DPT0007X",null,null,null,1,0,0,null,null,null,null,null,null,null,null,null,1,0,0,58272]
[null,"CHIHUAHUA","ZAVE920703L47","ZAVE920703HCHVLD09","EDGAR ALEJANDRO ZAVALA VALLES","08DPT0007X",null,null,null,1,0,0,null,null,null,null,null,null,null,null,null,1,0,0,37097.519999999997]
[null,"CHIHUAHUA","AAVJ670109VEA","AAVJ670109HVZBLL08","ABSALON VILLEGAS JULIAN MIGUEL","08DPT0007X",null,null,null,null,null,null,0,228,0,null,null,null,null,null,null,0,228,0,28776.182530000002]
[null,"CHIHUAHUA","AOLJ680721RSA","AOLJ680721MCHCJL09","ACOSTA LUJAN JULIA ROSA","08DPT0007X",null,null,null,null,null,null,0,216,0,null,null,null,null,null,null,0,216,0,35486.7768]
[null,"CHIHUAHUA","AEMV850720NG8","AEMV850720MCHLNR03","ALMEIDA MONTES VIRIDIANA","08DPT0007X",null,null,null,null,null,null,0,216,0,null,null,null,null,null,null,0,216,0,34066.716800000002]
[null,"CHIHUAHUA","AAGP8807274Z4","AAGP880727MMCLLB04","ALVARADO GALICIA PABLOVA","08DPT0007X",null,null,null,null,null,null,0,240,0,null,null,null,null,null,null,0,240,0,37458.432000000001]
[null,"CHIHUAHUA","AASJ7104236Z2","AASJ710423HCHLNR06","ALVARADO SANCHEZ JORGE ADRIAN","08DPT0007X",null,null,null,null,null,null,0,240,0,null,null,null,null,null,null,0,240,0,38403.161999999997]
[null,"CHIHUAHUA","AATG900815VD7","AATG900815MCHLRL09","ALVARADO TARANGO GLORIA YARALDY","08DPT0007X",null,null,null,null,null,null,0,240,0,null,null,null,null,null,null,0,240,0,37220.762000000002]
[null,"CHIHUAHUA","AARP801213GG6","AARP801213HCHVDD14","AVALOS RODARTE PEDRO ALONSO","08DPT0007X",null,null,null,null,null,null,0,240,0,null,null,null,null,null,null,0,240,0,38640.831999999995]
[null,"CHIHUAHUA","BACJ730108BV7","BACJ730108MDFYRH00","BAYARDO CARVAJAL JAHEL","08DPT0007X",null,null,null,null,null,null,0,240,0,null,null,null,null,null,null,0,240,0,31733.839749999999]
[null,"CHIHUAHUA","BECI670819Q93","BECI670819HCHLRV03","BELMONTE CARRILLO IVAN","08DPT0007X",null,null,null,null,null,null,0,240,0,null,null,null,null,null,null,0,240,0,37930.792000000001]
[null,"CHIHUAHUA","BEMY780623E38","BEMY780623MCHRRS01","BERUMEN MARTINEZ YESICA","08DPT0007X",null,null,null,null,null,null,0,240,0,null,null,null,null,null,null,0,240,0,34380.642]
[null,"CHIHUAHUA","BUEL761105V38","BUEL761105MCHSSR05","BUSTAMANTE ESCOBEDO LAURA ISELA","08DPT0007X",null,null,null,null,null,null,0,240,0,null,null,null,null,null,null,0,240,0,37220.762000000002]
[null,"CHIHUAHUA","CAVM69042817A","CAVM690428HCHBGR00","CABALLERO VEGA MARIO ALBERTO","08DPT0007X",null,null,null,null,null,null,0,180,0,null,null,null,null,null,null,0,180,0,23925.060980000002]
[null,"CHIHUAHUA","CAVM6006195R6","CAVM600619HCHLLN01","CALLEROS VILLALOBOS MANUEL ALBERTO ","08DPT0007X",null,null,null,null,null,null,0,240,0,null,null,null,null,null,null,0,240,0,33585.229749999999]
[null,"CHIHUAHUA","CIGJ801220RP4","CIGJ801220HCHSRL09","CISNEROS GARCIA JULIO ALBERTO","08DPT0007X",null,null,null,null,null,null,0,240,0,null,null,null,null,null,null,0,240,0,38640.831999999995]
[null,"CHIHUAHUA","RORA58083143A","RORA580831HOCSMD15","DE LA ROSA ROMERO ADAN","08DPT0007X",null,null,null,null,null,null,0,228,0,null,null,null,null,null,null,0,228,0,4319.1750000000002]
[null,"CHIHUAHUA","DIAA860226874","DIAA860226MSRZGN04","DIAZ AGUILAR ANA FABIOLA","08DPT0007X",null,null,null,null,null,null,0,144,0,null,null,null,null,null,null,0,144,0,23184.4912]
[null,"CHIHUAHUA","DOBG610203LR2","DOBG610203HCHMRL02","DOMINGUEZ BARAY GILBERTO","08DPT0007X",null,null,null,null,null,null,0,240,0,null,null,null,null,null,null,0,240,0,38640.831999999995]
[null,"CHIHUAHUA","DOEJ630916HP1","DOEJ630916HCLRSN05","DORADO ESPINO JUAN JESUS","08DPT0007X",null,null,null,null,null,null,0,156,0,null,null,null,null,null,null,0,156,0,17816.590037499998]
[null,"CHIHUAHUA","EADJ860902I17","EADJ860902HCHSZV01","ESPARZA DIAZ JAVIER EDUARDO","08DPT0007X",null,null,null,null,null,null,0,240,0,null,null,null,null,null,null,0,240,0,37220.762000000002]
[null,"CHIHUAHUA","EACL8412183L3","EACL841218MCHSRR08","ESTRADA CARRILLO LAURA VERONICA","08DPT0007X",null,null,null,null,null,null,0,240,0,null,null,null,null,null,null,0,240,0,37930.792000000001]
[null,"CHIHUAHUA","EAHJ881022RT6","EAHJ881022HCHSRQ05","ESTRADA HERNANDEZ JOAQUIN JOEL","08DPT0007X",null,null,null,null,null,null,0,240,0,null,null,null,null,null,null,0,240,0,38640.831999999995]
[null,"CHIHUAHUA","EASA951019EL5","EASA951019HCHSLN00","ESTRADA SALAYANDIA JOSE ANGEL","08DPT0007X",null,null,null,null,null,null,0,192,0,null,null,null,null,null,null,0,192,0,19262.833200000001]
[null,"CHIHUAHUA","FOCG620409LQ0","FOCG620409HDGLHN03","FLORES CHACON GONZALO","08DPT0007X",null,null,null,null,null,null,0,204,0,null,null,null,null,null,null,0,204,0,34974.794200000004]
[null,"CHIHUAHUA","GAEH711103S52","GAEH711103HCHBNC07","GABALDON ENRÍQUEZ HECTOR GERARDO                  ","08DPT0007X",null,null,null,null,null,null,0,168,0,null,null,null,null,null,null,0,168,0,26338.546400000003]
[null,"CHIHUAHUA","GAJE670908MV9","GAJE670908HDGLRV06","GALVAN JUAREZ EVARISTO","08DPT0007X",null,null,null,null,null,null,0,240,0,null,null,null,null,null,null,0,240,0,33201.370000000003]
[null,"CHIHUAHUA","GAMY7604228L5","GAMY760422MDGLXL00","GALVAN MUÑOZ YOLANDA ALEJANDRA","08DPT0007X",null,null,null,null,null,null,0,216,0,null,null,null,null,null,null,0,216,0,32320.336800000001]
[null,"CHIHUAHUA","GAOR861127BG3","GAOR861127MCHMNQ19","GAMBOA ONTIVEROS RAQUEL","08DPT0007X",null,null,null,null,null,null,0,216,0,null,null,null,null,null,null,0,216,0,36196.806799999998]
[null,"CHIHUAHUA","GAAN631226D5A","GAAN631226MCHNNR03","GANDARA ANGUIANO NORMA","08DPT0007X",null,null,null,null,null,null,0,240,0,null,null,null,null,null,null,0,240,0,34380.642]
[null,"CHIHUAHUA","GARA6105276N5","GARA610527HCHRZL00","GARAY RUIZ JOSE ALFONSO","08DPT0007X",null,null,null,null,null,null,0,240,0,null,null,null,null,null,null,0,240,0,38640.831999999995]
[null,"CHIHUAHUA","GOTD6910121D1","GOTD691012MCHMVY06","GOMEZ TAVARES DEYANIRA","08DPT0007X",null,null,null,null,null,null,0,120,0,null,null,null,null,null,null,0,120,0,19320.415999999997]
[null,"CHIHUAHUA","GOGG8703244X4","GOGG870324MCHNNB07","GONZALEZ GANDARA GABRIELA ALEJANDRA","08DPT0007X",null,null,null,null,null,null,0,204,0,null,null,null,null,null,null,0,204,0,18744.584649999997]
[null,"CHIHUAHUA","GONM640214JC7","GONM640214HJCNVG03","GONZÁLEZ NAVA MIGUEL","08DPT0007X",null,null,null,null,null,null,0,216,0,null,null,null,null,null,null,0,216,0,27290.376974999999]
[null,"CHIHUAHUA","GUCH710602IC3","GUCH710602HCHTSC09","GUTIERREZ CISNEROS HECTOR","08DPT0007X",null,null,null,null,null,null,0,192,0,null,null,null,null,null,null,0,192,0,3637.2]
[null,"CHIHUAHUA","HEPR900403KQ2","HEPR900403HCHRRC03","HERNANDEZ PEREZ RICARDO","08DPT0007X",null,null,null,null,null,null,0,120,0,null,null,null,null,null,null,0,120,0,19320.415999999997]
[null,"CHIHUAHUA","HEMA6604046K4","HEMA660404HCHRXN05","HERRERA MUÑOZ JOSE ANGEL","08DPT0007X",null,null,null,null,null,null,0,240,0,null,null,null,null,null,null,0,240,0,38640.831999999995]
[null,"CHIHUAHUA","HEOS840726F25","HEOS840726HCHRGR06","HERRERA OGAZ SERGIO ARTURO","08DPT0007X",null,null,null,null,null,null,0,240,0,null,null,null,null,null,null,0,240,0,38640.831999999995]
[null,"CHIHUAHUA","HOAG621120KT8","HOAG621120MCHLVB08","HOLGUIN AVILA GABRIELA ALEJANDRA","08DPT0007X",null,null,null,null,null,null,0,216,0,null,null,null,null,null,null,0,216,0,30226.705774999999]
[null,"CHIHUAHUA","HUJD820323M58","HUJD820323HMCRMN01","HUERTA JIMENEZ DANIEL","08DPT0007X",null,null,null,null,null,null,0,156,0,null,null,null,null,null,null,0,156,0,13452.718849999999]
[null,"CHIHUAHUA","LOHA840518CS8","LOHA840518HCHPRL07","LOPEZ HERNANDEZ ALBERTO","08DPT0007X",null,null,null,null,null,null,0,216,0,null,null,null,null,null,null,0,216,0,29609.585775000003]
[null,"CHIHUAHUA","LOGM9410315T5","LOGM941031HVZRNL01","LORENZO GONZALEZ MELESIO","08DPT0007X",null,null,null,null,null,null,0,216,0,null,null,null,null,null,null,0,216,0,9414.9760999999999]
[null,"CHIHUAHUA","MAVA850717159","MAVA850717MCHCLL06","MACÍAS VELAZQUEZ ALEJANDRA","08DPT0007X",null,null,null,null,null,null,0,240,0,null,null,null,null,null,null,0,240,0,38640.831999999995]
[null,"CHIHUAHUA","MAER720708DH1","MAXE720708MCHNXR00","MANCHA ERIKA SELENE","08DPT0007X",null,null,null,null,null,null,0,228,0,null,null,null,null,null,null,0,228,0,34578.689400000003]
[null,"CHIHUAHUA","MAOD8107099T0","MAOD810709HCHRLN01","MARQUEZ OLIVAS DANIEL ANTONIO","08DPT0007X",null,null,null,null,null,null,0,240,0,null,null,null,null,null,null,0,240,0,29715.917750000001]
[null,"CHIHUAHUA","MARS830130RA7","MARS830130HCHRVR05","MARTINEZ RIVERA SERGIO ALONSO","08DPT0007X",null,null,null,null,null,null,0,120,0,null,null,null,null,null,null,0,120,0,19320.415999999997]
[null,"CHIHUAHUA","MALA850527KR1","MALA850527HTLTCN04","MATUS LECOURTOIS ANDRES ISAAC","08DPT0007X",null,null,null,null,null,null,0,120,0,null,null,null,null,null,null,0,120,0,17588.143875000002]
[null,"CHIHUAHUA","MESO501218RY9","MESO501218HJCNLS04","MENDOZA SALAS OSCAR  IGNAC IO","08DPT0007X",null,null,null,null,null,null,0,240,0,null,null,null,null,null,null,0,240,0,35090.671999999999]
[null,"CHIHUAHUA","MESS970703G31","MESS970703MCHNGL02","MENDOZA SEGOVIA SALMA YESENIA","08DPT0007X",null,null,null,null,null,null,0,108,0,null,null,null,null,null,null,0,108,0,3542.7]
[null,"CHIHUAHUA","MESB8507159W0","MESB850715HCHNRN00","MENDOZA SORIANO BENJAMIN ALEJANDRO","08DPT0007X",null,null,null,null,null,null,0,240,0,null,null,null,null,null,null,0,240,0,38640.831999999995]
[null,"CHIHUAHUA","MOAJ681102IQ0","MOAJ681102HCHNGS07","MONTES AGUILAR JESUS GERARDO","08DPT0007X",null,null,null,null,null,null,0,216,0,null,null,null,null,null,null,0,216,0,27290.376974999999]
[null,"CHIHUAHUA","MOMM791027B8A","MOMM791027MCHRRY08","MORALES MORENO MAYRA MARGARITA","08DPT0007X",null,null,null,null,null,null,0,228,0,null,null,null,null,null,null,0,228,0,35998.749400000008]
[null,"CHIHUAHUA","NEVI930902L97","NEVI930902MVZRRM00","NERI VARGAS IMELDA","08DPT0007X",null,null,null,null,null,null,0,156,0,null,null,null,null,null,null,0,156,0,9162.6850374999995]
[null,"CHIHUAHUA","OEPH7911267A5","OEPH791126HCHRNC09","ORNELAS DEL PINO HECTOR RICARDO","08DPT0007X",null,null,null,null,null,null,0,216,0,null,null,null,null,null,null,0,216,0,28375.315775000003]
[null,"CHIHUAHUA","OOMB8207037W4","OOMB820703HCHRLN09","OROZCO MONTES BLAS","08DPT0007X",null,null,null,null,null,null,0,216,0,null,null,null,null,null,null,0,216,0,12686.776974999999]
[null,"CHIHUAHUA","OIGC960301QQA","OIGC960301HCHRNR04","ORTIZ GONZALEZ CARLOS ANDRES","08DPT0007X",null,null,null,null,null,null,0,216,0,null,null,null,null,null,null,0,216,0,10964.286099999999]
[null,"CHIHUAHUA","OIGA8509273I1","OIGA850927HCHRTL04","ORTIZ GUTIERREZ JOSE ALBERTO","08DPT0007X",null,null,null,null,null,null,0,180,0,null,null,null,null,null,null,0,180,0,24591.189000000002]
[null,"CHIHUAHUA","PEME750130UP9","PEME750130HCHRRR00","PEREZ MARTINEZ ERICK DAVID","08DPT0007X",null,null,null,null,null,null,0,216,0,null,null,null,null,null,null,0,216,0,30606.225774999999]
[null,"CHIHUAHUA","PERL8208024K1","PERL820802MCHRMR03","PEREZ RAMOS LAURA ANGELICA","08DPT0007X",null,null,null,null,null,null,0,228,0,null,null,null,null,null,null,0,228,0,35619.229400000004]
[null,"CHIHUAHUA","PESD840502CP3","PESD840502HCHRCG00","PEREZ SAUCEDO DIEGO ALEJANDRO","08DPT0007X",null,null,null,null,null,null,0,180,0,null,null,null,null,null,null,0,180,0,22286.970980000002]
[null,"CHIHUAHUA","POMJ860826TB2","POMJ860826HCHRDN05","PORRAS MEDINA JUAN CARLOS","08DPT0007X",null,null,null,null,null,null,0,240,0,null,null,null,null,null,null,0,240,0,37930.792000000001]
[null,"CHIHUAHUA","RIBG810102KB8","RIBG810102MCHVRR02","RIVAS BARRAGAN GRACIELA","08DPT0007X",null,null,null,null,null,null,0,204,0,null,null,null,null,null,null,0,204,0,29164.578787499999]
[null,"CHIHUAHUA","ROMP8008014S4","ROMP800801MCSBZT07","ROBLERO MAZARIEGOS PATRICIA","08DPT0007X",null,null,null,null,null,null,0,240,0,null,null,null,null,null,null,0,240,0,32960.582000000002]
[null,"CHIHUAHUA","ROCG680807P47","ROCG680807MCLLSR09","ROLDAN CASTILLO GRISELDA","08DPT0007X",null,null,null,null,null,null,0,169,0,null,null,null,null,null,null,0,169,0,29178.666400000006]
[null,"CHIHUAHUA","RUGA7605108F9","RUGA760510MCHVTN01","RUVALCABA GUTIERREZ MARIA ANTONIETA","08DPT0007X",null,null,null,null,null,null,0,180,0,null,null,null,null,null,null,0,180,0,20868.984812499999]
[null,"CHIHUAHUA","SAMR880304CG8","SAMR880304HCHLXF03","SALAS MUÑOZ RAFAEL","08DPT0007X",null,null,null,null,null,null,0,180,0,null,null,null,null,null,null,0,180,0,19073.930812500003]
[null,"CHIHUAHUA","SAFA580219G58","SAFA580219HVZMLL08","SAMARIO FLORES ALVARO","08DPT0007X",null,null,null,null,null,null,0,240,0,null,null,null,null,null,null,0,240,0,38640.831999999995]
[null,"CHIHUAHUA","SAOA880909JJ6","SAOA880909HOCMSL00","SAMARIO OSORIO ALVARO OSCAR","08DPT0007X",null,null,null,null,null,null,0,240,0,null,null,null,null,null,null,0,240,0,29169.89775]
[null,"CHIHUAHUA","SAON851028RE1","SAON851028MVZMSL07","SAMARIO OSORIO NALLELY","08DPT0007X",null,null,null,null,null,null,0,96,0,null,null,null,null,null,null,0,96,0,12184.5131]
[null,"CHIHUAHUA","SAEO910403QK8","SAEO910403HNLNSS08","SANCHEZ ESTRADA OSCAR IVAN","08DPT0007X",null,null,null,null,null,null,0,216,0,null,null,null,null,null,null,0,216,0,26744.326975000004]
[null,"CHIHUAHUA","SEEI760505188","SEEI760505MCHRSL09","SERRATOS ESPARZA ILSE","08DPT0007X",null,null,null,null,null,null,0,216,0,null,null,null,null,null,null,0,216,0,34066.716800000002]
[null,"CHIHUAHUA","TAVY911105KV5","TAVY911105MCHGNS05","TAGLE VENZOR YASSMIN","08DPT0007X",null,null,null,null,null,null,0,228,0,null,null,null,null,null,null,0,228,0,32523.102762500002]
[null,"CHIHUAHUA","TENA800305KZ2","TENA800305HCHJVN00","TEJADA NEVAREZ ANGEL ADRIAN","08DPT0007X",null,null,null,null,null,null,0,216,0,null,null,null,null,null,null,0,216,0,36196.806799999998]
[null,"CHIHUAHUA","TORE8012234Y9","TORE801223HNTPYD08","TOPETE REYES EDGAR","08DPT0007X",null,null,null,null,null,null,0,240,0,null,null,null,null,null,null,0,240,0,38640.831999999995]
[null,"CHIHUAHUA","TOCJ650407CT0","TOCJ650407HVZRNS07","TORRES CANTERO JOSE","08DPT0007X",null,null,null,null,null,null,0,240,0,null,null,null,null,null,null,0,240,0,38640.831999999995]
[null,"CHIHUAHUA","TORN791114PY6","TORN791114MCHRYD07","TORRES REY NADIA MARIA","08DPT0007X",null,null,null,null,null,null,0,240,0,null,null,null,null,null,null,0,240,0,37220.762000000002]
[null,"CHIHUAHUA","UUAR860131EV3","UUAR860131HCHRRF06","URTUZUASTEGUI ARZOLA RAFAEL","08DPT0007X",null,null,null,null,null,null,0,240,0,null,null,null,null,null,null,0,240,0,38640.831999999995]
[null,"CHIHUAHUA","VAAF840608FK3","VAAF840608HCHZCR03","VAZQUEZ ACEVEDO FERNANDO","08DPT0007X",null,null,null,null,null,null,0,228,0,null,null,null,null,null,null,0,228,0,32523.102762500002]
[null,"CHIHUAHUA","VIAS640217RZ1","VIAS640217HCHLGL08","VILLALOBOS AGUIRRE SAUL","08DPT0007X",null,null,null,null,null,null,0,228,0,null,null,null,null,null,null,0,228,0,31906.002930000002]
[null,"CHIHUAHUA","VIGR720403880","VIGR720403HVZLBC14","VILLARAUZ GABINO RICARDO","08DPT0007X",null,null,null,null,null,null,0,240,0,null,null,null,null,null,null,0,240,0,37930.792000000001]
[null,"CHIHUAHUA","AUED570608MR1","AUED570608HZSGSN08","DANIEL AGUILAR ESPARZA","08DPT0008W",null,null,null,1,0,0,null,null,null,null,null,null,null,null,null,1,0,0,56184.369999999995]
[null,"CHIHUAHUA","BESJ800501RQ3","BESJ800501HCLRLL06","JULIO CESAR BERNAL SALAS","08DPT0008W",null,null,null,1,0,0,null,null,null,null,null,null,null,null,null,1,0,0,99630.15]
[null,"CHIHUAHUA","EOCA6608284C4","EOCA660828HCHSRG02","ESCOBAR CERVANTES AGUSTIN","08DPT0008W",null,null,null,1,0,0,null,null,null,null,null,null,null,null,null,1,0,0,38348.18]
[null,"CHIHUAHUA","EOHE660901TLA","EOHE660901MCHSLV04","EVA MARIA ESCOBAR HOLGUIN","08DPT0008W",null,null,null,1,0,0,null,null,null,null,null,null,null,null,null,1,0,0,51595.979999999996]
[null,"CHIHUAHUA","HEGA690525I40","HEGA690525MCHRRL02","ALICIA HERNANDEZ GARCIA","08DPT0008W",null,null,null,1,0,0,null,null,null,null,null,null,null,null,null,1,0,0,51209.229999999996]
[null,"CHIHUAHUA","HEGE6610076V0","HEGE661007MSIRLG06","MARIA EUGENIA HERRERA  GOLARTE","08DPT0008W",null,null,null,1,0,0,null,null,null,null,null,null,null,null,null,1,0,0,120622.58]
[null,"CHIHUAHUA","ROAC671104HB5","MALM890515HCHTCR05","MARIO ALBERTO MATA LICON","08DPT0008W",null,null,null,null,null,null,null,null,null,null,null,null,1,0,0,1,0,0,85992.48]
[null,"CHIHUAHUA","MEMF660302UM0","MEMF660302HCHNLD06","FEDERICO MENDOZA MOLINAR","08DPT0008W",null,null,null,1,0,0,null,null,null,null,null,null,null,null,null,1,0,0,60268.25]
[null,"CHIHUAHUA","MOAG600916JW6","MOAG600916HCHYCL04","MOY ACOSTA GUILLERMO","08DPT0008W",null,null,null,null,null,null,null,null,null,null,null,null,1,0,0,1,0,0,66459.899999999994]
[null,"CHIHUAHUA","OOVM6504302T1","OOVM650430HCHRLS07","MOISES OROZCO VALDEZ","08DPT0008W",null,null,null,1,0,0,null,null,null,null,null,null,null,null,null,1,0,0,58134.2]
[null,"CHIHUAHUA","PANA720117JW4","PANA720117HDGLVN01","ANTONIO PALMA NEVAREZ","08DPT0008W",null,null,null,1,0,0,null,null,null,null,null,null,null,null,null,1,0,0,50823.85]
[null,"CHIHUAHUA","PAHA640330KP3","PAHA640330MCHYLR06","ARMIDA IRENE PAYAN HOLGUIN","08DPT0008W",null,null,null,1,0,0,null,null,null,null,null,null,null,null,null,1,0,0,139520.46000000002]
[null,"CHIHUAHUA","POAJ710301PK6","POAJ710301MCHRLS06","MARIA DE JESUS PORTILLO ALARCON","08DPT0008W",null,null,null,1,0,0,null,null,null,null,null,null,null,null,null,1,0,0,41835.350000000006]
[null,"CHIHUAHUA","RIGR710129FB6","RIGR710129MCHVRQ06","RAQUEL ERENDIRA RIVERA GARCIA","08DPT0008W",null,null,null,1,0,0,null,null,null,null,null,null,null,null,null,1,0,0,54215.020000000004]
[null,"CHIHUAHUA","ROGJ660820EP3","ROGJ660820HCHDNN02","JOSE JUAN RODRIGUEZ GONZALEZ","08DPT0008W",null,null,null,1,0,0,null,null,null,null,null,null,null,null,null,1,0,0,15170.08]
[null,"CHIHUAHUA","SAML750404ND1","SAML750404MCHNXZ07","SAENZ MUNOZ LUZ MARIA","08DPT0008W",null,null,null,1,0,0,null,null,null,null,null,null,null,null,null,1,0,0,34595.550000000003]
[null,"CHIHUAHUA","TAHJ7109304KA","TAHJ710930HCHRLV01","JAVIER EUSEBIO TARANGO HOLGUIN","08DPT0008W",null,null,null,1,0,0,null,null,null,null,null,null,null,null,null,1,0,0,123269.63999999998]
[null,"CHIHUAHUA","VARJ610925H36","VARJ610925HCHLSS00","JESUS ANTONIO VALDEZ ROSALES","08DPT0008W",null,null,null,1,0,0,null,null,null,null,null,null,null,null,null,1,0,0,42403.7]
[null,"CHIHUAHUA","VEGR750904UR2","VEGR750904MCHLRS06","ROSALIA MARGARITA VELARDE GARCIA","08DPT0008W",null,null,null,1,0,0,null,null,null,null,null,null,null,null,null,1,0,0,88771.300000000017]
[null,"CHIHUAHUA","VARO691222JA8","VAXR691222MCHLXS07","ROSA MARIA VALENZUELA","08DPT0008W",null,null,null,null,null,null,0,"216",0,null,null,null,null,null,null,0,"216",0,31447.09]
[null,"CHIHUAHUA","AUMM780328A31","AUMM780328MCHGLN09","MINERVA AGUILAR MOLINAR","08DPT0008W",null,null,null,null,null,null,0,228,0,null,null,null,null,null,null,0,228,0,33631.089999999997]
[null,"CHIHUAHUA","AEGL800105RF6","AEGL800105MCHLNZ06","LIZETTE JOHANNA ALEJANDRO GONZALEZ","08DPT0008W",null,null,null,null,null,null,0,216,0,null,null,null,null,null,null,0,216,0,32620.949999999997]
[null,"CHIHUAHUA","AAGJ670423U8A","AAGJ670423HCHMNR05","JORGE AMPARAN GONZALEZ","08DPT0008W",null,null,null,null,null,null,0,228,0,null,null,null,null,null,null,0,228,0,30931.089999999997]
[null,"CHIHUAHUA","AESS721002N67","AESS721002MCHRTS00","SUSANA ARMENDARIZ SOTO","08DPT0008W",null,null,null,null,null,null,0,240,0,null,null,null,null,null,null,0,240,0,34641.21]
[null,"CHIHUAHUA","BAVM821203FN0","BAVM821203MCHRLN06","MONICA LOURDES BARRAZA VILLALOBOS","08DPT0008W",null,null,null,null,null,null,0,240,0,null,null,null,null,null,null,0,240,0,34641.21]
[null,"CHIHUAHUA","CAVS820702FV1","CAVS820702MCHRRN01","SANDRA ELIZABETH CARDENAS VARGAS","08DPT0008W",null,null,null,null,null,null,0,216,0,null,null,null,null,null,null,0,216,0,26959.149999999998]
[null,"CHIHUAHUA","ROMJ731201675","CANA840815MCHRVN00","ANA ISABEL CARREON NAVA","08DPT0008W",null,null,null,null,null,null,0,240,0,null,null,null,null,null,null,0,240,0,29218.280000000002]
[null,"CHIHUAHUA","MUMP8911284K8","COMR940524HCHNRD00","CONTRERAS MARTINEZ RODOLFO","08DPT0008W",null,null,null,null,null,null,0,240,0,null,null,null,null,null,null,0,240,0,17772]
[null,"CHIHUAHUA","COFA750408JB9","COFA750408MCHRRZ08","AZUCENA CORRAL FRANCO","08DPT0008W",null,null,null,null,null,null,0,216,0,null,null,null,null,null,null,0,216,0,30860.16]
[null,"CHIHUAHUA","DIHL770620B93","DIHL770620MCHZRZ06","LUZ IMELDA DIAZ HERNANDEZ","08DPT0008W",null,null,null,null,null,null,0,240,0,null,null,null,null,null,null,0,240,0,34641.21]
[null,"CHIHUAHUA","DUMJ9006174T4","DUMJ900617MCHRRS05","MARIA JOSE DURAN MARQUEZ","08DPT0008W",null,null,null,null,null,null,0,216,0,null,null,null,null,null,null,0,216,0,7009.4]
[null,"CHIHUAHUA","GASJ850822GF7","GASJ850822HCHLNS04","JOSE GALVEZ SANTANA","08DPT0008W",null,null,null,null,null,null,0,216,0,null,null,null,null,null,null,0,216,0,31970.949999999997]
[null,"CHIHUAHUA","GASA8103319V2","GASA810331MCHRRD08","ADRIANA GARDEA SERRANO","08DPT0008W",null,null,null,null,null,null,0,240,0,null,null,null,null,null,null,0,240,0,29726.83]
[null,"CHIHUAHUA","GULM750313628","GULM750313HCHLNN08","MANUEL ALEJANDRO GULLEN LUNA","08DPT0008W",null,null,null,null,null,null,0,204,0,null,null,null,null,null,null,0,204,0,30373.890000000003]
[null,"CHIHUAHUA","HEAJ8610295N1","HEAJ861029HCHRCN09","JUAN CARLOS HERNANDEZ ACOSTA ","08DPT0008W",null,null,null,null,null,null,0,"228",0,null,null,null,null,null,null,0,"228",0,32981.089999999997]
[null,"CHIHUAHUA","HEGE760311918","HEGE760311HCHRTF05","EFRAIN ARTURO HERNANDEZ GUTIERREZ","08DPT0008W",null,null,null,null,null,null,0,240,0,null,null,null,null,null,null,0,240,0,18104.919999999998]
[null,"CHIHUAHUA","LAGL840311IS1","LAGL840311MCHRMZ07","LIZBETH LARES GOMEZ","08DPT0008W",null,null,null,null,null,null,0,240,0,null,null,null,null,null,null,0,240,0,7788.22]
[null,"CHIHUAHUA","MAML7703077T7","MALM770307MCHCRS01","LESSLEY MYRLEE MACIAS MARTINEZ","08DPT0008W",null,null,null,null,null,null,0,240,0,null,null,null,null,null,null,0,240,0,34117.360000000001]
[null,"CHIHUAHUA","MAEJ690219AK2","MAEJ690219HCHRSS06","JESUS MARTINEZ ESPARZA","08DPT0008W",null,null,null,null,null,null,0,240,0,null,null,null,null,null,null,0,240,0,32356.57]
[null,"CHIHUAHUA","MECO5508271G3","MECO550827MSLXSL09","MEXIA CASTRO OLGA PATRICIA","08DPT0008W",null,null,null,null,null,null,0,240,0,null,null,null,null,null,null,0,240,0,34641.21]
[null,"CHIHUAHUA","MOGE730414EA4","MOGE730414HCHRRL09","MORENO GARCIA ELISEO","08DPT0008W",null,null,null,null,null,null,0,240,0,null,null,null,null,null,null,0,240,0,26422.34]
[null,"CHIHUAHUA","MUMP8911284K8","MUMP891128HCHXXS06","PASCUAL ABRAHAM MUÑOZ MUÑOZ","08DPT0008W",null,null,null,null,null,null,0,"240",0,null,null,null,null,null,null,0,"240",0,29726.83]
[null,"CHIHUAHUA","NAHJ790815BF0","NAHJ790815HCHVRS00","JESUS MIGUEL NAVARRO HERNANDEZ","08DPT0008W",null,null,null,null,null,null,0,"216",0,null,null,null,null,null,null,0,"216",0,22617.21]
[null,"CHIHUAHUA","OIGM890424IC1","OIGM890424MCHLRR06","MARTA ALEJANDRA OLIVAS GUERRERO","08DPT0008W",null,null,null,null,null,null,0,"240",0,null,null,null,null,null,null,0,"240",0,32754.28]
[null,"CHIHUAHUA","OINS5902223YA","OINS590222HMNLXL02","OLIVO NUÑEZ JOSE SALVADOR","08DPT0008W",null,null,null,null,null,null,0,"240",0,null,null,null,null,null,null,0,"240",0,34641.21]
[null,"CHIHUAHUA","PAVF6602076Y9","PAVF660207MCHLRL06","PALMA VARGAS FLOR","08DPT0008W",null,null,null,null,null,null,0,"216",0,null,null,null,null,null,null,0,"216",0,16264.8]
[null,"CHIHUAHUA","GORS7911246K4","PAVF661205HCHTRC01","PATENA FIERRO VICTOR MANUEL","08DPT0008W",null,null,null,null,null,null,0,"216",0,null,null,null,null,null,null,0,"216",0,26959.149999999998]
[null,"CHIHUAHUA","RATV881128H34","RATV881128HCHMRC05","VICTOR HUGO RAMIREZ","08DPT0008W",null,null,null,null,null,null,0,"180",0,null,null,null,null,null,null,0,"180",0,5841.17]
[null,"CHIHUAHUA","RERP770809FK9","RERP770809HCHDDD04","PEDRO OSWALDO REDE RODRIGUEZ","08DPT0008W",null,null,null,null,null,null,0,"240",0,null,null,null,null,null,null,0,"240",0,30767.360000000001]
[null,"CHIHUAHUA","REVY780409NT1","REVY780409MCHYLZ05","YASMIN LISSET REYES VALLES","08DPT0008W",null,null,null,null,null,null,0,"216",0,null,null,null,null,null,null,0,"216",0,24909.16]
[null,"CHIHUAHUA","RIGJ610311956","RIGJ610311HDFVRL08","JOEL RAUL RIVAS GARCIA","08DPT0008W",null,null,null,null,null,null,0,"240",0,null,null,null,null,null,null,0,"240",0,29359.699999999997]
[null,"CHIHUAHUA","ROGR680108PWA","ROGR680108HCHDRC09","RICARDO RODRIGUEZ GARCIA","08DPT0008W",null,null,null,null,null,null,0,"228",0,null,null,null,null,null,null,0,"228",0,34281.089999999997]
[null,"CHIHUAHUA","ROTC8606147UI","ROTC860614MCHDLY03","RODRIGUEZ TALAMANTES CYNTHIA","08DPT0008W",null,null,null,null,null,null,0,"120",0,null,null,null,null,null,null,0,"120",0,1884]
[null,"CHIHUAHUA","SADR840831726","SADR840831HCHNZM02","RAMON AGUSTO SANCHEZ DIAZ","08DPT0008W",null,null,null,null,null,null,0,"120",0,null,null,null,null,null,null,0,"120",0,18020.599999999999]
[null,"CHIHUAHUA","SARJ650111CB4","SARJ650111HCHNVM05","JAIME SANCHEZ RIVERA","08DPT0008W",null,null,null,null,null,null,0,"120",0,null,null,null,null,null,null,0,"120",0,15970.6]
[null,"CHIHUAHUA","VAVS740521TK5","VAVS740521HCHLLL09","SAUL ARMANDO VALLES VALLE","08DPT0008W",null,null,null,null,null,null,0,"180",0,null,null,null,null,null,null,0,"180",0,14267.5]
[null,"CHIHUAHUA","VICG5002047Q6","VICG500204HCHTRL01","GILBERTO FELICIANO VITELA CARRASCO","08DPT0008W",null,null,null,null,null,null,0,"240",0,null,null,null,null,null,null,0,"240",0,34641.21]
[null,"CHIHUAHUA","CAMC8511068L5","CAMC851106MCHRRR00","CARMEN IVONNE CARMONA MURILLO","08DPT0012I",null,null,null,1,0,0,null,null,null,null,null,null,null,null,null,1,0,0,33059.26]
[null,"CHIHUAHUA","CAJG690110UD1","CAJG690110HCHHRN00","GONZALO CHAVEZ JUAREZ","08DPT0012I",null,null,null,1,0,0,null,null,null,null,null,null,null,null,null,1,0,0,80752.67]
[null,"CHIHUAHUA","COVC830703U30","COVC830703MCHRZY01","CYNTHIA ROSARIO CORONADO VAZQUEZ","08DPT0012I",null,null,null,1,0,0,null,null,null,null,null,null,null,null,null,1,0,0,105799.47]
[null,"CHIHUAHUA","EIRL670407TS6","EIRL670407MCHNDT08","LETICIA ENRIQUEZ RODRIGUEZ","08DPT0012I",null,null,null,1,0,0,null,null,null,null,null,null,null,null,null,1,0,0,140913.65000000002]
[null,"CHIHUAHUA","GACI7107098NA","GACI710709MCHRRM01","IMELDA IVONE GARCIA CARMONA","08DPT0012I",null,null,null,1,0,0,null,null,null,null,null,null,null,null,null,1,0,0,57669.380000000005]
[null,"CHIHUAHUA","GOMB690116428","GOMB690116MCHNRL02","BELIA LORENA GONZALEZ  MORENO","08DPT0012I",null,null,null,1,0,0,null,null,null,null,null,null,null,null,null,1,0,0,49299.979999999996]
[null,"CHIHUAHUA","IAMM880831RY4","IAMM880831MCHZRR03","MAR ELISA IZAGUIRRE MARTINEZ","08DPT0012I",null,null,null,1,0,0,null,null,null,null,null,null,null,null,null,1,0,0,44177.179999999993]
[null,"CHIHUAHUA","LECG700827GY1","LECG700827MCHCHL00","GLORIA A LECHUGA CHAVEZ","08DPT0012I",null,null,null,1,0,0,null,null,null,null,null,null,null,null,null,1,0,0,91925.81]
[null,"CHIHUAHUA","LOLJ670723J90","LOLJ670723HCHPZV05","JAVIER LOPEZ LOZANO","08DPT0012I",null,null,null,1,0,0,null,null,null,null,null,null,null,null,null,1,0,0,33059.26]
[null,"CHIHUAHUA","MAAS821018113","MAAS821018HCHRNG05","SIGIFREDO MARQUEZ ANCHONDO","08DPT0012I",null,null,null,1,0,0,null,null,null,null,null,null,null,null,null,1,0,0,51926.369999999995]
[null,"CHIHUAHUA","MAQS651014TH4","MAQS651014HCHRNL03","SAUL MARQUEZ QUINTANA","08DPT0012I",null,null,null,1,0,0,null,null,null,null,null,null,null,null,null,1,0,0,38262.89]
[null,"CHIHUAHUA","PEDR620906HG6","PEDR620906HCHRMM07","RAMON JAVIER PEREZ DOMINGUEZ","08DPT0012I",null,null,null,null,null,null,null,null,null,null,null,null,1,0,0,1,0,0,85992.48]
[null,"CHIHUAHUA","ROCR700830F58","ROCR700830HCHDNC08","RICARDO ANTELMO RODRIGUEZ CANO","08DPT0012I",null,null,null,1,0,0,null,null,null,null,null,null,null,null,null,1,0,0,43624.43]
[null,"CHIHUAHUA","ROTF760823LY5","ROTF760823MCHDRL03","FLOR GUADALUPE RODRIGUEZ TREJO","08DPT0012I",null,null,null,1,0,0,null,null,null,null,null,null,null,null,null,1,0,0,50202.86]
[null,"CHIHUAHUA","SOMD561124TEA","SOMD561124HCHTDV09","DAVID SOTELO MEDRANO","08DPT0012I",null,null,null,1,0,0,null,null,null,null,null,null,null,null,null,1,0,0,54136.1]
[null,"CHIHUAHUA","TERL781019J60","TERL781019HCHNDS08","LUIS CARLOS TENA RODELAS","08DPT0012I",null,null,null,1,0,0,null,null,null,null,null,null,null,null,null,1,0,0,51448.200000000004]
[null,"CHIHUAHUA","UIST6008045JA","UIST600804HDGRMM07","TOMAS URBINA SIMENTAL","08DPT0012I",null,null,null,1,0,0,null,null,null,null,null,null,null,null,null,1,0,0,58264.479999999996]
[null,"CHIHUAHUA","VAGA800112LSA","VAGA800112HCHLTL07","ALBERTO VALENZUELA GUTIERREZ","08DPT0012I",null,null,null,1,0,0,null,null,null,null,null,null,null,null,null,1,0,0,46375.45]
[null,"CHIHUAHUA","AARP7710257KA","AARP771025MCHLZL02","PALMA LILIANA ALMANZA RUIZ","08DPT0012I",null,null,null,null,null,null,0,168,0,null,null,null,null,null,null,0,168,0,25058.85]
[null,"CHIHUAHUA","AAOG811026Q47","AAOG811026MCHRRB02","GABRIELA MARIA ARAGON ORTIZ","08DPT0012I",null,null,null,null,null,null,0,240,0,null,null,null,null,null,null,0,240,0,33341.21]
[null,"CHIHUAHUA","AEGL940102TD8","AEGL940102HCHRNS03","LUIS DANIEL ARMENDARIZ GONZALEZ","08DPT0012I",null,null,null,null,null,null,0,144,0,null,null,null,null,null,null,0,144,0,7009.47]
[null,"CHIHUAHUA","BALL820222AW6","BALL820222HCHYNR00","LORENZO ANTONIO BAYLON DE LEON","08DPT0012I",null,null,null,null,null,null,0,180,0,null,null,null,null,null,null,0,180,0,8761.84]
[null,"CHIHUAHUA","CARE8810091J2","CARE881009HCHRMD08","EDGAR ENRIQUE CARREON RAMOS","08DPT0012I",null,null,null,null,null,null,0,228,0,null,null,null,null,null,null,0,228,0,33694.160000000003]
[null,"CHIHUAHUA","CACP850903KT2","CACP850903MCHHHR00","PERLA JAZMIN CHAIREZ CHACON","08DPT0012I",null,null,null,null,null,null,0,216,0,null,null,null,null,null,null,0,216,0,32097.09]
[null,"CHIHUAHUA","CAMN760505UE4","CAMN760505MCHHNN03","NANCY LORENA CHAVEZ MONCADA","08DPT0012I",null,null,null,null,null,null,0,180,0,null,null,null,null,null,null,0,180,0,27242.84]
[null,"CHIHUAHUA","PEMC8412061M5","PEMC841206HCHXRR02","CARLOS DE LA PEÑA MERAZ","08DPT0012I",null,null,null,null,null,null,0,240,0,null,null,null,null,null,null,0,240,0,16711]
[null,"CHIHUAHUA","DOCE610806AJ3","DOCE610806MCHMMS03","ESPERANZA DOMINGUEZ CAMUÑEZ","08DPT0012I",null,null,null,null,null,null,0,240,0,null,null,null,null,null,null,0,240,0,25772.34]
[null,"CHIHUAHUA","DOTW8710023S3","DOTW871002HCHMRL06","WALTER ALEJANDRO DOMINGUEZ TORRES","08DPT0012I",null,null,null,null,null,null,0,192,0,null,null,null,null,null,null,0,192,0,27016.04]
[null,"CHIHUAHUA","DUIA911217JM8","DUIA911217HCHRBR05","ARMANDO ALEXIS DUARTE IBARRA","08DPT0012I",null,null,null,null,null,null,0,240,0,null,null,null,null,null,null,0,240,0,29726.83]
[null,"CHIHUAHUA","EIRK930402BZ7","EIRK930402MCHNDR04","KARINA LIZETH ENRIQUEZ RODRIGUEZ","08DPT0012I",null,null,null,null,null,null,0,216,0,null,null,null,null,null,null,0,216,0,21625.68]
[null,"CHIHUAHUA","EACL761108IA6","EACL761108HCHSHS08","JOSE LUIS ESTRADA CHAVEZ","08DPT0012I",null,null,null,null,null,null,0,168,0,null,null,null,null,null,null,0,168,0,14073.44]
[null,"CHIHUAHUA","FITM7609208P9","FITM760920MCHGVR05","MARISOL FIGUEROA TOVAR","08DPT0012I",null,null,null,null,null,null,0,216,0,null,null,null,null,null,null,0,216,0,32097.09]
[null,"CHIHUAHUA","GAMC820716BJ4","GAMC820716MCHLRR08","MARIA DEL CARMEN GALLEGOS MARTINEZ","08DPT0012I",null,null,null,null,null,null,0,240,0,null,null,null,null,null,null,0,240,0,35291.21]
[null,"CHIHUAHUA","GOCS820528T91","GOCS820528MCHNLN05","SANDRA BERENICE GONZALEZ COLMENERO","08DPT0012I",null,null,null,null,null,null,0,240,0,null,null,null,null,null,null,0,240,0,35291.21]
[null,"CHIHUAHUA","GOGG631226J88","GOGG631226MCHNLL06","GLORIA MARINA GONZALEZ GALLEGOS","08DPT0012I",null,null,null,null,null,null,0,240,0,null,null,null,null,null,null,0,240,0,34641.21]
[null,"CHIHUAHUA","GOQM960413969","GOQM960413HCHNXR03","MARCO ANTONIO GONZALEZ QUIÑONEZ","08DPT0012I",null,null,null,null,null,null,0,192,0,null,null,null,null,null,null,0,192,0,16866.61]
[null,"CHIHUAHUA","GAMO630830H94","GAMO630830MCHRRL07","OLGA CECILIA GRAJEDA  MIRAMONTES","08DPT0012I",null,null,null,null,null,null,0,240,0,null,null,null,null,null,null,0,240,0,35291.21]
[null,"CHIHUAHUA","HEGP741201TCA","HEGP741201MCHRRT03","PATRICIA OLAYA HERRERA GARCIA","08DPT0012I",null,null,null,null,null,null,0,228,0,null,null,null,null,null,null,0,228,0,33694.160000000003]
[null,"CHIHUAHUA","IIOF8012093M1","IIOF801209HCHRLR08","FRANCISCO IRIGOYEN OLIVAS","08DPT0012I",null,null,null,null,null,null,0,240,0,null,null,null,null,null,null,0,240,0,17361]
[null,"CHIHUAHUA","IAPJ9005168T2","IAPJ900516MCHBRS04","JESIKA EDITH IBARRA PEREZ","08DPT0012I",null,null,null,null,null,null,0,216,0,null,null,null,null,null,null,0,216,0,7009.4]
[null,"CHIHUAHUA","IAFR620519979","IAFR620519HSLZRM07","RAMON  IZAGUIRRE FIERRO","08DPT0012I",null,null,null,null,null,null,0,228,0,null,null,null,null,null,null,0,228,0,29501.57]
[null,"CHIHUAHUA","JAAG74101784A","JAAG741017MCHQRL01","GLORIA LINDA JAQUEZ ARBALLO","08DPT0012I",null,null,null,null,null,null,0,240,0,null,null,null,null,null,null,0,240,0,34641.21]
[null,"CHIHUAHUA","LAGL890709J41","LAGL890709MCHZNL07","LLUVIA CRISTINA LAZO GONZALEZ","08DPT0012I",null,null,null,null,null,null,0,216,0,null,null,null,null,null,null,0,216,0,32684.019999999997]
[null,"CHIHUAHUA","MALS840210DM2","MALS840210MCHCYL02","SILVIA ISELA MACIAS LOYA","08DPT0012I",null,null,null,null,null,null,0,120,0,null,null,null,null,null,null,0,120,0,19320.599999999999]
[null,"CHIHUAHUA","MAGZ860917JB4","MAGZ860917MCHLLL02","ZULEYKA MARIELA MALDONADO GIL","08DPT0012I",null,null,null,null,null,null,0,240,0,null,null,null,null,null,null,0,240,0,34641.21]
[null,"CHIHUAHUA","MATM841124GU1","MATM841124MCHRLY00","MAYTEE ABRIL MARQUEZ TELLO","08DPT0012I",null,null,null,null,null,null,0,168,0,null,null,null,null,null,null,0,168,0,25058.85]
[null,"CHIHUAHUA","MAGM880802UR1","MAGM880802MCHRRR08","MARINA ANGELICA MARTINEZ GARCIA","08DPT0012I",null,null,null,null,null,null,0,240,0,null,null,null,null,null,null,0,240,0,34704.28]
[null,"CHIHUAHUA","MEOE6606187C0","MEOE660618HCHLRF02","EFREN MELENDEZ ORTIZ","08DPT0012I",null,null,null,null,null,null,0,216,0,null,null,null,null,null,null,0,216,0,29036.3]
[null,"CHIHUAHUA","MERA900126FD2","MERA900126MCHNMN03","ANA ISABEL MENDOZA RAMOS","08DPT0012I",null,null,null,null,null,null,0,240,0,null,null,null,null,null,null,0,240,0,31026.83]
[null,"CHIHUAHUA","MOEJ8410204P7","MOEJ841020HCHRSS09","JESUS MORENO ESTRADA","08DPT0012I",null,null,null,null,null,null,0,120,0,null,null,null,null,null,null,0,120,0,18020.599999999999]
[null,"CHIHUAHUA","NUMR860506DV4","NUMR860506MCHXRQ03","RAQUEL NUÑEZ MARTINEZ","08DPT0012I",null,null,null,null,null,null,0,240,0,null,null,null,null,null,null,0,240,0,34641.21]
[null,"CHIHUAHUA","OIPC830620AE8","OIPC830620HCHRRR03","CARLOS ALEJANDRO ORTIZ PAREDES","08DPT0012I",null,null,null,null,null,null,0,240,0,null,null,null,null,null,null,0,240,0,31580.43]
[null,"CHIHUAHUA","PAVC680810379","PAVC680810MCHLLR09","CARMEN LORENA PALMA VALVERDE","08DPT0012I",null,null,null,null,null,null,0,240,0,null,null,null,null,null,null,0,240,0,31283.35]
[null,"CHIHUAHUA","PAVK8303143F4","PAVK830314MCHYLR05","KARLA DENISSE PAYAN VALVERDE","08DPT0012I",null,null,null,null,null,null,0,240,0,null,null,null,null,null,null,0,240,0,34641.21]
[null,"CHIHUAHUA","POED8604086S3","POED860408MCHRCN03","DIANA ELIZABETH PORTILLO ECHAVARRIA","08DPT0012I",null,null,null,null,null,null,0,240,0,null,null,null,null,null,null,0,240,0,35291.21]
[null,"CHIHUAHUA","ROAN6811104YA","ROAN681110HVZDGX08","JOSE NOE RODRIGUEZ AGUILERA","08DPT0012I",null,null,null,null,null,null,0,156,0,null,null,null,null,null,null,0,156,0,24111.79]
[null,"CHIHUAHUA","ROVC830522ILA","ROVC830522MCHDLR00","CRISTINA RODRIGUEZ VALVERDE","08DPT0012I",null,null,null,null,null,null,0,216,0,null,null,null,null,null,null,0,216,0,24214.67]
[null,"CHIHUAHUA","SAME780216645","SAME780216MCHCLS05","ESMERALDA SAUCEDO MOLINA","08DPT0012I",null,null,null,null,null,null,0,240,0,null,null,null,null,null,null,0,240,0,34641.21]
[null,"CHIHUAHUA","SATL841206QI8","SATL841206HCHZRS00","LUIS MIGUEL SAUZAMEDA TORRES","08DPT0012I",null,null,null,null,null,null,0,228,0,null,null,null,null,null,null,0,228,0,24472.489999999998]
[null,"CHIHUAHUA","UUGA831111DY9","UUGA831111MCHRND03","ADRIANA ARMINE URQUIZA GONZALEZ","08DPT0012I",null,null,null,null,null,null,0,240,0,null,null,null,null,null,null,0,240,0,34641.21]
[null,"CHIHUAHUA","VATL8403292K8","VATL840329HCHLRS05","LUIS OCTAVIO VALVERDE TORRES","08DPT0012I",null,null,null,null,null,null,0,240,0,null,null,null,null,null,null,0,240,0,29726.83]
[null,"CHIHUAHUA","VACA8309027BA","VXCA830902HCHZHN07","ANDRES VAZQUEZ  CHAVEZ","08DPT0012I",null,null,null,null,null,null,0,228,0,null,null,null,null,null,null,0,228,0,31807.230000000003]
[null,"CHIHUAHUA","VIMG940827G9A","VIMG940827MCHLNL05","GUILLE LIZBETH VILLALOBOS MONAÑO","08DPT0012I",null,null,null,null,null,null,0,216,0,null,null,null,null,null,null,0,216,0,17018.400000000001]
[null,"CHIHUAHUA","VIVR8208282I1","VIVR820828HDGLLB03","ROBERTO RENE VILLALPALDO VILLALPANDO","08DPT0012I",null,null,null,null,null,null,0,240,0,null,null,null,null,null,null,0,240,0,20154.919999999998]
[null,"CHIHUAHUA","AAEJ730109C94","AAEJ730109HCHLSL06","ALVAREZ ESCARCEGA JULIAN ","08DPT0011J",null,null,null,1,0,0,null,null,null,null,null,null,null,null,null,1,0,0,33059.26]
[null,"CHIHUAHUA","AOJS831129TE8","AOJS831129MCHNRL09","ANCHONDO JUAREZ SILVIA GRACIELA","08DPT0011J",null,null,null,1,0,0,null,null,null,null,null,null,null,null,null,1,0,0,43882.61]
[null,"CHIHUAHUA","AOLY671118ELA","AOLY671118MDGRCZ05","ARROYO LECHUGA YAZMIN","08DPT0011J",null,null,null,1,0,0,null,null,null,null,null,null,null,null,null,1,0,0,126963.86000000002]
[null,"CHIHUAHUA","AIAA780609P70","AIAA780609HCHVGG01","AVITIA AGUILAR AGUSTIN ","08DPT0011J",null,null,null,null,null,null,null,null,null,null,null,null,1,0,0,1,0,0,66459.899999999994]
[null,"CHIHUAHUA","BARM6606271QA","BARM660627HCHRBR03","MARIO ALBERTO BARBA RUBIO","08DPT0011J",null,null,null,1,0,0,null,null,null,null,null,null,null,null,null,1,0,0,34297.480000000003]
[null,"CHIHUAHUA","CAMF661018JC7","CAMF661018HCHHDR08","FRANCISCO JAVIER CABRERA MEDINA","08DPT0011J",null,null,null,1,0,0,null,null,null,null,null,null,null,null,null,1,0,0,93119.01999999999]
[null,"CHIHUAHUA","CAVJ9010233Z3","CAVJ901023MCHXZH05","CAÑAS VAZQUEZ JAHAIRA ARANI ","08DPT0011J",null,null,null,1,0,0,null,null,null,null,null,null,null,null,null,1,0,0,63918.380000000005]
[null,"CHIHUAHUA","EUGM7504107E2","EUGM750410HCHSRR05","ESQUIVEL GUERRERO MAURO EZEQUIEL ","08DPT0011J",null,null,null,1,0,0,null,null,null,null,null,null,null,null,null,1,0,0,36256.959999999992]
[null,"CHIHUAHUA","FACG681029MZ8","FACG681029MCHDRR04","GEORGINA FAUDOA CRUZ","08DPT0011J",null,null,null,1,0,0,null,null,null,null,null,null,null,null,null,1,0,0,55531.85]
[null,"CHIHUAHUA","FOTL710111D65","FOTL710111MDFLNL02","LILLIAN KARINA FLOTTE TINOCO ","08DPT0011J",null,null,null,1,0,0,null,null,null,null,null,null,null,null,null,1,0,0,84634.569999999992]
[null,"CHIHUAHUA","FUCJ631107GN9","FUCJ631107MCHNHL09","JULIETA FUENTES CHAVEZ","08DPT0011J",null,null,null,1,0,0,null,null,null,null,null,null,null,null,null,1,0,0,108897.49]
[null,"CHIHUAHUA","GAGJ740328P75","GAGJ740328HCHLNR03","JORGE ARTURO GALLEGOS GONZALEZ","08DPT0011J",null,null,null,1,0,0,null,null,null,null,null,null,null,null,null,1,0,0,51841.54]
[null,"CHIHUAHUA","GOQG650428BVA","GOQG650428MCHNNR07","GEORGINA GONZALEZ QUINTANA","08DPT0011J",null,null,null,1,0,0,null,null,null,null,null,null,null,null,null,1,0,0,45637.38]
[null,"CHIHUAHUA","GURJ541104T10","GURJ541104HCHRMS04","JESUS LUIS GUERRA RAMIREZ","08DPT0011J",null,null,null,1,0,0,null,null,null,null,null,null,null,null,null,1,0,0,53107.43]
[null,"CHIHUAHUA","HENE680323MJ1","HENE680323MCHRRL03","ELIDA HERNANDEZ NORES","08DPT0011J",null,null,null,1,0,0,null,null,null,null,null,null,null,null,null,1,0,0,49896.28]
[null,"CHIHUAHUA","LIGG8206272AA","LIGG820627HCLRRZ15","GIEZI LIRA GARCIA","08DPT0011J",null,null,null,1,0,0,null,null,null,null,null,null,null,null,null,1,0,0,50061.66]
[null,"CHIHUAHUA","LOPO671113I30","LOPO671113HCHPRS00","OSCAR BENJAMIN LOPEZ PEREZ","08DPT0011J",null,null,null,1,0,0,null,null,null,null,null,null,null,null,null,1,0,0,132201.89999999997]
[null,"CHIHUAHUA","MACE880915VB1","MACE880915HCHRNR04","ERICK MARTELL CONTRERAS ","08DPT0011J",null,null,null,1,0,0,null,null,null,null,null,null,null,null,null,1,0,0,47120.57]
[null,"CHIHUAHUA","MAGI710826BY5","MAGI710826HCHRNV05","IVONNE ARACELI MARTINEZ GONZALEZ","08DPT0011J",null,null,null,1,0,0,null,null,null,null,null,null,null,null,null,1,0,0,86225.75]
[null,"CHIHUAHUA","MAVE810424SY3","MAVE810424MCHRLL08","ELIA ZURASY MARTINEZ VELO","08DPT0011J",null,null,null,1,0,0,null,null,null,null,null,null,null,null,null,1,0,0,25750.509999999995]
[null,"CHIHUAHUA","MEGM480906839","MEGM480906HCHNNG00","MIGUEL ANGEL MENDOZA GONZALEZ","08DPT0011J",null,null,null,1,0,0,null,null,null,null,null,null,null,null,null,1,0,0,36913.15]
[null,"CHIHUAHUA","MOCY820701FR6","MOCY820701MCHRHS01","YESSENIA IVONNE MORENO CHAVEZ ","08DPT0011J",null,null,null,1,0,0,null,null,null,null,null,null,null,null,null,1,0,0,118668.16000000002]
[null,"CHIHUAHUA","OIFL620226IA5","OIFL620226MCHLLD03","LIDIA GUADALUPE OLIVAS FLORES","08DPT0011J",null,null,null,1,0,0,null,null,null,null,null,null,null,null,null,1,0,0,84634.569999999992]
[null,"CHIHUAHUA","OESN6905137N5","OESN690513MCHRCR06","NORMA ORTEGA SCOTT","08DPT0011J",null,null,null,1,0,0,null,null,null,null,null,null,null,null,null,1,0,0,88552.499999999985]
[null,"CHIHUAHUA","OIAA580304QJA","OIAA580304HCHRRB04","ABRAHAM ORTIZ ARMENDARIZ","08DPT0011J",null,null,null,1,0,0,null,null,null,null,null,null,null,null,null,1,0,0,43965.75]
[null,"CHIHUAHUA","ROAA860101KQ4","ROAA860101HCHCNL04","JOSE ALBERTO ROCHA ANTUNA","08DPT0011J",null,null,null,1,0,0,null,null,null,null,null,null,null,null,null,1,0,0,30554.799999999999]
[null,"CHIHUAHUA","RUAJ680828NZ1","RUAJ680828HCHZGN01","JUAN CARLOS RUIZ AGUIRRE","08DPT0011J",null,null,null,1,0,0,null,null,null,null,null,null,null,null,null,1,0,0,33059.26]
[null,"CHIHUAHUA","SADC620717A78","SADC620717MCHLMR01","CARMEN ESTELA SALAS DOMINGUEZ","08DPT0011J",null,null,null,1,0,0,null,null,null,null,null,null,null,null,null,1,0,0,73630.91]
[null,"CHIHUAHUA","SACG701206260","SACG701206MCHLND02","MARIA GUADALUPE SALAZAR CONTRERAS","08DPT0011J",null,null,null,1,0,0,null,null,null,null,null,null,null,null,null,1,0,0,92000.9]
[null,"CHIHUAHUA","SAOD961029SV8","SAOD961029MCHNRN08","DIANA GUADALUPE SANDATE ORTEGA","08DPT0011J",null,null,null,1,0,0,null,null,null,null,null,null,null,null,null,1,0,0,4067.22]
[null,"CHIHUAHUA","VAAG6312036W2","VAAG631203HTSLVR03","GERARDO VALDEZ AVILA","08DPT0011J",null,null,null,null,null,null,null,null,null,null,null,null,1,0,0,1,0,0,85992.48]
[null,"CHIHUAHUA","VILA590828MZ1","VILA590828HCHLZG06","AGUSTIN VILLAGRAN LOZOYA","08DPT0011J",null,null,null,1,0,0,null,null,null,null,null,null,null,null,null,1,0,0,38763.449999999997]
[null,"CHIHUAHUA","VIDV791004RJ0","VIDV791004MCHLRR04","VIRGINIA VILLALBA DURAN","08DPT0011J",null,null,null,1,0,0,null,null,null,null,null,null,null,null,null,1,0,0,52320.73]
[null,"CHIHUAHUA","VIMS620916I47","VIMS620916MCHLRN00","SANDRA HORTENSIA VILLALOBOS MARIN","08DPT0011J",null,null,null,1,0,0,null,null,null,null,null,null,null,null,null,1,0,0,88510.76999999999]
[null,"CHIHUAHUA","VIYD6702201Q6","VIYD670220MCHLXR09","DORA EMMA VILLALOBOS YAÑEZ","08DPT0011J",null,null,null,1,0,0,null,null,null,null,null,null,null,null,null,1,0,0,49451.399999999994]
[null,"CHIHUAHUA","AOAJ720609R46","AOAJ720609MCHCLS06","MARÍA DE JESÚS ACOSTA ÁLVAREZ","08DPT0011J",null,null,null,null,null,null,0,240,0,null,null,null,null,null,null,0,240,0,25772.34]
[null,"CHIHUAHUA","AOPA860917JK2","AOPA860917MCHCRG05","AGLAE BERENICE ACOSTA PORTILLO","08DPT0011J",null,null,null,null,null,null,0,108,0,null,null,null,null,null,null,0,108,0,18707.82]
[null,"CHIHUAHUA","AORC6607129B3","AORC660712HCHCMS03","CÉSAR RENÉ ACOSTA ROMO","08DPT0011J",null,null,null,null,null,null,0,192,0,null,null,null,null,null,null,0,192,0,20615.79]
[null,"CHIHUAHUA","AUVX671108950","AUVX671108MCHGLC09","XOCHITL MARGARITA AGUILAR VILLALOBOS","08DPT0011J",null,null,null,null,null,null,0,240,0,null,null,null,null,null,null,0,240,0,30767.360000000001]
[null,"CHIHUAHUA","AADF760822JB4","AADF760822MCHLML07","FLOR ANEL ALMANZA DOMÍNGUEZ","08DPT0011J",null,null,null,null,null,null,0,216,0,null,null,null,null,null,null,0,216,0,32097.09]
[null,"CHIHUAHUA","AADF541004UL3","AADF541004HDGLMR07","FRANCISCO ALVARADO DOMÍNGUEZ","08DPT0011J",null,null,null,null,null,null,0,240,0,null,null,null,null,null,null,0,240,0,33991.21]
[null,"CHIHUAHUA","AAGD820816HU2","AAGD820816MCHLTL09","DALYLA ALVARADO GUTIÉRREZ","08DPT0011J",null,null,null,null,null,null,0,240,0,null,null,null,null,null,null,0,240,0,34641.21]
[null,"CHIHUAHUA","AASE930324BT6","AASE930324MCHLLD02","EDITH ALVAREZ SALAZAR","08DPT0011J",null,null,null,null,null,null,0,240,0,null,null,null,null,null,null,0,240,0,25448.780000000002]
[null,"CHIHUAHUA","AIRL900105A19","AIRL900105HCHLSS09","JOSÉ LUIS ALVÍDREZ RÍOS","08DPT0011J",null,null,null,null,null,null,0,240,0,null,null,null,null,null,null,0,240,0,29868.280000000002]
[null,"CHIHUAHUA","AALU670310HX2","AAXL670310HCHMXS16","LUIS CARLOS AMAYA X","08DPT0011J",null,null,null,null,null,null,0,240,0,null,null,null,null,null,null,0,240,0,34054.28]
[null,"CHIHUAHUA","AAAM8805014VA","AAAM880501MCHNCL02","MILDRET ARLETTE ANDRADE ACOSTA","08DPT0011J",null,null,null,null,null,null,0,216,0,null,null,null,null,null,null,0,216,0,25769.75]
[null,"CHIHUAHUA","AIDJ6101296Q4","AIDJ610129HCHVLS09","JESÚS HUMBERTO ÁVILA DELGADO","08DPT0011J",null,null,null,null,null,null,0,240,0,null,null,null,null,null,null,0,240,0,31941.21]
[null,"CHIHUAHUA","AIQC690227LQ0","AIQC690227HCHVNS05","CESAR ROGACIANO ÁVILA QUINTANA","08DPT0011J",null,null,null,null,null,null,0,240,0,null,null,null,null,null,null,0,240,0,33991.21]
[null,"CHIHUAHUA","BAGA570401CF3","BAGA570401HCHRNN09","ANDRÉS BARBA GÁNDARA","08DPT0011J",null,null,null,null,null,null,0,240,0,null,null,null,null,null,null,0,240,0,32185.5]
[null,"CHIHUAHUA","BABR540126HB4","BABR540126HCHZDL02","RAÚL GABRIEL BAEZA BEDOY","08DPT0011J",null,null,null,null,null,null,0,240,0,null,null,null,null,null,null,0,240,0,29295.780000000002]
[null,"CHIHUAHUA","BASZ650208NL8","BASZ650208MMCRTH02","ZHENIA PATRICIA BARRAZA STOELTING","08DPT0011J",null,null,null,null,null,null,0,48,0,null,null,null,null,null,null,0,48,0,7330.5]
[null,"CHIHUAHUA","BEAG740617SI1","BEAG740617MSLJRB00","MARÍA GABIELA BEJARANO ARREDONDO","08DPT0011J",null,null,null,null,null,null,0,240,0,null,null,null,null,null,null,0,240,0,35941.21]
[null,"CHIHUAHUA","BEML730902B28","BEML730902HCHLRS07","JOSÉ LUIS BELTRÁN MÁRQUEZ","08DPT0011J",null,null,null,null,null,null,0,216,0,null,null,null,null,null,null,0,216,0,31447.09]
[null,"CHIHUAHUA","BACJ820811R51","BACJ820811HCHLRN02","JUAN JOSÉ BLANCO CRUZ","08DPT0011J",null,null,null,null,null,null,0,108,0,null,null,null,null,null,null,0,108,0,14960.479999999998]
[null,"CHIHUAHUA","BASH700602N82","BASH700602HCHLNR08","HERNÁN BLANCO SÁENZ","08DPT0011J",null,null,null,null,null,null,0,120,0,null,null,null,null,null,null,0,120,0,22192.18]
[null,"CHIHUAHUA","CAHJ821204323","CAHJ821204HCHBRL07","JOEL ANTONIO CABALLERO HERNÁNDEZ","08DPT0011J",null,null,null,null,null,null,0,216,0,null,null,null,null,null,null,0,216,0,31447.09]
[null,"CHIHUAHUA","CADL780717DQ0","CADL780717HCHMLS06","LUIS MANUEL CAMACHO DELGADO","08DPT0011J",null,null,null,null,null,null,0,240,0,null,null,null,null,null,null,0,240,0,29359.699999999997]
[null,"CHIHUAHUA","CAML770621S57","CAML770621HCHRRS02","LUIS CARMONA MORA","08DPT0011J",null,null,null,null,null,null,0,120,0,null,null,null,null,null,null,0,120,0,15970.6]
[null,"CHIHUAHUA","CAEI831214746","CAEI831214MCHRSV05","IVETH SELENE CARO ESCUDERO","08DPT0011J",null,null,null,null,null,null,0,240,0,null,null,null,null,null,null,0,240,0,27184.030000000002]
[null,"CHIHUAHUA","CAGS5611036P5","CAGS561103MCHRLL06","SILVIA CARRASCO GALVÁN","08DPT0011J",null,null,null,null,null,null,0,240,0,null,null,null,null,null,null,0,240,0,31706.57]
[null,"CHIHUAHUA","CAVJ780821N37","CAVJ780821HCHZLS05","JESÚS MANUEL CAZARES VILLARREAL","08DPT0011J",null,null,null,null,null,null,0,240,0,null,null,null,null,null,null,0,240,0,48726.83]
[null,"CHIHUAHUA","CEPJ5209176A4","CEPJ520917MCLDXS03","MARÍA DE JESÚS CEDILLO PEÑA","08DPT0011J",null,null,null,null,null,null,0,228,0,null,null,null,null,null,null,0,228,0,28285.659999999996]
[null,"CHIHUAHUA","CACL6504048EA","CACL650404HCHHHS06","JOSÉ LUIS CHAVARRÍA CHÁVEZ","08DPT0011J",null,null,null,null,null,null,0,216,0,null,null,null,null,null,null,0,216,0,30734.019999999997]
[null,"CHIHUAHUA","CALM790104KB2","CALM790104HCHHPN06","MANUEL ALBERTO CHAVIRA LÓPEZ","08DPT0011J",null,null,null,null,null,null,0,180,0,null,null,null,null,null,null,0,180,0,32356.57]
[null,"CHIHUAHUA","CORI861010967","CORI861010HCHNVS07","ISAÚL CONTRERAS RIVERA","08DPT0011J",null,null,null,null,null,null,0,240,0,null,null,null,null,null,null,0,240,0,29140.89]
[null,"CHIHUAHUA","COVM710719995","COVM710719HCHRLR08","MARCO ANTONIO CORONADO VILLARREAL","08DPT0011J",null,null,null,null,null,null,0,240,0,null,null,null,null,null,null,0,240,0,34054.28]
[null,"CHIHUAHUA","DIVM670828475","DIVM670828HCHZQN04","MANUEL DÍAZ VAQUERA","08DPT0011J",null,null,null,null,null,null,0,156,0,null,null,null,null,null,null,0,156,0,21348.719999999998]
[null,"CHIHUAHUA","EICP660518T31","EICP660518MCHSRT02","PATRICIA EISSA CARRILLO","08DPT0011J",null,null,null,null,null,null,0,180,0,null,null,null,null,null,null,0,180,0,26655.91]
[null,"CHIHUAHUA","EIAL6904095Y1","EIAL690409MCHSLR06","LORENA MARGARITA ESPINOZA ALCALÁ","08DPT0011J",null,null,null,null,null,null,0,240,0,null,null,null,null,null,null,0,240,0,35291.21]
[null,"CHIHUAHUA","FOSJ7411047Y2","FOSJ741104HCHLLV00","JAVIER ARTURO FLORES SALAS","08DPT0011J",null,null,null,null,null,null,0,108,0,null,null,null,null,null,null,0,108,0,11728.8]
[null,"CHIHUAHUA","GAGJ7110079I6","GAGJ711007HCHBRL03","JULIÁN GABIRA DE LA GARZA","08DPT0011J",null,null,null,null,null,null,0,240,0,null,null,null,null,null,null,0,240,0,33991.21]
[null,"CHIHUAHUA","GALP8605195S6","GALP860519MCHRCR06","PERLA LILIANA GARCÍA LUCERO","08DPT0011J",null,null,null,null,null,null,0,240,0,null,null,null,null,null,null,0,240,0,31026.83]
[null,"CHIHUAHUA","GOCC7107156X6","GOCC710715MCHNHR03","CARMEN GUADALUPE GONZÁLEZ CHACÓN","08DPT0011J",null,null,null,null,null,null,0,240,0,null,null,null,null,null,null,0,240,0,29295.780000000002]
[null,"CHIHUAHUA","GOGJ721103UI4","GOGJ721103HCHNRL03","JULIO CESAR GONZÁLEZ GRANADOS","08DPT0011J",null,null,null,null,null,null,0,240,0,null,null,null,null,null,null,0,240,0,35291.21]
[null,"CHIHUAHUA","GOPS631119234","GOPS631119HCHNZX06","SIXTO HUMBERTO GONZÁLEZ PÁEZ","08DPT0011J",null,null,null,null,null,null,0,228,0,null,null,null,null,null,null,0,228,0,32981.089999999997]
[null,"CHIHUAHUA","GUTM700125HI4","GUTM700125MCHRRR03","MARGARITA GUARDADO TORRES","08DPT0011J",null,null,null,null,null,null,0,204,0,null,null,null,null,null,null,0,204,0,27900.68]
[null,"CHIHUAHUA","GUGL640702V28","GUGL640702HCHTRS02","LUIS ROGELIO GUTIÉRREZ GARCÍA","08DPT0011J",null,null,null,null,null,null,0,240,0,null,null,null,null,null,null,0,240,0,33991.21]
[null,"CHIHUAHUA","HECM730118LI9","HECM730118HCHRDR06","MAURICIO HERNÁNDEZ CAUDILLO","08DPT0011J",null,null,null,null,null,null,0,156,0,null,null,null,null,null,null,0,156,0,14803.680000000002]
[null,"CHIHUAHUA","HEOD870714897","HEOD870714MCLRLN06","DIANA HERNÁNDEZ OLIVARES","08DPT0011J",null,null,null,null,null,null,0,216,0,null,null,null,null,null,null,0,216,0,33920.949999999997]
[null,"CHIHUAHUA","HETC830217EB1","HETC830217MCHRRN07","CINTHIA LIZETH HERNÁNDEZ TREVIÑO","08DPT0011J",null,null,null,null,null,null,0,228,0,null,null,null,null,null,null,0,228,0,32457.230000000003]
[null,"CHIHUAHUA","HEDM761211T33","HEDM761211MCHRZY08","MAYRA GUADALUPE HERRERA DÍAZ","08DPT0011J",null,null,null,null,null,null,0,216,0,null,null,null,null,null,null,0,216,0,31447.09]
[null,"CHIHUAHUA","JAMF9503242Q6","JAMF950324MCHYRT02","FATME JANETH JAYDAR MARQUEZ ","08DPT0011J",null,null,null,null,null,null,0,40,0,null,null,null,null,null,null,0,40,0,2631.5]
[null,"CHIHUAHUA","JASX660321NQ4","JASX660321HZSYTM15","XAMIR JAYDAR SOTO","08DPT0011J",null,null,null,null,null,null,0,120,0,null,null,null,null,null,null,0,120,0,21605.25]
[null,"CHIHUAHUA","JILS7804098R3","JILS780409HCHMZR04","SERGIO ARMANDO JIMÉNEZ LOZANO","08DPT0011J",null,null,null,null,null,null,0,240,0,null,null,null,null,null,null,0,240,0,27692.58]
[null,"CHIHUAHUA","JISR460111595","JISR460111HBCMLY00","REYNALDO JIMÉNEZ SOLÍS","08DPT0011J",null,null,null,null,null,null,0,32,0,null,null,null,null,null,null,0,32,0,3909.6]
[null,"CHIHUAHUA","LEGI810812S76","LEGI810812HCHYNR04","IRVING LEYVA GONZÁLEZ","08DPT0011J",null,null,null,null,null,null,0,228,0,null,null,null,null,null,null,0,228,0,32457.230000000003]
[null,"CHIHUAHUA","LOGE770513DS3","LOGE770513MCHPLL01","ELENA DEL ROSARIO LÓPEZ GALAVIZ","08DPT0011J",null,null,null,null,null,null,0,240,0,null,null,null,null,null,null,0,240,0,34117.360000000001]
[null,"CHIHUAHUA","LUCL830421CC7","LUCL830421HCHVNS03","LUIS FERNANDO LUÉVANO CONTRERAS","08DPT0011J",null,null,null,null,null,null,0,240,0,null,null,null,null,null,null,0,240,0,28059.699999999997]
[null,"CHIHUAHUA","LURI7603163W9","LURI760316MCHJDR01","IRMA EMILLIA LUJAN RODRÍGUEZ","08DPT0011J",null,null,null,null,null,null,0,240,0,null,null,null,null,null,null,0,240,0,28484.030000000002]
[null,"CHIHUAHUA","MEFJ6010186V1","MEFJ601018HCHNNS07","JESÚS ALBERTO MENCHACA FUENTES","08DPT0011J",null,null,null,null,null,null,0,240,0,null,null,null,null,null,null,0,240,0,34054.28]
[null,"CHIHUAHUA","MEEJ750705D34","MEEJ750705HCHNSS02","JESÚS MENDOZA ESTEVANÉ","08DPT0011J",null,null,null,null,null,null,0,216,0,null,null,null,null,null,null,0,216,0,31447.09]
[null,"CHIHUAHUA","MOVI660317J46","MOXV660317HCHLXC08","VÍCTOR MANUEL MOLINAR X","08DPT0011J",null,null,null,null,null,null,0,228,0,null,null,null,null,null,null,0,228,0,21266.230000000003]
[null,"CHIHUAHUA","MORR640403339","MORR640403MCHNDS08","ROSARIO FLORENTINA MONTOYA RODRÍGUEZ","08DPT0011J",null,null,null,null,null,null,0,240,0,null,null,null,null,null,null,0,240,0,35291.21]
[null,"CHIHUAHUA","MOEC8307215B7","MOEC830721HCHRSR06","CARLOS DANIEL MORALES ESPINOZA","08DPT0011J",null,null,null,null,null,null,0,240,0,null,null,null,null,null,null,0,240,0,33378.53]
[null,"CHIHUAHUA","MOSV610329FQ2","MOSV610329HCHRTC06","VÍCTOR MORENO SOTO","08DPT0011J",null,null,null,null,null,null,0,240,0,null,null,null,null,null,null,0,240,0,34641.21]
[null,"CHIHUAHUA","MOOL690713831","MOOL690713MCHRSR07","LAURA MAGDALENA MORONES OSUNA","08DPT0011J",null,null,null,null,null,null,0,180,0,null,null,null,null,null,null,0,180,0,26655.91]
[null,"CHIHUAHUA","MORC720201UY4","MORC720201MCHRDL09","CLAUDIA MORONES RODRÍGUEZ","08DPT0011J",null,null,null,null,null,null,0,216,0,null,null,null,null,null,null,0,216,0,24864.730000000003]
[null,"CHIHUAHUA","MUNL690829H48","MUNL690829MCHXTZ04","LUZ EMILIA MUÑOZ NATIVIDAD","08DPT0011J",null,null,null,null,null,null,0,72,0,null,null,null,null,null,null,0,72,0,10262.700000000001]
[null,"CHIHUAHUA","NADJ630505N67","NADJ630505HCHVLN05","JUAN NAVA DELGADO","08DPT0011J",null,null,null,null,null,null,0,240,0,null,null,null,null,null,null,0,240,0,33991.21]
[null,"CHIHUAHUA","NAML740428B29","NAML740428MCHVRR05","LORENA IVONNE NAVA MORALES","08DPT0011J",null,null,null,null,null,null,0,180,0,null,null,null,null,null,null,0,180,0,29653.63]
[null,"CHIHUAHUA","OOMJ6108305IA","OOMJ610830MCHCDN00","JUANA ROSA OCHOA MADRID","08DPT0011J",null,null,null,null,null,null,0,240,0,null,null,null,null,null,null,0,240,0,34117.360000000001]
[null,"CHIHUAHUA","OOGI7603109Y9","OOGI760310HDGRNS08","ISIDRO OROZCO GONZÁLEZ","08DPT0011J",null,null,null,null,null,null,0,228,0,null,null,null,null,null,null,0,228,0,33631.089999999997]
[null,"CHIHUAHUA","OORA820321MG3","OORA820321MCHRNY08","AYDE OROZCO RENOVA","08DPT0011J",null,null,null,null,null,null,0,240,0,null,null,null,null,null,null,0,240,0,31804.799999999999]
[null,"CHIHUAHUA","PAMC840828GP8","PAMC840828MCHCRR08","CRISTINA PACHECO MÁRQUEZ","08DPT0011J",null,null,null,null,null,null,0,180,0,null,null,null,null,null,null,0,180,0,26655.91]
[null,"CHIHUAHUA","PAPA610623V58","PAPA610623HCHLXN04","ANTONIO PALACIO PIÑA","08DPT0011J",null,null,null,null,null,null,0,168,0,null,null,null,null,null,null,0,168,0,27930.42]
[null,"CHIHUAHUA","PEHJ6802298H5","PEHJ680229HCHRRN03","JUAN JOSÉ PÉREZ HERNÁNDEZ","08DPT0011J",null,null,null,null,null,null,0,120,0,null,null,null,null,null,null,0,120,0,18083.68]
[null,"CHIHUAHUA","PERM720917SD7","PERM720917MCHRMR06","MARGARITA PÉREZ RAMÍREZ","08DPT0011J",null,null,null,null,null,null,0,96,0,null,null,null,null,null,null,0,96,0,15413.41]
[null,"CHIHUAHUA","PADM510809SZ5","PADM510809HNTLZG08","MIGUEL ÁNGEL PLASCENCIA DÍAZ","08DPT0011J",null,null,null,null,null,null,0,240,0,null,null,null,null,null,null,0,240,0,31688.68]
[null,"CHIHUAHUA","QUCC800518RJ7","QUCC800518MCHZML03","CLAUDIA ROCÍO QUEZADA CAMPOYA","08DPT0011J",null,null,null,null,null,null,0,240,0,null,null,null,null,null,null,0,240,0,27925.5]
[null,"CHIHUAHUA","QUME830808SH6","QUME830808HCHXRR06","ERIC QUIÑONES MARIÑELARENA","08DPT0011J",null,null,null,null,null,null,0,180,0,null,null,null,null,null,null,0,180,0,28416.7]
[null,"CHIHUAHUA","RARR491119L95","RARR491119HPLMVB06","ROBERTO PONCIANO RAMÍREZ RIVERA","08DPT0011J",null,null,null,null,null,null,0,240,0,null,null,null,null,null,null,0,240,0,33467.360000000001]
[null,"CHIHUAHUA","RAHA780618377","RAHA780618HCHMRD01","ADARIK QUILEO RAMOS HERRERA","08DPT0011J",null,null,null,null,null,null,0,204,0,null,null,null,null,null,null,0,204,0,30083.780000000002]
[null,"CHIHUAHUA","RARL740713SN9","RARL740713MCHSYR08","LOURDES GABRIELA RASCÓN REYES","08DPT0011J",null,null,null,null,null,null,0,240,0,null,null,null,null,null,null,0,240,0,29847.550000000003]
[null,"CHIHUAHUA","REGJ630501KR7","REGJ630501HDFNRN07","JUAN CARLOS RENDÓN GARCÍA","08DPT0011J",null,null,null,null,null,null,0,204,0,null,null,null,null,null,null,0,204,0,32910.82]
[null,"CHIHUAHUA","RILA820506DD4","RILA820506HCHVCN08","ÁNGEL ARMANDO RIVERA LECHUGA","08DPT0011J",null,null,null,null,null,null,0,204,0,null,null,null,null,null,null,0,204,0,21922.67]
[null,"CHIHUAHUA","ROVW790131VE9","ROVW790131HCHJLL05","WILFREDO ROJO VELÁZQUEZ","08DPT0011J",null,null,null,null,null,null,0,240,0,null,null,null,null,null,null,0,240,0,32293.5]
[null,"CHIHUAHUA","ROHE830406P40","ROHE830406MCHMRL03","ELSA SAMANTHA ROMERO HERRERA","08DPT0011J",null,null,null,null,null,null,0,216,0,null,null,null,null,null,null,0,216,0,31447.09]
[null,"CHIHUAHUA","RUBJ910211L87","RUBJ910211HCHZCS01","RUIZ ESPARZA BACASEHUA JOSÉ","08DPT0011J",null,null,null,null,null,null,0,228,0,null,null,null,null,null,null,0,228,0,27848.579999999998]
[null,"CHIHUAHUA","RUHJ7401277YA","RUHJ740127HCHZRR00","JORGE ARTURO RUIZ HEIRAS","08DPT0011J",null,null,null,null,null,null,0,180,0,null,null,null,null,null,null,0,180,0,28416.7]
[null,"CHIHUAHUA","RUCJ590315LP9","RUCJ590315HZSZMS00","JOSÉ RUIZ ESPARZA CAMARENA","08DPT0011J",null,null,null,null,null,null,0,120,0,null,null,null,null,null,null,0,120,0,21605.25]
[null,"CHIHUAHUA","SARC670203156","SARC670203MDGLZR00","MARIA DEL CARMEN SALAS RUIZ","08DPT0011J",null,null,null,null,null,null,0,240,0,null,null,null,null,null,null,0,240,0,35291.21]
[null,"CHIHUAHUA","SACD640228KY5","SACD640228HCHLNN03","DANIEL JAVIER SALAZAR CONTRERAS","08DPT0011J",null,null,null,null,null,null,0,180,0,null,null,null,null,null,null,0,180,0,24182.059999999998]
[null,"CHIHUAHUA","SASL611115CC2","SASL611115HCHMPP00","LEOPOLDO SAMANIEGO SEPÚLVEDA","08DPT0011J",null,null,null,null,null,null,0,240,0,null,null,null,null,null,null,0,240,0,34641.21]
[null,"CHIHUAHUA","SAMR770614MQ5","SAMR770614MCHNRS09","ROSA SANCHEZ MORONES","08DPT0011J",null,null,null,null,null,null,0,24,0,null,null,null,null,null,null,0,24,0,2260.8000000000002]
[null,"CHIHUAHUA","SAPJ770502I20","SAPJ770502HCHNRV00","JAVIER SÁNCHEZ PÉREZ","08DPT0011J",null,null,null,null,null,null,0,168,0,null,null,null,null,null,null,0,168,0,22187.279999999999]
[null,"CHIHUAHUA","SAAS931221QZ0","SAAS931221MCHNYN09","SANDRA ITZEL SANDOVAL AYALA","08DPT0011J",null,null,null,null,null,null,0,60,0,null,null,null,null,null,null,0,60,0,9137.7000000000007]
[null,"CHIHUAHUA","SEVK920127JG4","SEVK920127MCHGLR02","KAREN JEMIMA SEGOVIA VILLALOBOS","08DPT0011J",null,null,null,null,null,null,0,216,0,null,null,null,null,null,null,0,216,0,32620.949999999997]
[null,"CHIHUAHUA","TOMG6805124B0","TOMG680512MCHRRB05","GABRIELA TORRES MORENO","08DPT0011J",null,null,null,null,null,null,0,228,0,null,null,null,null,null,null,0,228,0,26587.94]
[null,"CHIHUAHUA","TOPD7211138C2","TOPD721113MCHRRL03","DELIA ARMIDA TORRES PORTILLO","08DPT0011J",null,null,null,null,null,null,0,204,0,null,null,null,null,null,null,0,204,0,30436.959999999999]
[null,"CHIHUAHUA","TORJ640811CX6","TORJ640811HCHVVS02","JOSÉ TOVAR RIVERO","08DPT0011J",null,null,null,null,null,null,0,228,0,null,null,null,null,null,null,0,228,0,26146.829999999998]
[null,"CHIHUAHUA","UUIL8212152F2","UUIL821215HCHRBS02","LUIS ALBERTO URQUIDI IBARBOL","08DPT0011J",null,null,null,null,null,null,0,240,0,null,null,null,null,null,null,0,240,0,31182.71]
[null,"CHIHUAHUA","VAPD660401U61","VAPD660401HCHLRN00","DANIEL VALADEZ PORTILLO","08DPT0011J",null,null,null,null,null,null,0,204,0,null,null,null,null,null,null,0,204,0,29136.959999999999]
[null,"CHIHUAHUA","VAGB5901245Z9","VAGB590124MCHLNL07","VALDERRABANO GONZÁLEZ BLANCA ESTELA ","08DPT0011J",null,null,null,null,null,null,0,216,0,null,null,null,null,null,null,0,216,0,32097.09]
[null,"CHIHUAHUA","VAHJ690910EY0","VAHJ690910HCHLRM02","JAIME VALENZUELA HERNÁNDEZ","08DPT0011J",null,null,null,null,null,null,0,240,0,null,null,null,null,null,null,0,240,0,33991.21]
[null,"CHIHUAHUA","VAGJ670203PVA","VAGJ670203HCLLVS03","JOSÉ VALLEJO GUEVARA","08DPT0011J",null,null,null,null,null,null,0,144,0,null,null,null,null,null,null,0,144,0,25910.160000000003]
[null,"CHIHUAHUA","VEDL620727PL3","VEDL620727MCHGRR05","LORETO VEGA DURAN","08DPT0011J",null,null,null,null,null,null,0,240,0,null,null,null,null,null,null,0,240,0,33467.360000000001]
[null,"CHIHUAHUA","VEMA551027JGA","VEMA551027HCHGRR06","ARIEL VEGA MIRANDA","08DPT0011J",null,null,null,null,null,null,0,228,0,null,null,null,null,null,null,0,228,0,33126.01]
[null,"CHIHUAHUA","VIBH7007255V7","VIBH700725MCHDNL05","HILDA MINERVA VIDAÑA BENCOMO","08DPT0011J",null,null,null,null,null,null,0,240,0,null,null,null,null,null,null,0,240,0,34641.21]
[null,"CHIHUAHUA","VIPT690222SN0","VIPT690222MCHLXR04","MARIA TERESA VILLARREAL PIÑON","08DPT0011J",null,null,null,null,null,null,0,240,0,null,null,null,null,null,null,0,240,0,20202.64]
[null,"CHIHUAHUA","AOVP680821N74","AOVP680821MCHLLT07","PATRICIA GUADALUPE ALONSO VALENZUELA","08DPT0013H",null,null,null,null,null,null,0,240,0,null,null,null,null,null,null,0,240,0,33066.11]
[null,"CHIHUAHUA","AAOP870805580","AAOP870805HCHLLD04","PEDRO TOMAS ALVARADO OLIVAS","08DPT0013H",null,null,null,null,null,null,0,192,0,null,null,null,null,null,null,0,192,0,25975.200000000004]
[null,"CHIHUAHUA","AIBS821008VBA","AIBS821008HVZRRR09","SERGIO ARIAS BRAVO","08DPT0013H",null,null,null,null,null,null,0,240,0,null,null,null,null,null,null,0,240,0,41990.78]
[null,"CHIHUAHUA","BAMG8304085L6","BAMG830408MCHRRR05","GEORGINA IVETH BARRAZA MARQUEZ","08DPT0013H",null,null,null,null,null,null,0,240,0,null,null,null,null,null,null,0,240,0,41990.78]
[null,"CHIHUAHUA","BAMM890408B93","BAMM890408HCHSLR00","MARTIN YAHIR BASURTO MELENDEZ","08DPT0013H",null,null,null,null,null,null,0,160,0,null,null,null,null,null,null,0,160,0,23648]
[null,"CHIHUAHUA","BUMA741111CX0","BUMA741111MCHSNN11","ANGELICA BUSTILLOS MINJAREZ","08DPT0013H",null,null,null,null,null,null,0,240,0,null,null,null,null,null,null,0,240,0,41990.78]
[null,"CHIHUAHUA","BURK950212RQ2","BURK950212MCHSNR03","KARLA ESTRELLA BUSTILLOS RENDON","08DPT0013H",null,null,null,null,null,null,0,236,0,null,null,null,null,null,null,0,236,0,32520.09]
[null,"CHIHUAHUA","CACR890101JE8","CACR890101HCHLRN05","RENE CALDERON CARNERO","08DPT0013H",null,null,null,null,null,null,0,240,0,null,null,null,null,null,null,0,240,0,41340.78]
[null,"CHIHUAHUA","CAMY820713FS4","CAMY820713MCHRTR09","YURIDIA ITZEL CARDONA MATA","08DPT0013H",null,null,null,null,null,null,0,240,0,null,null,null,null,null,null,0,240,0,41990.78]
[null,"CHIHUAHUA","CAVE870113T2A","CAVE870113HCHRLD06","EDUARDO CARDONA VILLAGRANA","08DPT0013H",null,null,null,null,null,null,0,240,0,null,null,null,null,null,null,0,240,0,41340.78]
[null,"CHIHUAHUA","CECD871010N16","CECD871010HCHRSG08","DIEGO ADOLFO CERVANTES CASTILLO","08DPT0013H",null,null,null,null,null,null,0,226,0,null,null,null,null,null,null,0,226,0,30558.300000000003]
[null,"CHIHUAHUA","COTD9112155M3","COTD911215MCHRRN03","DENISSE ALEJANDRA CORELLA TRUJILLO","08DPT0013H",null,null,null,null,null,null,0,240,0,null,null,null,null,null,null,0,240,0,41990.78]
[null,"CHIHUAHUA","CIFG921107419","CIFG921107HCHRLL01","GUILLERMO CRISPIN FLORES","08DPT0013H",null,null,null,null,null,null,0,36,0,null,null,null,null,null,null,0,36,0,5310.5]
[null,"CHIHUAHUA","CUAL871105HE1","CUAL871105HCHRLS08","LUIS ALEJANDRO CRUZ ALVARADO","08DPT0013H",null,null,null,null,null,null,0,240,0,null,null,null,null,null,null,0,240,0,35853.69]
[null,"CHIHUAHUA","CUSI930610MP7","CUSI930610HTCPNS05","ISAAC ESTEBAN CUPIL SANTIAGO","08DPT0013H",null,null,null,null,null,null,0,164,0,null,null,null,null,null,null,0,164,0,20194.18]
[null,"CHIHUAHUA","DAGR770317JPA","DAGR770317HCLVNF02","RAFAEL DAVILA GONZALEZ","08DPT0013H",null,null,null,null,null,null,0,48,0,null,null,null,null,null,null,0,48,0,5638.68]
[null,"CHIHUAHUA","ROCJ811214HD5","ROCJ811214HCLSMV04","JAVIER ROLANDO DE LA ROSA CAMPOS","08DPT0013H",null,null,null,null,null,null,0,240,0,null,null,null,null,null,null,0,240,0,41990.78]
[null,"CHIHUAHUA","LEVD880414UB2","LEVD880414MCLNLN07","DIANA GABRIELA DE LEON VELAZQUEZ","08DPT0013H",null,null,null,null,null,null,0,232,0,null,null,null,null,null,null,0,232,0,38620.71]
[null,"CHIHUAHUA","DODK891025237","DODK891025MCHMMR03","KARLA KARINA DOMINGUEZ DOMINGUEZ","08DPT0013H",null,null,null,null,null,null,0,240,0,null,null,null,null,null,null,0,240,0,41340.78]
[null,"CHIHUAHUA","EECA8503081Q2","EECA850308HSLCRB06","ABRAHAM JACOBO ECHEVARRIA CORRALES","08DPT0013H",null,null,null,null,null,null,0,240,0,null,null,null,null,null,null,0,240,0,41340.78]
[null,"CHIHUAHUA","EISC871230RT1","EISC871230MCHSNR08","CAROLINA ESPINOZA DE SANTIAGO","08DPT0013H",null,null,null,null,null,null,0,240,0,null,null,null,null,null,null,0,240,0,36285.089999999997]
[null,"CHIHUAHUA","FOLM7810127Q9","FOLM781012HCHLYG02","MIGUEL ANGEL FLORES LEYVA","08DPT0013H",null,null,null,null,null,null,0,240,0,null,null,null,null,null,null,0,240,0,32362.68]
[null,"CHIHUAHUA","GAOR680723LM5","GAOR680723HCHLRC05","RICARDO RAUL GALARZA ORTEGA","08DPT0013H",null,null,null,null,null,null,0,240,0,null,null,null,null,null,null,0,240,0,36285.089999999997]
[null,"CHIHUAHUA","GARS970720IY4","GARS970720MCHRDN02","SONIA YANIRA GARCIA RODRIGUEZ","08DPT0013H",null,null,null,null,null,null,0,96,0,null,null,null,null,null,null,0,96,0,11277.289999999999]
[null,"CHIHUAHUA","GONJ870317J36","GONJ870317MVZMCN02","JENNY PATRICIA GOMEZ NICIDA","08DPT0013H",null,null,null,null,null,null,0,240,0,null,null,null,null,null,null,0,240,0,32416.11]
[null,"CHIHUAHUA","GOHD860913N63","GOHD860913MCLNRL08","DALIA LIBERTAD GONZALEZ HERNANDEZ","08DPT0013H",null,null,null,null,null,null,0,240,0,null,null,null,null,null,null,0,240,0,24752.43]
[null,"CHIHUAHUA","GOMA820909QV4","GOMA820909MCHNRD09","ADRIANA GONZALEZ MARQUEZ","08DPT0013H",null,null,null,null,null,null,0,240,0,null,null,null,null,null,null,0,240,0,41990.78]
[null,"CHIHUAHUA","GORR890405IP7","GORR890405HCHNMY01","RAYMUNDO RAMIREZ GONZALEZ","08DPT0013H",null,null,null,null,null,null,0,240,0,null,null,null,null,null,null,0,240,0,41340.78]
[null,"CHIHUAHUA","GUCD860131S71","GUCD860131HCHRLV06","JOSE DAVID GUERRERO CALLEROS","08DPT0013H",null,null,null,null,null,null,0,232,0,null,null,null,null,null,null,0,232,0,34486.92]
[null,"CHIHUAHUA","GUMG891202IP6","GUMG891202MCHTRR04","GRECIA REYNA GUTIERREZ MARRUFO","08DPT0013H",null,null,null,null,null,null,0,228,0,null,null,null,null,null,null,0,228,0,35255.870000000003]
[null,"CHIHUAHUA","HEAN911008UH6","HEAN911008MCHRLN03","NANCY ELIZABETH HEREDIA ALVARADO","08DPT0013H",null,null,null,null,null,null,0,240,0,null,null,null,null,null,null,0,240,0,32416.11]
[null,"CHIHUAHUA","HEAL6501012W6","HEAL650101HCHRRR04","LORENZO HERNANDEZ ARMENTA","08DPT0013H",null,null,null,null,null,null,0,240,0,null,null,null,null,null,null,0,240,0,40690.78]
[null,"CHIHUAHUA","HEPM870418QNA","HEPM870418MDFRRR08","MARY CARMEN HERNANDEZ PERALES","08DPT0013H",null,null,null,null,null,null,0,240,0,null,null,null,null,null,null,0,240,0,40690.78]
[null,"CHIHUAHUA","IAVJ901113B56","IAVJ901113HVZXRL02","JULIO CESAR IXBA VARGAS","08DPT0013H",null,null,null,null,null,null,0,160,0,null,null,null,null,null,null,0,160,0,26348]
[null,"CHIHUAHUA","JUAS860801FD3","JUAS860801MCHRLL00","SILVIA ANGELICA JUAREZ ALVARADO","08DPT0013H",null,null,null,null,null,null,0,240,0,null,null,null,null,null,null,0,240,0,41990.78]
[null,"CHIHUAHUA","LINM5608318QA","LINM560731HDFVTG06","MIGUEL ARTURO LIEVANO NORMAN","08DPT0013H",null,null,null,null,null,null,0,224,0,null,null,null,null,null,null,0,224,0,30536.57]
[null,"CHIHUAHUA","LOMR7805084Z7","LOMR780508HCHRNL09","RAUL ERNESTO LOERA MONARREZ","08DPT0013H",null,null,null,null,null,null,0,240,0,null,null,null,null,null,null,0,240,0,41340.78]
[null,"CHIHUAHUA","LOAA850515Q46","LOAA850515HCHPRL03","ALEJANDRO LOPEZ ARMENDARIZ","08DPT0013H",null,null,null,null,null,null,0,240,0,null,null,null,null,null,null,0,240,0,36285.089999999997]
[null,"CHIHUAHUA","LOCS771008517","LOCS771008HCHPRR09","SERGIO LOPEZ DE LA CRUZ","08DPT0013H",null,null,null,null,null,null,0,240,0,null,null,null,null,null,null,0,240,0,41340.78]
[null,"CHIHUAHUA","MAGT901211DE9","MAGT901211MCHLNH09","THANIA GUADALUPE MALDONADO GONZALEZ","08DPT0013H",null,null,null,null,null,null,0,240,0,null,null,null,null,null,null,0,240,0,41990.78]
[null,"CHIHUAHUA","MAGC661008FYA","MAGC661008HCHRNN09","CANDELARIO MARTINEZ GONZALEZ","08DPT0013H",null,null,null,null,null,null,0,240,0,null,null,null,null,null,null,0,240,0,41990.78]
[null,"CHIHUAHUA","MEMO900505E38","MEMO900505HCHDJM04","OMAR ALONSO MEDINA MUJICA","08DPT0013H",null,null,null,null,null,null,0,80,0,null,null,null,null,null,null,0,80,0,11793]
[null,"CHIHUAHUA","METJ941115RJ7","METJ941115MCHDNN07","JENIFFER MEDINA TUNCHEZ","08DPT0013H",null,null,null,null,null,null,0,224,0,null,null,null,null,null,null,0,224,0,30536.57]
[null,"CHIHUAHUA","MUSF8807088K7","MUSF880708HCHRLR03","FRANCISCO JAVIER MURILLO SALAZAR","08DPT0013H",null,null,null,null,null,null,0,240,0,null,null,null,null,null,null,0,240,0,31766.11]
[null,"CHIHUAHUA","NARM960112JC1","NARM960112HCHVMB02","MOAB DANIEL NAVARRO RAMIREZ","08DPT0013H",null,null,null,null,null,null,0,80,0,null,null,null,null,null,null,0,80,0,9397.7999999999993]
[null,"CHIHUAHUA","OISE771121RD9","OISE771121HCHLNL07","ELIAS HERIBERTO OLIVAS SAENZ","08DPT0013H",null,null,null,null,null,null,0,240,0,null,null,null,null,null,null,0,240,0,35635.089999999997]
[null,"CHIHUAHUA","OISM951129R68","OISM951129MCHRLC03","MICHELLE ALEJANDRA ORTIZ SILVA","08DPT0013H",null,null,null,null,null,null,0,236,0,null,null,null,null,null,null,0,236,0,24952]
[null,"CHIHUAHUA","PEKC800825AD4","PEKC800825HCHRLH02","CHRISTIAN PEREZ KLAPEZ","08DPT0013H",null,null,null,null,null,null,0,80,0,null,null,null,null,null,null,0,80,0,9093]
[null,"CHIHUAHUA","POGD861005KA6","POGD861005MCHRMN00","DANIELA PORRAS GOMEZ","08DPT0013H",null,null,null,null,null,null,0,240,0,null,null,null,null,null,null,0,240,0,41990.78]
[null,"CHIHUAHUA","PUZM810413GK5","PUZM810413HDGNPN02","MANUEL ANTONIO PUENTE ZAPATA","08DPT0013H",null,null,null,null,null,null,0,212,0,null,null,null,null,null,null,0,212,0,36667.629999999997]
[null,"CHIHUAHUA","PUYR780420I72","PUYR780420MMCLXC00","ROCIO PULIDO YAÑEZ","08DPT0013H",null,null,null,null,null,null,0,240,0,null,null,null,null,null,null,0,240,0,41990.78]
[null,"CHIHUAHUA","QUPK7804119NA","QUPK780411MSRVRR11","KARLA LIZETTE  QUEVEDO PRECIADO","08DPT0013H",null,null,null,null,null,null,0,240,0,null,null,null,null,null,null,0,240,0,41990.78]
[null,"CHIHUAHUA","RESJ851201GQ9","RESJ851201HCHVPV07","JAVIER EDUARDO  REVELES SAPIEN","08DPT0013H",null,null,null,null,null,null,0,240,0,null,null,null,null,null,null,0,240,0,41990.78]
[null,"CHIHUAHUA","ROGM9209304F8","ROGM920930HMCDLG05","MIGUEL ANGEL RODRIGUEZ GALVAN","08DPT0013H",null,null,null,null,null,null,0,240,0,null,null,null,null,null,null,0,240,0,29716.11]
[null,"CHIHUAHUA","ROVC550831794","ROVC550831MQTDLN04","CONCEPCION ROSARIO RODRIGUEZ VALDIVIELSO","08DPT0013H",null,null,null,null,null,null,0,224,0,null,null,null,null,null,null,0,224,0,26770.41]
[null,"CHIHUAHUA","RORE881219EW3","RORE881219HVZJYR07","ERNESTO IVAN ROJAS REYES","08DPT0013H",null,null,null,null,null,null,0,240,0,null,null,null,null,null,null,0,240,0,32416.11]
[null,"CHIHUAHUA","SASG860316EQ4","SASG860316HCHNNN09","GENARO ALONSO SAENZ SAENZ","08DPT0013H",null,null,null,null,null,null,0,232,0,null,null,null,null,null,null,0,232,0,24055.03]
[null,"CHIHUAHUA","SACR870225HZ8","SACR870225HCHLLB02","ROBERTO ISMAEL SALAZAR CALDERA","08DPT0013H",null,null,null,null,null,null,0,240,0,null,null,null,null,null,null,0,240,0,40690.78]
[null,"CHIHUAHUA","SACE740906S3A","SACE740906HCLLMN05","ENRIQUE  SALAZAR CAMPOS","08DPT0013H",null,null,null,null,null,null,0,240,0,null,null,null,null,null,null,0,240,0,38640.78]
[null,"CHIHUAHUA","SARC911030SC8","SARC911030HCHLMR00","CARLOS SALGADO ROMO","08DPT0013H",null,null,null,null,null,null,0,240,0,null,null,null,null,null,null,0,240,0,35635.089999999997]
[null,"CHIHUAHUA","SESU611116K12","SESU611116HDFGRL05","ULISES SEGURA SIERRA","08DPT0013H",null,null,null,null,null,null,0,240,0,null,null,null,null,null,null,0,240,0,24752.43]
[null,"CHIHUAHUA","SIER8905149W5","SIER890514MCHGSS03","ROSA SELENE SIGALA ESQUIVEL","08DPT0013H",null,null,null,null,null,null,0,240,0,null,null,null,null,null,null,0,240,0,41340.78]
[null,"CHIHUAHUA","SORD901011B33","SORD901011MCHLSN01","DIANA BELEN SOLIS RIOS","08DPT0013H",null,null,null,null,null,null,0,120,0,null,null,null,null,null,null,0,120,0,14096.61]
[null,"CHIHUAHUA","SORR740817E88","SORR740817HCHSDC09","RICARDO SOSA RODRIGUEZ","08DPT0013H",null,null,null,null,null,null,0,240,0,null,null,null,null,null,null,0,240,0,41340.78]
[null,"CHIHUAHUA","TECI630106UW7","TECI630106MDFLBS09","MARIA ISABEL TELLEZ GIRON COBOS","08DPT0013H",null,null,null,null,null,null,0,240,0,null,null,null,null,null,null,0,240,0,36935.089999999997]
[null,"CHIHUAHUA","TORR840104UJ5","TORR840104MCHRMQ05","RAQUEL IVETTE TORRES RAMIREZ","08DPT0013H",null,null,null,null,null,null,0,240,0,null,null,null,null,null,null,0,240,0,41340.78]
[null,"CHIHUAHUA","UUMM850610TB5","UUMM850610HCHNNN02","MANUEL EDUARDO UNZUETA MONTES","08DPT0013H",null,null,null,null,null,null,0,228,0,null,null,null,null,null,null,0,228,0,35066.49]
[null,"CHIHUAHUA","VATB930812JK4","VATB930812MCHLRR05","BRENDA SUJEY VALADEZ TRUJILLO","08DPT0013H",null,null,null,null,null,null,0,240,0,null,null,null,null,null,null,0,240,0,36935.089999999997]
[null,"CHIHUAHUA","VEPS7608116K0","VEPS760811MCHLBS04","SUSANA ADRIANA VELAZQUEZ POBLANO","08DPT0013H",null,null,null,null,null,null,0,240,0,null,null,null,null,null,null,0,240,0,41340.78]
[null,"CHIHUAHUA","VIPL700512EU4","VIPL700512HCHDRS00","JOSE LUIS VIDAÑA PEREZ","08DPT0013H",null,null,null,null,null,null,0,120,0,null,null,null,null,null,null,0,120,0,21370.39]
[null,"CHIHUAHUA","AOVP680821N74","AOVP680821MCHLLT07","PATRICIA GUADALUPE ALONSO VALENZUELA","08DPT0013H",null,null,null,0,0,"1",null,null,null,null,null,null,null,null,null,0,0,1,24895.5]
[null,"CHIHUAHUA","AIBS821008VBA","AIBS821008HVZRRR09","SERGIO ARIAS BRAVO","08DPT0013H",null,null,null,0,0,"1",null,null,null,null,null,null,null,null,null,0,0,1,75911.87999999999]
[null,"CHIHUAHUA","CURA8608053U4","CURA860805HCHRDB09","ABEL CRUZ RODRIGUEZ","08DPT0013H",null,null,null,0,0,"1",null,null,null,null,null,null,null,null,null,0,0,1,8298.5]
[null,"CHIHUAHUA","ROLF551203KHA","ROLF551203HCLSRR07","FRANCISCO JAVIER DE LA ROSA LIRA","08DPT0013H",null,null,null,0,0,"1",null,null,null,null,null,null,null,null,null,0,0,1,21088.920000000002]
[null,"CHIHUAHUA","DODK891025237","DODK891025MCHMMR03","KARLA KARINA DOMINGUEZ DOMINGUEZ","08DPT0013H",null,null,null,0,0,"1",null,null,null,null,null,null,null,null,null,0,0,1,42218.22]
[null,"CHIHUAHUA","EECA8503081Q2","EECA850308HSLCRB06","ABRAHAM JACOBO ECHEVARRIA CORRALES","08DPT0013H",null,null,null,0,0,"1",null,null,null,null,null,null,null,null,null,0,0,1,42218.22]
[null,"CHIHUAHUA","EAGJ991008R37","EAGJ991008MCHSZS02","JESSICA LIZBETH ESCAÑUELAS GUZMAN","08DPT0013H",null,null,null,0,0,"1",null,null,null,null,null,null,null,null,null,0,0,1,27835.620000000003]
[null,"CHIHUAHUA","EISC871230RT1","EISC871230MCHSNR08","CAROLINA ESPINOZA DE SANTIAGO","08DPT0013H",null,null,null,0,0,"1",null,null,null,null,null,null,null,null,null,0,0,1,24256.84]
[null,"CHIHUAHUA","GAEH930405EV6","GAEH930405HCHRSC05","HECTOR RICARDO GARCIA  ESPINOZA","08DPT0013H",null,null,null,0,0,"1",null,null,null,null,null,null,null,null,null,0,0,1,22979.519999999997]
[null,"CHIHUAHUA","GOHD860913N63","GOHD860913MCLNRL08","DALIA LIBERTAD GONZALEZ HERNANDEZ","08DPT0013H",null,null,null,0,0,"1",null,null,null,null,null,null,null,null,null,0,0,1,42218.22]
[null,"CHIHUAHUA","HEAC5605024W8","HEAC560502HTCRRR19","JOSE CRUZ HERNANDEZ ARA","08DPT0013H",null,null,null,0,0,"1",null,null,null,null,null,null,null,null,null,0,0,1,21088.920000000002]
[null,"CHIHUAHUA","JUAS860801FD3","JUAS860801MCHRLL00","SILVIA ANGELICA JUAREZ ALVARADO","08DPT0013H",null,null,null,0,0,"1",null,null,null,null,null,null,null,null,null,0,0,1,14072.74]
[null,"CHIHUAHUA","LOCS771008517","LOCS771008HCHPRR09","SERGIO LOPEZ  DE LA CRUZ","08DPT0013H",null,null,null,0,0,"1",null,null,null,null,null,null,null,null,null,0,0,1,75911.87999999999]
[null,"CHIHUAHUA","NEAA910928HC9","NEAA910928HCHGCN09","ANTONIO NEGRETE ACOSTA","08DPT0013H",null,null,null,0,0,"1",null,null,null,null,null,null,null,null,null,0,0,1,14059.28]
[null,"CHIHUAHUA","OIFM6211126H4","OIFM621112MDGLLR07","MARTHA ELENA OLIVAS FLORES","08DPT0013H",null,null,null,0,0,"1",null,null,null,null,null,null,null,null,null,0,0,1,14059.28]
[null,"CHIHUAHUA","OISM951129R68","OISM951129MCHRLC03","MICHELLE ALEJANDRA ORTIZ SILVA","08DPT0013H",null,null,null,0,0,"1",null,null,null,null,null,null,null,null,null,0,0,1,22349.519999999997]
[null,"CHIHUAHUA","PAVS900926C55","PAVS900926MVZDZN02","SANDY YUNUEN PADILLA VAZQUEZ","08DPT0013H",null,null,null,0,0,"1",null,null,null,null,null,null,null,null,null,0,0,1,35805.32]
[null,"CHIHUAHUA","PUYR780420I72","PUYR780420MMCLXC00","ROCIO PULIDO  YAÑEZ","08DPT0013H",null,null,null,0,0,"1",null,null,null,null,null,null,null,null,null,0,0,1,75911.87999999999]
[null,"CHIHUAHUA","RESJ851201GQ9","RESJ851201HCHVPV07","JAVIER EDUARDO REVELES  SAPIEN","08DPT0013H",null,null,null,0,0,"1",null,null,null,null,null,null,null,null,null,0,0,1,75911.87999999999]
[null,"CHIHUAHUA","RICJ981124TJ7","RICJ981124HCHSVS02","JESUS RAYMUNDO RIOS COVARRUBIAS","08DPT0013H",null,null,null,0,0,"1",null,null,null,null,null,null,null,null,null,0,0,1,22979.519999999997]
[null,"CHIHUAHUA","ROES970521Q99","ROES970521MCHDSN09","SINAI CAROLINA RODRIGUEZ ESTRADA","08DPT0013H",null,null,null,0,0,"1",null,null,null,null,null,null,null,null,null,0,0,1,22349.32]
[null,"CHIHUAHUA","RUMJ670308JU5","RUMJ670308HSPBRN01","JUAN RUBIO MARTINEZ","08DPT0013H",null,null,null,0,0,"1",null,null,null,null,null,null,null,null,null,0,0,1,21088.920000000002]
[null,"CHIHUAHUA","SARC911030SC8","SARC911030HCHLMR00","CARLOS SALGADO  ROMO","08DPT0013H",null,null,null,0,0,"1",null,null,null,null,null,null,null,null,null,0,0,1,42218.22]
[null,"CHIHUAHUA","SAVS980512N44","SAVS980512MCHVLR08","SARAH INES SAAVEDRA VILLEGAS","08DPT0013H",null,null,null,0,0,"1",null,null,null,null,null,null,null,null,null,0,0,1,21088.920000000002]
[null,"CHIHUAHUA","SIER8905149W5","SIER890514MCHGSS03","ROSA SELENE SIGALA ESQUIVEL","08DPT0013H",null,null,null,0,0,"1",null,null,null,null,null,null,null,null,null,0,0,1,42218.22]
[null,"CHIHUAHUA","TORE8012234Y9","TORE801223HNTPYD08","EDGAR TOPETE REYES","08DPT0013H",null,null,null,0,0,"1",null,null,null,null,null,null,null,null,null,0,0,1,22979.519999999997]
[null,"CHIHUAHUA","TORR840104UJ5","TORR840104MCHRMQ05","RAQUEL IVETTE TORRES RAMIREZ","08DPT0013H",null,null,null,0,0,"1",null,null,null,null,null,null,null,null,null,0,0,1,42218.22]
[null,"CHIHUAHUA","UUMM850610TB5","UUMM850610HCHNNN02","MANUEL EDUARDO UNZUETA MORALES","08DPT0013H",null,null,null,0,0,"1",null,null,null,null,null,null,null,null,null,0,0,1,24895.5]
[null,"CHIHUAHUA","LIAL810304JK3","LIAL810304MCHCRL00","LILIANA LICON ARAGONEZ","00XXX0000X",null,null,null,null,null,null,null,null,null,null,null,null,1,0,0,1,0,0,100611.18]
[null,"CHIHUAHUA","BUAC8304198K9","BUAC830419MCHNGY03","CYNTHIA IRENE BUENO AGUIRRE","00XXX0000X",null,null,null,null,null,null,null,null,null,null,null,null,1,0,0,1,0,0,33229.949999999997]
[null,"CHIHUAHUA","CATC7205274V8","CATC720527HCHNRR09","CARLOS CANO TORRES","00XXX0000X",null,null,null,1,0,0,null,null,null,null,null,null,null,null,null,1,0,0,108391.78]
[null,"CHIHUAHUA","EATH590728P67","EATH590728HCHSRG00","HUGO ESNAYRA TRISTAN","00XXX0000X",null,null,null,null,null,null,null,null,null,null,null,null,1,0,0,1,0,0,33229.949999999997]
[null,"CHIHUAHUA","GOMD671113QD6","GOMD671113HCHMRG03","DIEGO RAUL GOMEZ MARTINEZ","00XXX0000X",null,null,null,1,0,0,null,null,null,null,null,null,null,null,null,1,0,0,101599.6]
[null,"CHIHUAHUA","MONL710121CT7","MONL710121MSLGVR08","LORENA INES MOGUEL NOVELO","00XXX0000X",null,null,null,null,null,null,null,null,null,null,null,null,1,0,0,1,0,0,33229.949999999997]
[null,"CHIHUAHUA","MOHB751008LK5","MOHB751008MMNNRL03","BLANCA ESTELA MONTAÑEZ HERNANDEZ","00XXX0000X",null,null,null,1,0,0,null,null,null,null,null,null,null,null,null,1,0,0,86477.64]
[null,"CHIHUAHUA","PALU750621U84","PAXL750621HCHLXS05","LUIS ENRIQUE PALACIOS","00XXX0000X",null,null,null,1,0,0,null,null,null,null,null,null,null,null,null,1,0,0,92830.7]
[null,"CHIHUAHUA","QUEG630216GA8","QUEG630216MCHXSR02","GRACIELA QUIÑONEZ ESTRADA","00XXX0000X",null,null,null,null,null,null,null,null,null,null,null,null,1,0,0,1,0,0,66459.899999999994]
[null,"CHIHUAHUA","SAWV80120227A","SAWV801202MCLNLV05","VIVIANA SANCHEZ WILLIAMS","00XXX0000X",null,null,null,null,null,null,null,null,null,null,null,null,1,0,0,1,0,0,66459.899999999994]
[null,"CHIHUAHUA","VARM7910137D6","VARM791013MCHLMR03","MARISOL VALLES RAMOS","00XXX0000X",null,null,null,1,0,0,null,null,null,null,null,null,null,null,null,1,0,0,90857.65]
[null,"CHIHUAHUA","AOCF590913PU5","AOCF590913HCHCNL08","FLAVIO FILOMENO ACOSTA CANO DE LOS RIOS","00XXX0000X",null,null,null,null,null,null,null,null,null,null,null,null,1,0,0,1,0,0,236416.25999999998]
[null,"CHIHUAHUA","AAGE900717365","AAGE900717MCHZZL09","ELIZABETH AZAETA GUZMAN","00XXX0000X",null,null,null,1,0,0,null,null,null,null,null,null,null,null,null,1,0,0,40108.460000000006]
[null,"CHIHUAHUA","CAMH8103197WA","CAMH810319HCHRRG06","HUGO ALBERTO CARMONA MORA","00XXX0000X",null,null,null,null,null,null,null,null,null,null,null,null,1,0,0,1,0,0,75764.28]
[null,"CHIHUAHUA","DEMS680803PI5","DEMS680803MCHLXN06","SANDRA DELGADO MUÑOZ","00XXX0000X",null,null,null,1,0,0,null,null,null,null,null,null,null,null,null,1,0,0,99730.72]
[null,"CHIHUAHUA","DUCD810810J24","DUCD810810MCHRRN06","DANISSA DURAN CARO","00XXX0000X",null,null,null,1,0,0,null,null,null,null,null,null,null,null,null,1,0,0,94315.55]
[null,"CHIHUAHUA","FEPD840911LH2","FEPD840911MCHRZN04","DENISSE JANETT FERNANDEZ PAEZ","00XXX0000X",null,null,null,1,0,0,null,null,null,null,null,null,null,null,null,1,0,0,69919.900000000009]
[null,"CHIHUAHUA","GACS670112I53","GACS670112MCHRHN02","SANDRA MARGARITA GARCIA CHAVEZ","00XXX0000X",null,null,null,1,0,0,null,null,null,null,null,null,null,null,null,1,0,0,122292.33999999998]
[null,"CHIHUAHUA","GARG760607HY8","GARG760607HCHSMS07","GUSTAVO ALONSO GASCA RAMIREZ ","00XXX0000X",null,null,null,null,null,null,null,null,null,null,null,null,1,0,0,1,0,0,75764.28]
[null,"CHIHUAHUA","LAAC860420JE7","LAAC860420MCHBPL04","CLAUDIA PATRICIA LABRADO APARICIO","00XXX0000X",null,null,null,1,0,0,null,null,null,null,null,null,null,null,null,1,0,0,76219.010000000009]
[null,"CHIHUAHUA","LORC551120FV3","LORC551120HCHYDR08","CARLOS JAVIER LOYA RODRIGUEZ","00XXX0000X",null,null,null,null,null,null,null,null,null,null,null,null,1,0,0,1,0,0,37882.14]
[null,"CHIHUAHUA","MOSF7009259L5","MOSF700925HCHRTR02","FERNANDO ALBERTO MORA SOTO","00XXX0000X",null,null,null,1,0,0,null,null,null,null,null,null,null,null,null,1,0,0,130389.70999999999]
[null,"CHIHUAHUA","PAMA800623I22","PAMA800623MDGDRL02","PADILLA MARQUEZ ALICIA","00XXX0000X",null,null,null,1,0,0,null,null,null,null,null,null,null,null,null,1,0,0,74372.75]
[null,"CHIHUAHUA","PEGC781114HZ3","PEGC781114HCHRRS06","CESAR VALENTE PEREA GARCIA ","00XXX0000X",null,null,null,1,0,0,null,null,null,null,null,null,null,null,null,1,0,0,34414.82]
[null,"CHIHUAHUA","RAMJ770419E96","RAMJ770419HSPMRS01","JESUS ALFONSO RAMIREZ MARRUFO","00XXX0000X",null,null,null,1,0,0,null,null,null,null,null,null,null,null,null,1,0,0,77394.789999999994]
[null,"CHIHUAHUA","REVB701115KRA","REVB701115MCHGTH02","BHERDINA REGALADO VITELA","00XXX0000X",null,null,null,1,0,0,null,null,null,null,null,null,null,null,null,1,0,0,88124.959999999992]
[null,"CHIHUAHUA","ROMF8411116Z4","ROMF841111MCHJXR01","FARINA ROJAS MUÑOZ","00XXX0000X",null,null,null,1,0,0,null,null,null,null,null,null,null,null,null,"1",0,0,40827.009999999995]
[null,"CHIHUAHUA","SACP740829IP4","SACP740829MCHLNL05","PILAR ALICIA SALAZAR CONTRERAS","00XXX0000X",null,null,null,1,0,0,null,null,null,null,null,null,null,null,null,1,0,0,54201.37]
[null,"CHIHUAHUA","SIRS640927FF8","SIRS640927MCHLDL09","SILVIA SILVA RODRIGUEZ ","00XXX0000X",null,null,null,1,0,0,null,null,null,null,null,null,null,null,null,1,0,0,138672.98000000001]
[null,"CHIHUAHUA","VARS761230AZ5","VARS761230MCHLML03","VALENZUELA RAMIREZ SILVIA CAROLINA","00XXX0000X",null,null,null,1,0,0,null,null,null,null,null,null,null,null,null,1,0,0,50627.450000000004]
[null,"CHIHUAHUA","VAGP6007013D4","VAGP600701MCHLNT09","PATRICIA RAQUEL VALVERDE GONZALEZ","00XXX0000X",null,null,null,1,0,0,null,null,null,null,null,null,null,null,null,1,0,0,122538.62]
[null,"CHIHUAHUA","RAPE620309J41","RAPE620309HCHYRN08","ENRIQUE RAY PORTILLO","00XXX0000X",null,null,null,0,0,1,null,null,null,null,null,null,null,null,null,0,0,1,63925.2]
[null,"Total Personas : ",851,null,null,null,null,null,null,null,null,null,null,null,null,null,null,null,null,null,null,"Total Recursos Ejercidos:",null,null,{"$f":"SUM(Tabla11[Columna24])","v":34153907.42920088}]
[]
[null,"Fuente : Información proporcionada por las Entidades Federativas."]

{"sheet":"II C y 1_","index":6,"n_rows":872,"n_cols":22,"rows_kept":872,"cut":false,"hidden":false,"merged":[[8,1,8,8],[866,18,866,19],[11,21,12,21],[11,8,12,8],[11,9,11,15],[11,16,12,16],[11,17,12,17],[11,20,12,20],[11,18,11,19],[11,2,12,2],[11,1,12,1],[11,7,12,7],[11,6,12,6],[11,5,12,5],[11,4,12,4],[11,3,12,3]]}
[]
[]
[]
[]
[]
[]
[]
[null,"Formato: Personal Federalizado por Registro Federal de Contribuyentes"]
[null,{"$f":"IF('1'!D22=\"Elige el Periodo…\",\"\",'1'!D22)","v":"Fondo de Aportaciones para la Educación Tecnológica y de Adultos/Colegio Nacional de Educación Profesional Técnica (FAETA/CONALEP)"},null,null,null,null,null,null,null,null,null,null,null,null,null,null,null,null,null,null,"3er. Trimestre 2019"]
[]
[]
[null,"Entidad Federativa","Clave CT","Turno","RFC","CURP","Nombre","Funcion Real","Horas que labora en el Centro de Trabajo","Clave Presupuestal",null,null,null,null,null,null,"Tipo de Categoría","Identificador de Contrato de Honorarios","Periodo de efecto de pago en el trimestre",null,"Percepciones pagadas en el Periodo de Comisión con Presupuesto Federal*","Percepciones pagadas en el Periodo de Comisión con Presupuesto de otra fuente*"]
[null,null,null,null,null,null,null,null,null,"Partida Presupuestal","Código de Pago","Clave de Unidad","Clave de Sub Unidad","Clave de Categoría","Horas Semana Mes ","Número de Plaza",null,null,"Inicial","Termino"]
[]
[null,"Columna1","Columna2","Columna3","Columna4","Columna5","Columna6","Columna7","Columna8","Columna9","Columna10","Columna11","Columna12","Columna13","Columna14","Columna15","Columna16","Columna17","Columna18","Columna19","Columna20","Columna21"]
[null,"CHIHUAHUA","08DPT0001C",120,"AEEF700614J96","AEEF700614HCHLNR00","JOSE FRANCISCO ALDERETE ENRIQUEZ","20108",480,83101,1003,"00",25,"CF33206",0,13641,2,null,20190701,20190930,140883.18,0]
[null,"CHIHUAHUA","08DPT0001C",120,"CACM660522B70","CACM660522HCHNHR08","MARIO RUBEN CANO CHEW","20108",480,83101,1003,"00",25,"CF33206",0,10185,2,null,20190701,20190930,84539.39,0]
[null,"CHIHUAHUA","08DPT0001C",120,"DIAM641007CI5","DIAM641007HCHZCN00","MANUEL DIAZ ACOSTA","20402",480,83101,1003,"00",25,"CF19201",0,2416,2,null,20190701,20190930,48112.11,0]
[null,"CHIHUAHUA","08DPT0001C",120,"FEPH590719P2A","FEPH590719MCHRRR08","HORTENSIA FERNANDEZ PARGA","20401",480,83101,1003,"00",25,"S01202",0,2408,2,null,20190701,20190930,39052.019999999997,0]
[null,"CHIHUAHUA","08DPT0001C",120,"GADE730513AY2","GADE730513HCHRZL06","ELIAS GARCIA DIAZ","20401",480,83101,1003,"00",25,"A03202",0,2375,2,null,20190701,20190930,48719.92,0]
[null,"CHIHUAHUA","08DPT0001C",120,"GAVL610223PN1","GAVL610223MGTRLN08","LEONOR GARZON VALDEZ","50401",480,83101,1003,"00",25,"CF02103",0,12557,5,null,20190701,20190930,85992.48,0]
[null,"CHIHUAHUA","08DPT0001C",120,"GOBS630720GU7","GOBS630720MCHNLL02","SILVIA CECILIA GONZALEZ BALDERRAMA","20401",480,83101,1003,"00",25,"S01202",0,2415,2,null,20190701,20190930,36782.25,0]
[null,"CHIHUAHUA","08DPT0001C",120,"GUSL800307M72","GUSL800307MCHTNL01","LILIANA GUTIERREZ SANDOVAL","20401",480,83101,1003,"00",25,"S01201",0,2391,2,null,20190701,20190930,35814.129999999997,0]
[null,"CHIHUAHUA","08DPT0001C",120,"HEFA581028JT6","HEFA581028HSRRLR03","ARISTEO HERNANDEZ FLORES",20401,480,83101,1003,"00",25,"A03202",0,10169,2,null,20190701,20190930,38207.410000000003,0]
[null,"CHIHUAHUA","08DPT0001C",120,"HEMM670602FX4","HEMM670602HCHRRL08","MELCHOR HERNANDEZ MORALES",20108,480,83101,1003,"00",25,"CF33206",0,13189,2,null,20190701,20190930,135826.29,0]
[null,"CHIHUAHUA","08DPT0001C",200,"IAAM650713G14","IAAM650713HCLBRR06","MARTIN GENARO IBARRA ARREDONDO","20401",480,83101,1003,"00",25,"S01201",0,2374,2,null,20190701,20190930,36666.19,0]
[null,"CHIHUAHUA","08DPT0001C",200,"JUVD951202BR4","JUVD951202HCHRLN06","DANIEL FRANCISCO JUAREZ VILLALOBOS","20402",480,83101,1003,"02",25,"S01201",0,2398,2,null,20190701,20190930,32508.44,0]
[null,"CHIHUAHUA","08DPT0001C",120,"JUGA720809R10","JUGA720809MCHRRL05","ALMA VERONICA JURADO GARCIA","20401",480,83101,1003,"03",25,"S01201",0,2410,2,null,20190701,20190930,30796.37,0]
[null,"CHIHUAHUA","08DPT0001C",120,"LOCS740722BY1","LOCS740722MCHYSN03","SANDRA LOYA CASTAÑEDA","20215",480,83101,1003,"00",25,"CF33202",0,2367,2,null,20190701,20190930,57813.15,0]
[null,"CHIHUAHUA","08DPT0001C",120,"LOLG6105041C1","LOLG610504HCHZPR03","GERARDO LOZANO LOPEZ","20216",480,83101,1003,"00",25,"CF34202",0,2415,2,null,20190701,20190930,49282.59,0]
[null,"CHIHUAHUA","08DPT0001C",120,"MASS920625T67","MASS920625MCHNTT05","STEPHANIE MANCHA SOTO",20401,480,83101,1003,"00",25,"S01201",0,7502,2,null,20190701,20190930,35775.550000000003,0]
[null,"CHIHUAHUA","08DPT0001C",120,"MACN5607036J8","MACN560703MCHRHR01","NORMA MARGARITA MARRUFO CHAPARRO","20105",480,83101,1003,"00",25,"CF33206",0,11000,2,null,20190701,20190930,122692.39,0]
[null,"CHIHUAHUA","08DPT0001C",200,"MERA640505HY3","MERA640505HCHNYR01","ARMANDO MENDEZ REYES",20401,480,83101,1003,"00",25,"CF18201",0,2389,2,null,20190701,20190930,35041.26,0]
[null,"CHIHUAHUA","08DPT0001C",120,"MOAP870129UT9","MOAP870129MCHLCT09","PATRICIA ARALI MOLINA ACOSTA","20401",480,83101,1003,"00",25,"CF33204",0,2392,2,null,20190701,20190930,79864.08,0]
[null,"CHIHUAHUA","08DPT0001C",120,"MOTJ521007RU5","MOTJ521007HCHRRS02","JESUS ALBERTO MORENO TORRES","20215",480,83101,1003,"00",25,"A03202",0,2373,2,null,20190701,20190930,47588.72,0]
[null,"CHIHUAHUA","08DPT0001C",120,"NAOG680625QA5","NAOG680625HCHRRL00","GUILLERMO NICOLAS NARVAEZ ORDAZ","20212",480,83101,1003,"00",25,"CF18203",0,2397,2,null,20190701,20190930,53553.15,0]
[null,"CHIHUAHUA","08DPT0001C",120,"NAWA860622JI6","NAWA860622HCHVGL05","ALEJANDRO MAURICIO NAVARRO WAGNER",50105,480,83101,1003,"00",25,"CF02105",0,12821,5,null,20190701,20190930,66459.899999999994,0]
[null,"CHIHUAHUA","08DPT0001C",120,"PIRE860510KC2","PIRE860510HCHZBS00","PIZANO RUBIO ESTALI",20401,480,83101,1003,"00",25,"S01201",0,10161,2,null,20190701,20190930,37099.480000000003,0]
[null,"CHIHUAHUA","08DPT0001C",200,"PODM630929V60","PODM630929HCHRZG02","MIGUEL PORTILLO DIAZ","20104",480,83101,1003,"00",25,"T08201",0,10784,2,null,20190701,20190930,42931.68,0]
[null,"CHIHUAHUA","08DPT0001C",200,"QUHM750313QX2","QUHM750313HZSNZN02","MANUEL QUINTERO HUIZAR",20401,480,83101,1003,"01",25,"CF18201",0,11868,2,null,20190701,20190930,31496.51,0]
[null,"CHIHUAHUA","08DPT0001C",120,"RAGN6608306N3","RAGN660830MCHMMR01","NORMA RAMIREZ GOMEZ","20206",480,83101,1003,"00",25,"CF04201",0,5255,2,null,20190701,20190930,52195.29,0]
[null,"CHIHUAHUA","08DPT0001C",120,"REMV840531384","REMV840531HCHYRC03","VICTOR MANUEL REYES MURILLO","20104",480,83101,1003,"00",25,"CF33204",0,2384,2,null,20190701,20190930,70830.38,0]
[null,"CHIHUAHUA","08DPT0001C",120,"REOS610731NK2","REOS610731MCHZLL01","SILVIA PATRICIA REZA OLIVAS","20102",480,83101,1003,"00",25,"CF33206",0,13184,2,null,20190701,20190930,137643.95000000001,0]
[null,"CHIHUAHUA","08DPT0001C",120,"ROCG710423BI2","ROCG710423MCHDNL05","GILDA ALEJANDRINA RODRIGUEZ CANO","20215",480,83101,1003,"00",25,"CF34201",0,2376,2,null,20190701,20190930,49067.93,0]
[null,"CHIHUAHUA","08DPT0001C",200,"ROVB9202105WA","ROVB920210HCHDLR05","BRYAN ARMANDO RODRIGUEZ VALVERDE","20401",480,83101,1003,"00",25,"S01201",0,2394,2,null,20190701,20190930,34551.89,0]
[null,"CHIHUAHUA","08DPT0001C",120,"RUDA711227IH4","RUDA711227HCHLLR08","ARTURO RUELAS DELGADO",20108,480,83101,1003,"00",25,"CF33206",0,14134,2,null,20190701,20190930,104661.44,0]
[null,"CHIHUAHUA","08DPT0001C",120,"SOPF600927M49","SOPF600927MCHTRR08","FERNANDA SOTELO PEREZ","20402",480,83101,1003,"00",25,"CF34202",0,2405,2,null,20190701,20190930,40484.410000000003,0]
[null,"CHIHUAHUA","08DPT0001C",120,"TOEB620314DK2","TOEB620314HCHRNR09","BERNARDO TORRES ENRIQUEZ","20401",480,83101,1003,"00",25,"S01202",0,2401,2,null,20190701,20190930,43380.25,0]
[null,"CHIHUAHUA","08DPT0001C",200,"TOLF901203UG1","TOLF901203HCHRZR07","FRANCISCO JAVIER TORRES LOZOYA","20401",480,83101,1003,"00",25,"S01201",0,2378,2,null,20190701,20190930,25029.93,0]
[null,"CHIHUAHUA","08DPT0001C",120,"VAAH770519CJ9","VAAH770519HCHZRC04","HECTOR MANUEL VAZQUEZ ARMENDARIZ","20401",480,83101,1003,"00",25,"CF18201",0,2374,2,null,20190701,20190930,41694.71,0]
[null,"CHIHUAHUA","08DPT0001C",120,"VIRC720302LS1","VIRC720302MCHLVR06","MARIA CRISTINA VILLAGRAN RIVERA","20215",480,83101,1003,"00",25,"CF21202",0,2381,2,null,20190701,20190930,56431.58,0]
[null,"CHIHUAHUA","08DPT0001C",120,"VIJD921113BZ7","VIJD921113HCHLRG00","DIEGO EMMANUEL VILLALBA JUAREZ","20105",480,83101,1003,"00",25,"CF33204",0,2385,2,null,20190701,20190930,73440.17,0]
[null,"CHIHUAHUA","08DPT0001C",100,"AOZL821127LL7","AOZL821127HCHCVS03","LUIS ALBERTO ACOSTA ZAVALA",30102,120,83101,1001,"00",25,"E3725","10.0",0,3,null,20190701,20190930,18020.599999999999,0]
[null,"CHIHUAHUA","08DPT0001C",200,"AUAJ750122A5A","AUAJ750122HCHGGS03","JESUS AGUILAR AGUILAR",30102,120,83101,1001,"00",25,"E3725",10,0,3,null,20190701,20190930,19320.599999999999,0]
[null,"CHIHUAHUA","08DPT0001C",100,"AULE8612293K4","AULE861229MCHGRL05","AGUIRRE LOERA ELDA EUNICE",30102,228,83101,1001,"00",25,"E3711",19,0,3,null,20190701,20190930,24935.9,0]
[null,"CHIHUAHUA","08DPT0001C",200,"AAMF560125R89","AAMF560125HCHLNL07","FLAVIO RAUL  ALVAREZ MONTOYA",30102,240,83101,1001,"00",25,"E3725",20,0,3,null,20190701,20190930,31354.28,0]
[null,"CHIHUAHUA","08DPT0001C",100,"AATL801210PB4","AATL801210MCHLNR06","LOURDES ADRIANA ALVAREZ TINTTORI",30102,216,83101,1001,"00",25,"E3725",18,0,3,null,20190701,20190930,29920.95,0]
[null,"CHIHUAHUA","08DPT0001C",100,"AIOM820517TC5","AIOM820517MCHVLR08","MARIANA AVILA  OLIVAS",30102,228,83101,1001,"00",25,"E3725",19,0,3,null,20190701,20190930,34281.089999999997,0]
[null,"CHIHUAHUA","08DPT0001C",100,"AAGJ821023VC5","AAGJ821023MCHZZS17","JESSICA CORAL AZAETA GUZMAN",30102,228,83101,1001,"00",25,"E3711",19,0,3,null,20190701,20190930,26943.51,0]
[null,"CHIHUAHUA","08DPT0001C",120,"BAFR630210M78","BAFR630210HCHQRC02","RICARDO BAQUERA  FRESCAS",30102,192,83101,1001,"00",25,"E3713",16,0,3,null,20190701,20190930,24658.59,0]
[null,"CHIHUAHUA","08DPT0001C",100,"BAAA801202930","BAAA801202HCHRLL09","ALBERTO GUERRERO BARRAZA ALVAREZ",30102,240,83101,1001,"00",25,"E3725","20.0",0,3,null,20190701,20190930,35291.21,0]
[null,"CHIHUAHUA","08DPT0001C",100,"BOME911008BP7","BOME911008MCHNRR09","ERIKA CECILIA BONILLA MARILES",30102,90,83101,1001,"00",25,"E3711","15.0",0,3,null,20190815,20190930,8842.6299999999992,0]
[null,"CHIHUAHUA","08DPT0001C",100,"BURS661015RT6","BURS661015HCHSSL07","SALVADOR  BUSTILLOS RASCON",30102,144,83101,1001,"00",25,"E3725","12.0",0,3,null,20190701,20190930,19164.73,0]
[null,"CHIHUAHUA","08DPT0001C",100,"CAAM640422S63","CAAM640422MCHMRR08","MARTHA LETICIA CAMPOS ARISMENDI",30102,240,83101,1001,"00",25,"E3725","20.0",0,3,null,20190701,20190930,33467.360000000001,0]
[null,"CHIHUAHUA","08DPT0001C",200,"CARG7105218G9","CARG710521HCHMMR07","GERARDO CAMPOS RAMIREZ",30102,192,83101,1001,"00",25,"E3725",16,0,3,null,20190701,20190930,29489.9,0]
[null,"CHIHUAHUA","08DPT0001C",100,"CASR730827BZ2","CASR730827HCHNTM09","RAMON ARMANDO CANO SOTO",30102,180,83101,1001,"00",25,"E3713",15,0,3,null,20190701,20190930,26650.46,0]
[null,"CHIHUAHUA","08DPT0001C",100,"CABA600225IW2","CABA600225MCHRRR09","ARACELI CARRASCO BARRAZA",30102,192,83101,1001,"00",25,"E3725",16,0,3,null,20190701,20190930,24966.04,0]
[null,"CHIHUAHUA","08DPT0001C",100,"CAON860317HL0","CAON860317MCHRCL00","NALLELY  YESENIA CARRASCO OCHOA",30102,108,83101,1001,"00",25,"E3725","9.0",0,3,null,20190701,20190930,14373.55,0]
[null,"CHIHUAHUA","08DPT0001C",120,"CAJM671130A58","CAJM671130HCHRRR04","MAURO GERARDO CARRILLO JUAREZ",30102,240,83101,1001,"00",25,"E3713","20.0",0,3,null,20190701,20190930,30376.83,0]
[null,"CHIHUAHUA","08DPT0001C",120,"CAAI5611206JA","CAAI561120MCHSRD05","IDELIA CASTRO ARMENDARIZ",30102,240,83101,1001,"00",25,"E3725","20.0",0,3,null,20190701,20190930,28940.5,0]
[null,"CHIHUAHUA","08DPT0001C",200,"CAFL660707EI1","CAFL660707MCHZLY06","LYDIA CAZARES  FLORES",30102,180,83101,1001,"00",25,"E3713","15.0",0,3,null,20190701,20190930,20757.650000000001,0]
[null,"CHIHUAHUA","08DPT0001C",200,"CEBE680921RL5","CEBE680921HCHNCL06","ELEAZAR  MATEO CENICEROS  BECERRA",30102,180,83101,1001,"00",25,"E3725",15,0,3,null,20190701,20190930,26068.98,0]
[null,"CHIHUAHUA","08DPT0001C",200,"CEMC581222Q78","CEMC581222MCHRLL09","CLARA CERVANTES  MELENDEZ",30102,192,83101,1001,"00",25,"E3725","16.0",0,3,null,20190701,20190930,28316.04,0]
[null,"CHIHUAHUA","08DPT0001C",200,"CAJF670208887","CAJF670208HCHHRR03","FERNANDO CHACON JURADO",30102,216,83101,1001,"00",25,"E3725","18.0",0,3,null,20190701,20190930,32097.09,0]
[null,"CHIHUAHUA","08DPT0001C",100,"CAGL640918UT9","CAGL640918MCHHMR07","MARIA DE LOURDES CHAVIRA GOMEZ",30102,216,83101,1001,"00",25,"E3725",18,0,3,null,20190701,20190930,33270.949999999997,0]
[null,"CHIHUAHUA","08DPT0001C",100,"CULT860821MM2","CULT860821MDFDGN17","TANIA CUADROS LUGO",30102,90,83101,1001,"00",25,"E3711","15.0",0,3,null,20191815,20190930,8819.6299999999992,0]
[null,"CHIHUAHUA","08DPT0001C",100,"DOTM5605051B1","DOTM560505MCHMRR05","MARGARITA DOMINGUEZ  TREVIZO",30102,120,83101,1001,"00",25,"E3725","10.0",0,3,null,20190701,20190930,19320.599999999999,0]
[null,"CHIHUAHUA","08DPT0001C",200,"EARE580710MW7","EARE580710MDFRQL19","ELSA AMALIA ERRASQUIN  ROQUE",30102,120,83101,1001,"00",25,"E3725","10.0",0,3,null,20190701,20190930,15383.68,0]
[null,"CHIHUAHUA","08DPT0001C",100,"EOOC700117F69","EOOC700117HCHSRR08","CARLOS ESCOBEDO ORTEGA",30102,192,83101,1001,"00",25,"E3725",16,0,3,null,20190701,20190930,25905.25,0]
[null,"CHIHUAHUA","08DPT0001C",100,"EACM621211KN0","EACM621211HCHSHR04","MARTIN ESPARZA  CHAVEZ",30102,228,83101,1001,"00",25,"E3725",19,0,3,null,20190701,20190930,32520.3,0]
[null,"CHIHUAHUA","08DPT0001C",100,"EADR661019BU9","EADR661019HCHSZM08","ESPARZA DIAZ RAMON",30102,120,83101,1001,"00",25,"E3713","10.0",0,3,null,20190701,20190930,17188.41,0]
[null,"CHIHUAHUA","08DPT0001C",200,"EILJ680419MG0","EILJ680419HCHSNR05","JORGE ALBERTO  ESPINOZA  LUNA",30102,240,83101,1001,"00",25,"E3725","20.0",0,3,null,20190701,20190930,31941.21,0]
[null,"CHIHUAHUA","08DPT0001C",200,"FECA6103137A4","FECA610313HDFRLB09","ABELARDO FERNANDEZ  CALDERON",30102,216,83101,1001,"00",25,"E3713","18.0",0,3,null,20190701,20190930,27609.15,0]
[null,"CHIHUAHUA","08DPT0001C",200,"FOFL641113DP1","FOFL641113HCHLLS06","LUIS ALBERTO FLORES  FLORES",30102,204,83101,1001,"00",25,"E3725",17,0,3,null,20190701,20190930,32260.82,0]
[null,"CHIHUAHUA","08DPT0001C",100,"GAMR760920E78","GAMR760920MCHLNT06","RUTH GALLEGOS  MONARCA",30102,216,83101,1001,"00",25,"E3725",18,0,3,null,20190701,20190930,33270.949999999997,0]
[null,"CHIHUAHUA","08DPT0001C",200,"GAVF750826318","GAVF750826HCHLLR05","FRANCISCO AGUSTIN GALLEGOS  VILLASEÑOR",30102,144,83101,1001,"00",25,"E3725","12.0",0,3,null,20190701,20190930,21864.73,0]
[null,"CHIHUAHUA","08DPT0001C",100,"GALR830327972","GALR830327MCHRYS00","ROSA HERLINADA GARCIA LOYA",30102,204,83101,1001,"00",25,"E3725","17.0",0,3,null,20190701,20190930,28026.18,0]
[null,"CHIHUAHUA","08DPT0001C",120,"GALJ810323DN3","GALJ810323HCHRZS03","JESUS SAUL GARCIA  LOZANO",30102,240,83101,1001,"00",25,"E3725",20,0,3,null,20190701,20190930,34054.28,0]
[null,"CHIHUAHUA","08DPT0001C",200,"GAMG821026JM8","GAMG821026HDGRRB08","GABINO GARCIA  MARRUFO",30102,240,83101,1001,"00",25,"E3725","20.0",0,3,null,20190701,20190930,35291.21,0]
[null,"CHIHUAHUA","08DPT0001C",120,"GAOM870316CN9","GAOM870316HCHRRG00","JOSE MIGUEL GARCIA ORTIZ",30102,240,83101,1001,"00",25,"E3725","20.0",0,3,null,20190701,20190930,35291.22,0]
[null,"CHIHUAHUA","08DPT0001C",100,"GAVV7810103W7","GAVV781010MCHRSR04","VERONICA GARDEA  VAZQUEZ",30102,192,83101,1001,"00",25,"E3725",16,0,3,null,20190701,20190930,30076.83,0]
[null,"CHIHUAHUA","08DPT0001C",200,"GOAC860518J59","GOAC860518HCHMVR06","CARLOS JOEL GOMEZ AVILA",30102,180,83101,1001,"00",25,"E3725",15,0,3,null,20190701,20190930,29003.63,0]
[null,"CHIHUAHUA","08DPT0001C",120,"GOHS731228LU7","GOHS731228HCHNLM00","GONZALEZ HOLGUIN SIMON",30102,156,83101,1001,"00",25,"E3725",13,0,3,null,20190701,20190930,19784.77,0]
[null,"CHIHUAHUA","08DPT0001C",120,"HEAM7409112X6","HEAM740911MCHRRR00","MARCELA HERNANDEZ ARMENDARIZ",30102,240,83101,1001,"00",25,"E3725",20,0,3,null,20190701,20190930,33530.43,0]
[null,"CHIHUAHUA","08DPT0001C",100,"HERA781214D5A","HERA781214HCHRMR02","AARON TERCERO HERNANDEZ ROMO",30102,216,83101,1001,"00",25,"E3725","18.0",0,3,null,20190701,20190930,32097.09,0]
[null,"CHIHUAHUA","08DPT0001C",120,"HESM4812063X7","HESM481206HDFRGR09","MARIO HERNANDEZ SEGURA",30102,240,83101,1001,"00",25,"E3725","20.0",0,3,null,20190701,20190930,35941.21,0]
[null,"CHIHUAHUA","08DPT0001C",120,"HEMB811018BN2","HEMB811018MCHRNT06","BEATRIZ ELENA HERRERA  MENDOZA",30102,216,83101,1001,"00",25,"E3725",18,0,3,null,20190701,20190930,30336.3,0]
[null,"CHIHUAHUA","08DPT0001C",100,"JIVG670122BN0","JIVG670122HCHMLD01","GAUDENCIO JIMENEZ VALENTIN",30102,216,83101,1001,"00",25,"E3725",18,0,3,null,20190701,20190930,29686.3,0]
[null,"CHIHUAHUA","08DPT0001C",120,"LESO760401T71","LESO760401HCHLXM07","OMAR LEAL SEAÑEZ",30102,120,83101,1001,"00",25,"E3725",10,0,3,null,20190701,20190930,18083.68,0]
[null,"CHIHUAHUA","08DPT0001C",100,"LOGM811218IW7","LOGM811218MCHRNY01","MYRNA GUADALUPE LOERA GONZALEZ",30102,228,83101,1001,"00",25,"E3713","19.0",0,3,null,20190701,20190930,30151.57,0]
[null,"CHIHUAHUA","08DPT0001C",200,"LOMM630709QH3","LOMM630709MCHPRR06","MIRIAM LOPEZ  MARQUEZ",30102,192,83101,1001,"00",25,"E3725",16,0,3,null,20190701,20190930,27142.18,0]
[null,"CHIHUAHUA","08DPT0001C",200,"LOCJ610711AFA","LOCJ610711HCHYHV06","JAVIER BENJAMIN LOYA CHAVIRA",30102,228,83101,1001,"00",25,"E3725",19,0,3,null,20190701,20190930,30931.09,0]
[null,"CHIHUAHUA","08DPT0001C",200,"LOHL711219AQ3","LOHL711219MCHYRL02","LILIANA IVONNE LOYA  HERNANDEZ",30102,180,83101,1001,"00",25,"E3725","15.0",0,3,null,20190701,20190930,27305.91,0]
[null,"CHIHUAHUA","08DPT0001C",100,"LORJ800906MC9","LORJ800906HCHYDS03","JESUS ARTURO LOYA RODRIGUEZ",30102,180,83101,1001,"00",25,"E3713","15.0",0,3,null,20190701,20190930,11577.64,0]
[null,"CHIHUAHUA","08DPT0001C",100,"MAGP631129C83","MAGP631129HCHRNR03","PERFECTO MARQUEZ GONZALEZ",30102,240,83101,1001,"00",25,"E3713",20,0,3,null,20190701,20190930,29359.7,0]
[null,"CHIHUAHUA","08DPT0001C",200,"MACC861013NB9","MACC861013HCHRLR03","CARLOS ISAAC MARRUFO CALDERON",30102,180,83101,1001,"00",25,"E3725","15.0",0,3,null,20190701,20190930,26655.91,0]
[null,"CHIHUAHUA","08DPT0001C",200,"MEPP891226PB1","MEPP891226MCHNZT02","PATSY MENDEZ PAZ",30102,180,83102,1001,"00",25,"E3711",15,0,3,null,20190701,20190930,14481.6,0]
[null,"CHIHUAHUA","08DPT0001C",200,"MEMM770410518","MEMM770410HCHRNN08","MANUEL MERAZ MENDEZ",30102,168,83101,1001,"00",25,"E3725",14,0,3,null,20190701,20190930,26295.78,0]
[null,"CHIHUAHUA","08DPT0001C",100,"MURE810806BI4","MURE810806HCHXJM09","MUÑOZ ROJAS EMMANUEL",30102,240,83101,1001,"00",25,"E3725","20.0",0,3,null,20190701,20190930,34641.21,0]
[null,"CHIHUAHUA","08DPT0001C",100,"NAME521010PW5","NAME521010HCHVNN03","ENRIQUE NAVARRO MENDOZA",30102,240,83101,1001,"00",25,"E3725","20.0",0,3,null,20190701,20190930,33991.21,0]
[null,"CHIHUAHUA","08DPT0001C",200,"OIAO791026IM2","OIAO791026HCHLPS00","OSCAR ERNESTO OLIVAS APONTE",30102,120,83101,1001,"00",25,"E3725","10.0",0,3,null,20190701,20190930,18670.599999999999,0]
[null,"CHIHUAHUA","08DPT0001C",100,"OILR550330775","OILR550330HCHLPG01","ROGELIO OLIVAS LOPEZ",30102,216,83101,1001,"00",25,"E3725","18.0",0,3,null,20190701,20190715,4398.3,0]
[null,"CHIHUAHUA","08DPT0001C",120,"OEZH720627D54","OEZH720627HCHRBG04","HUGO ORTEGA ZUBIATE",30102,180,83101,1001,"00",25,"E3725","15.0",0,3,null,20190701,20190930,23955.91,0]
[null,"CHIHUAHUA","08DPT0001C",200,"PARM520707MY1","PARM520707HPLLCG03","MIGUEL ANGEL PALMA ROCHA",30102,96,83101,1001,"00",25,"E3711","8.0",0,3,null,20190701,20190930,11900.96,0]
[null,"CHIHUAHUA","08DPT0001C",100,"PAGM7008098P1","PAGM700809HCHRRR01","MAURO RUBEN PARADA GRANADOS",30102,96,83101,1001,"00",25,"E3725","8.0",0,3,null,20190701,20190930,12776.48,0]
[null,"CHIHUAHUA","08DPT0001C",120,"PARF590815ED3","PARF590815MVZVSL20","FELICITAS  PAVON ROSAS",30102,240,83101,1001,"00",25,"E3713",20,0,3,null,20190701,20190930,27834.03,0]
[null,"CHIHUAHUA","08DPT0001C",100,"PAVE830228SH0","PAVE830228HCHZLN00","ENRIQUE PAZOS VALLES",30102,240,83101,1001,"00",25,"E3713",20,0,3,null,20190701,20190930,27168.28,0]
[null,"CHIHUAHUA","08DPT0001C",200,"PECA750727I8A","PECA750727HJCRRL03","ALEJANDRO PEREZ CORTES",30102,168,83101,1001,"00",25,"E3725","14.0",0,3,null,20190701,20190930,21900.45,0]
[null,"CHIHUAHUA","08DPT0001C",200,"PICN620328PA0","PICN620328HVZNRR07","JOSE NORBERTO PINEDA CRUZ",30102,144,83101,1001,"00",25,"E3725",12,0,3,null,20190701,20190930,19164.73,0]
[null,"CHIHUAHUA","08DPT0001C",100,"PIRL7804262E7","PIRL780426MCHXZZ09","MARIA LIZETH PIÑON RUIZ",30102,216,83101,1001,"00",25,"E3725",18,0,3,null,20190701,20190930,33270.949999999997,0]
[null,"CHIHUAHUA","08DPT0001C",200,"QURM640822CE7","QURM640822MCHNZR02","MARTINA LILIA QUINTANA  RUIZ",30102,240,83101,1001,"00",25,"E3725","20.0",0,3,null,20190701,20190930,35291.21,0]
[null,"CHIHUAHUA","08DPT0001C",200,"RAGG600206G85","RAGG600206MCHMTR04","GRACIELA RAMIREZ  GUTIERREZ",30102,180,83101,1001,"00",25,"E3725",15,0,3,null,20190701,20190930,23368.98,0]
[null,"CHIHUAHUA","08DPT0001C",120,"RAMA741011N9A","RAMA741011MCHMRN00","ANABEL RAMOS  MORALES",30102,216,83101,1001,"00",25,"E3725",18,0,3,null,20190701,20190930,32620.95,0]
[null,"CHIHUAHUA","08DPT0001C",200,"RARN711008BK5","RARN711008MCHSMR09","NORMA PATRICIA RASCON RAMIREZ",30102,180,83101,1001,"00",25,"E3725",15,0,3,null,20190701,20190930,26592.84,0]
[null,"CHIHUAHUA","08DPT0001C",100,"RECN560808KM6","RECN560808MCHYRR00","MARIA NORMA REYES CARREON",30102,192,83101,1001,"00",25,"E3725",16,0,3,null,20190701,20190930,28776.83,0]
[null,"CHIHUAHUA","08DPT0001C",100,"REOL730620M72","REOL730620MCHYRC05","LUCIA REYES ORTIZ",30102,204,83101,1001,"00",25,"E3725",17,0,3,null,20190701,20190930,32260.82,0]
[null,"CHIHUAHUA","08DPT0001C",200,"RIMI820220GQ7","RIMI820220HCHVCV02","RIVERA MACIAS IVAN JOEL",30102,180,83101,1001,"00",25,"E3725",15,0,3,null,20190701,20190930,24958.2,0]
[null,"CHIHUAHUA","08DPT0001C",100,"ROSL660422DP2","ROSL660422HCHDLZ09","MARIA DE LA LUZ  RODARTE  SOLIS",30102,204,83101,1001,"00",25,"E3725","17.0",0,3,null,20190701,20190930,30499.72,0]
[null,"CHIHUAHUA","08DPT0001C",100,"ROAA871025FU9","ROAA871025HCHDGL07","ALBERTO RODRIGUEZ AGUIRRE",30102,216,83101,1001,"00",25,"E3713",18,0,3,null,20190701,20190930,23383.47,0]
[null,"CHIHUAHUA","08DPT0001C",120,"ROGJ6301201E0","ROGJ630120MCHDZS08","MARIA DE JESUS RODRIGUEZ GUZMAN",30102,192,83101,1001,"00",25,"E3725","16.0",0,3,null,20190701,20190930,28902.97,0]
[null,"CHIHUAHUA","08DPT0001C",100,"ROAL730412EQ6","ROAL730412HCHJRS01","LUIS JAVIER ROJAS ARAGONEZ",30102,192,83101,1001,"00",25,"E3725",16,0,3,null,20190701,20190930,29426.83,0]
[null,"CHIHUAHUA","08DPT0001C",200,"ROPV750812QL5","ROPV750812HCHMCC00","VICTOR MANUEL ROMERO PACHECO",30102,132,83101,1001,"00",25,"E3713",11,0,3,null,20190701,20190930,18430.84,0]
[null,"CHIHUAHUA","08DPT0001C",200,"ROTO850629550","ROTO850629HCHNRS06","OSCAR ARMANDO RONQUILLO TERAN ",30102,180,83101,1001,"00",25,"E3711",15,0,3,null,20190701,20190930,22075.63,0]
[null,"CHIHUAHUA","08DPT0001C",120,"ROVI820310797","ROVI820310MCLNLV07","IVAN RAMON RONQUILLO VILLALBA",30102,204,83101,1001,"00",25,"E3725",17,0,3,null,20190701,20190930,29263.11,0]
[null,"CHIHUAHUA","08DPT0001C",100,"RUNH860818SE6","RUNH860818HCHBJM07","HUMERTO ALONSO RUBIO NAJERA",30102,120,83101,1001,"00",25,"E3711","10.0",0,3,null,20190701,20190930,15013.71,0]
[null,"CHIHUAHUA","08DPT0001C",100,"RUMS740226UR4","RUMS740226MCHZRL09","MARIA SOLEDAD RUIZ MARQUEZ",30102,240,83101,1001,"00",25,"E3725",20,0,3,null,20190701,20190930,32356.57,0]
[null,"CHIHUAHUA","08DPT0001C",100,"SAQG720512BW2","SAQG720512MCHNXD07","GUADALUPE   SAENZ  QUIÑONEZ",30102,240,83101,1001,"00",25,"E3725",20,0,3,null,20190701,20190930,34704.28,0]
[null,"CHIHUAHUA","08DPT0001C",120,"SIML5803182A8","SIML580318HCHLJS14","JOSE LUIS CARLOS SILVEYRA MEJIA",30102,240,83101,1001,"00",25,"E3725",20,0,3,null,20190701,20190930,30767.360000000001,0]
[null,"CHIHUAHUA","08DPT0001C",200,"TAAD800122GU1","TAAD800122HCHRRL07","DELFINO TARIN ARMENDARIZ",30102,216,83101,1001,"00",25,"E3725",18,0,3,null,20190701,20190930,31510.16,0]
[null,"CHIHUAHUA","08DPT0001C",100,"UIOM910617AH6","UIOM910617MCHRRR00","URIZA ORTIZ MARIBEL",30102,216,83101,1001,"00",25,"E3713","18.0",0,3,null,20190701,20190930,27609.15,0]
[null,"CHIHUAHUA","08DPT0001C",200,"VACA610212RT2","VXCA610212HCHLHD03","ADOLFO VALLES  CHAVEZ",30102,168,83101,1001,"00",25,"E3725",14,0,3,null,20190701,20190930,27469.63,0]
[null,"CHIHUAHUA","08DPT0001C",100,"VADS631230CN3","VADS631230MCHLVL06","SILVIA LETICIA VALVERDE DAVILA",30102,240,83101,1001,"00",25,"E3725",20,0,3,null,20190701,20190930,35291.21,0]
[null,"CHIHUAHUA","08DPT0001C",100,"VIRR710926945","VIRR710926HCHLDB12","RUBEN   VILLALOBOS RODRIGUEZ",30102,240,83101,1001,"00",25,"E3725","20.0",0,3,null,20190701,20190930,31941.21,0]
[null,"CHIHUAHUA","08DPT0001C",200,"VIPR570927K44","VIPR570927HCHLYF07","RAFAEL JESUS VILLEGAS PAYAN",30102,240,83101,1001,"00",25,"E3725","20.0",0,3,null,20190701,20190930,34641.21,0]
[null,"CHIHUAHUA","08DPT0002B",200,"AARL701222GC6","AARL701222MCHRVB04","LIBIA GABRIELA ARAGON RIVERA",30102,240,83101,1001,"00",26,"E3725",20,0,3,null,20190701,20190930,41340.78,0]
[null,"CHIHUAHUA","08DPT0002B",200,"BAGR640911VB4","BAGR640911HCHRND09","RODOLFO ELI BARONA GONZALEZ",30102,160,83101,1001,"00",26,"E3713",15,0,3,null,20190701,20190930,24153.170000000006,0]
[null,"CHIHUAHUA","08DPT0002B",100,"BOAI840527A86","BOAI840527MCHRGN00","MARIA INES BORUNDA AGUILAR",30102,240,83101,1001,"00",26,"E3725",20,0,3,null,20190701,20190930,38640.78,0]
[null,"CHIHUAHUA","08DPT0002B",200,"CACS480226NE5","CACS480226HGTMPL06","SALVADOR CAMPOS CAPETILLO",30102,232,83101,1001,"00",26,"E3725",20,0,3,null,20190701,20190930,39270.71,0]
[null,"CHIHUAHUA","08DPT0002B",100,"CAPH630209KZ0","CAPH630209MCHRSL06","HILDA MARGARITA CARRASCO POSADA",30102,120,83101,1001,"00",26,"E3725",10,0,3,null,20190701,20190930,22020.39,0]
[null,"CHIHUAHUA","08DPT0002B",100,"COCD901004DB8","COCD901004MCHRHN09","DAINA ROCIO CORTES CHAVEZ",30102,232,83101,1001,"00",26,"E3713",20,0,3,null,20190701,20190930,35700.82,0]
[null,"CHIHUAHUA","08DPT0002B",100,"EABM680229EQ9","EABM680229MCHSDR08","MARTHA GUADALUPE ESCALANTE BADILLO",30102,224,83101,1001,"00",26,"E3725",19,0,3,null,20190701,20190930,35998.700000000004,0]
[null,"CHIHUAHUA","08DPT0002B",120,"EOHA790831RH0","EOHA790831MZSSRN01","MARIA DE LOS ANGELES ESCOBAR DE HARO",30102,232,83101,1001,"00",26,"E3725",19,0,3,null,20190701,20190930,40768.770000000004,0]
[null,"CHIHUAHUA","08DPT0002B",200,"EAML780807EM2","EAML780807MCHSRR05","LORENA ESTRADA MURILLO",30102,144,83101,1001,"00",26,"E3725",18,0,3,null,20190701,20190930,21996.140000000003,0]
[null,"CHIHUAHUA","08DPT0002B",100,"FAMA641105R5A","FAMA641105MCHVRL07","ALMA ISABEL FAVELA MARTINEZ",30102,232,83101,1001,"00",26,"E3725",20,0,3,null,20190701,20190930,40570.71,0]
[null,"CHIHUAHUA","08DPT0002B",100,"FOLS800726I38","FOLS800726MCHLCN07","SANDYANA FLORES LUCERO",30102,240,83101,1001,"00",26,"E3725",20,0,3,null,20190701,20190930,41990.78,0]
[null,"CHIHUAHUA","08DPT0002B",100,"FONE671109ME3","FONE671109MCHLVS06","ESPERANZA FLORES NAVARRO",30102,232,83101,1001,"00",26,"E3725",20,0,3,null,20190701,20190930,41220.71,0]
[null,"CHIHUAHUA","08DPT0002B",200,"GAGC810607AX3","GAGC810607MCHRRH07","CHRISTIAN BELEN GARCIA GARCIA",30102,232,83101,1001,"00",26,"E3725",19,0,3,null,20190701,20190930,40118.770000000004,0]
[null,"CHIHUAHUA","08DPT0002B",200,"GALJ860302G54","GALJ860302HGTRNV04","JAVIER GARCIA LUNA",30102,240,83101,1001,"00",26,"E3725",20,0,3,null,20190701,20190930,40690.78,0]
[null,"CHIHUAHUA","08DPT0002B",100,"GOLC890608AQ0","GOLC890608MCHMRY05","CYNTHIA LILIANA GOMEZ LARA",30102,232,83101,1001,"00",26,"E3711",19,0,3,null,20190701,20190930,32126.364000000001,0]
[null,"CHIHUAHUA","08DPT0002B",120,"GOAJ891103DFA","GOAJ891103HCHNLR08","JORGE OMAR GONZALEZ ALVIDREZ",30102,204,83101,1001,"00",26,"E3711",17,0,3,null,20190701,20190930,27958.720000000001,0]
[null,"CHIHUAHUA","08DPT0002B",200,"GOCY840110NQ4","GOCY840110MCHNLS07","YSELA GONZALEZ CALDERA",30102,232,83101,1001,"00",26,"E3725",20,0,3,null,20190701,20190930,40730.71,0]
[null,"CHIHUAHUA","08DPT0002B",200,"GOMA851115JC8","GOMA851115HCHNRR07","AARON ROBERTO GONZALEZ MORAN",30102,228,83101,1001,"00",26,"E3725",20,0,3,null,20190701,20190930,38560.68,0]
[null,"CHIHUAHUA","08DPT0002B",100,"GOPS780818LH4","GOPS780818HCHNRR01","SERGIO GONZALEZ PEREZ",30102,232,83101,1001,"00",26,"E3725",19,0,3,null,20190701,20190930,40768.770000000004,0]
[null,"CHIHUAHUA","08DPT0002B",100,"GOCE790701I32","GOXC790701MCHNXL06","CELIA BRISA GONZALEZ ",30102,224,83101,1001,"00",26,"E3725",19,0,3,null,20190701,20190930,39348.700000000004,0]
[null,"CHIHUAHUA","08DPT0002B",100,"GUFD63111111A","GUFD631111MSLVRN17","DINA YESENIA GUEVARA FIERRO",30102,240,83101,1001,"00",26,"E3725",20,0,3,null,20190701,20190930,41340.78,0]
[null,"CHIHUAHUA","08DPT0002B",100,"HEDC640302NR2","HEDC640302HZSRZR01","CARLOS HERNANDEZ DIAZ",30102,232,83101,1001,"00",26,"E3725",19,0,3,null,20190701,20190930,40118.770000000004,0]
[null,"CHIHUAHUA","08DPT0002B",200,"IARL8304031L7","IARL830403HZSBMS09","LUIS ROMAN IBARRA  RAMOS",30102,240,83101,1001,"00",26,"E3725",20,0,3,null,20190701,20190930,41340.78,0]
[null,"CHIHUAHUA","08DPT0002B",200,"JAAZ890626IJ1","JAAZ890626MCHSVM08","ZIMRI DANIEL JASSO AVILA",30102,228,83101,1001,"00",26,"E3713",19,0,3,null,20190701,20190930,34765.870000000003,0]
[null,"CHIHUAHUA","08DPT0002B",120,"LAOE880302RW2","LAOE880302MCHZRL08","ELIZA ARELY LAZALDE ORTIZ",30102,220,83101,1001,"00",26,"E3713",18,0,3,null,20190701,20190930,34193.730000000003,0]
[null,"CHIHUAHUA","08DPT0002B",200,"LEGF590530LW9","LEGF590530HCHNTR00","FERNANDO LEON GUTIERREZ",30102,224,83101,1001,"00",26,"E3725",18,0,3,null,20190701,20190930,37596.759999999995,0]
[null,"CHIHUAHUA","08DPT0002B",120,"LOCA790201FP3","LXCA790201HCHRSD09","ADRIAN FRANCISCO LOERA  CASTRO",30102,232,83101,1001,"00",26,"E3725",19,0,3,null,20190701,20190930,41418.770000000004,0]
[null,"CHIHUAHUA","08DPT0002B",200,"LORF830406762","LORF830406HCHPML02","FELIPE LOPEZ RAMIREZ",30102,232,83101,1001,"00",26,"E3713",20,0,3,null,20190701,20190930,32350.82,0]
[null,"CHIHUAHUA","08DPT0002B",100,"LURG880415UKA","LURG880415MCHNVB04","GABRIELA ALEJANDRA LUNA  RIVAS",30102,216,83101,1001,"00",26,"E3725",18,0,3,null,20190701,20190930,38126.699999999997,0]
[null,"CHIHUAHUA","08DPT0002B",120,"LURY8009223V9","LURY800922MSPNBJ02","YAJAIRA ALEJANDRA LUNA ROBLEDO",30102,72,83101,1001,"00",26,"E3711",12,0,3,null,20190816,20190930,9006.27,0]
[null,"CHIHUAHUA","08DPT0002B",200,"MARJ6706253G1","MARJ670625HCHRSN08","JUAN FRANCISCO MARQUEZ DE LA ROSA",30102,240,83101,1001,"00",26,"E3713",20,0,3,null,20190701,20190930,35635.089999999997,0]
[null,"CHIHUAHUA","08DPT0002B",200,"MAHR7303052U1","MAHR730305HCHRRG05","RIGOBERTO MARTINEZ HERNANDEZ",30102,224,83101,1001,"00",26,"E3725",18,0,3,null,20190701,20190930,39546.759999999995,0]
[null,"CHIHUAHUA","08DPT0002B",200,"MARE920423KX8","MARE920423MCHRNR05","ERIKA ELIZABETH MARTINEZ RANGEL",30102,216,83101,1001,"00",26,"E3713",18,0,3,null,20190701,20190930,32926.58,0]
[null,"CHIHUAHUA","08DPT0002B",120,"MAER7001128F3","MAER700112MCHTSQ04","RAQUEL  MATA ESPARZA",30102,240,83101,1001,"00",26,"E3725",20,0,3,null,20190701,20190930,41990.78,0]
[null,"CHIHUAHUA","08DPT0002B",120,"MAMJ7909266H9","MAMJ790926HNLTDV08","JAVIER MATA MEDINA",30102,152,83101,1001,"00",26,"E3711",19,0,3,null,20190701,20190930,17855.66,0]
[null,"CHIHUAHUA","08DPT0002B",200,"MEMA740518TM8","MEMA740518HCHLLL03","ALFONSO NATANAEL MELENDEZ MELENDEZ",30102,236,83101,1001,"00",26,"E3725",20,0,3,null,20190701,20190930,40630.740000000005,0]
[null,"CHIHUAHUA","08DPT0002B",200,"MEPF691219UT3","MEPF691219HCHLRR06","FRANCISCO JAVIER MELENDEZ PEREYRA",30102,204,83101,1001,"00",26,"E3725",18,0,3,null,20190701,20190930,35996.599999999991,0]
[null,"CHIHUAHUA","08DPT0002B",120,"MERE811126DU3","MERE811126MCHLMD02","EDNA MELINA MELERO RAMIREZ",30102,224,83101,1001,"00",26,"E3725",19,0,3,null,20190701,20190930,38858.700000000004,0]
[null,"CHIHUAHUA","08DPT0002B",100,"MEMN800616CH0","MEMN800616MZSNRR04","NORA DE LOURDES MENDEZ MARRUFO",30102,208,83101,1001,"00",26,"E3725",16,0,3,null,20190701,20190930,37102.74,0]
[null,"CHIHUAHUA","08DPT0002B",100,"MEPM521007BW0","MEPM521007MSPNTR05","MARINA MENDOZA PATIÑO",30102,224,83101,1001,"00",26,"E3725",18,0,3,null,20190701,20190930,41113.759999999995,0]
[null,"CHIHUAHUA","08DPT0002B",100,"MEHE771226AK0","MEHE771226MCHZRM07","EMMA MARINA MEZA HERNANDEZ",30102,120,83101,1001,"00",26,"E3725",10,0,3,null,20190701,20190930,22670.39,0]
[null,"CHIHUAHUA","08DPT0002B",100,"MONJ730522LH4","MONJ730522HCHLXN04","JUAN BENJAMIN MOLINA NUÑEZ",30102,216,83101,1001,"00",26,"E3711",18,0,3,null,20190701,20190930,28794.5,0]
[null,"CHIHUAHUA","08DPT0002B",200,"MOMC840319BC9","MOMC840319MCHRRR01","CARMINA SARA MORENO MORALES",30102,160,83101,1001,"00",26,"E3713",15,0,3,null,20190701,20190930,23503.170000000006,0]
[null,"CHIHUAHUA","08DPT0002B",200,"NARE6212101N2","NARE621210HCHVDL15","ELISEO MANUEL NAVA RODRIGUEZ",30102,176,83101,1001,"00",26,"E3725",14,0,3,null,20190701,20190930,30518.600000000002,0]
[null,"CHIHUAHUA","08DPT0002B",100,"NAMR911217QR2","NAMR911217MCHVRY09","REYNA GUADALUPE NAVARRETE MARROQUIN",30102,232,83101,1001,"00",26,"E3713",19,0,3,null,20190701,20190930,35222.990000000005,0]
[null,"CHIHUAHUA","08DPT0002B",100,"OICT750827I13","OICT750827MCHLRR05","MARIA TERESA OLIVAS  CORONADO",30102,176,83101,1001,"00",26,"E3725",15,0,3,null,20190701,20190930,31620.55,0]
[null,"CHIHUAHUA","08DPT0002B",200,"OEZA770117EH9","OEZA770117HCHRPL04","ALFREDO LORENZO ORTEGA ZEPEDA",30102,224,83101,1001,"00",26,"E3725",18,0,3,null,20190701,20190930,39546.759999999995,0]
[null,"CHIHUAHUA","08DPT0002B",200,"PAVM750409GD9","PAVM750409HCLLRR05","JOSE MARIA PALACIOS VARELA",30102,128,83101,1001,"00",26,"E3711",10,0,3,null,20190701,20190930,18000.12,0]
[null,"CHIHUAHUA","08DPT0002B",100,"PEGC920119FE4","PEGC920119MCHXRL07","CLAUDIA SELENE PEÑA GUARDADO",30102,140,83101,1001,"00",26,"E3711",10,0,3,null,20190701,20190930,20288.240000000002,0]
[null,"CHIHUAHUA","08DPT0002B",200,"PEGF4912049U3","PEGF491204HCHRRR02","FRANCISCO PEREZ GUERRERO",30102,236,83101,1001,"00",26,"E3725",20,0,3,null,20190701,20190930,40630.740000000005,0]
[null,"CHIHUAHUA","08DPT0002B",100,"PIMR770113LW6","PIMR770113MCLNXC04","ROCIO PINTO MUÑOZ",30102,240,83101,1001,"00",26,"E3725",20,0,3,null,20190701,20190930,41990.78,0]
[null,"CHIHUAHUA","08DPT0002B",200,"POGH680928E46","POGH680928HCHRTC09","HECTOR MIGUEL PORRAS GUTIERREZ",30102,208,83101,1001,"00",26,"E3725",16,0,3,null,20190701,20190930,35152.74,0]
[null,"CHIHUAHUA","08DPT0002B",100,"RABM8107186R9","RABM810718MCHMRR16","MIRIAM SUSANA RAMIREZ BARRERA",30102,240,83101,1001,"00",26,"E3725",20,0,3,null,20190701,20190930,41990.78,0]
[null,"CHIHUAHUA","08DPT0002B",200,"RACJ670625F74","RACJ670625HCHMRN00","JUAN RAMON RAMIREZ CORRAL",30102,156,83101,1001,"00",26,"E3725",12,0,3,null,20190701,20190930,26714.560000000001,0]
[null,"CHIHUAHUA","08DPT0002B",100,"RAVJ750924S61","RAVJ750924HCHMLN06","JUAN GABRIEL RAMIREZ VELA",30102,236,83101,1001,"00",26,"E3713",20,0,3,null,20190701,20190930,36317.97,0]
[null,"CHIHUAHUA","08DPT0002B",100,"REFG8206303T2","REFG820630MCLYLR05","GRISELDA REYES FLORES",30102,212,83101,1001,"00",26,"E3711",19,0,3,null,20190701,20190930,29556.190000000002,0]
[null,"CHIHUAHUA","08DPT0002B",100,"RIOH600504T14","RIOH600504HCHVLC08","HECTOR RAMON RIVERA OLIVAS",30102,184,83101,1001,"00",26,"E3725",15,0,3,null,20190701,20190930,29690.61,0]
[null,"CHIHUAHUA","08DPT0002B",100,"ROAL7201241P5","ROAL720124MCHDVD01","LIDIA ANGELICA RODRIGUEZ AVILA",30102,220,83101,1001,"00",26,"E3725",18,0,3,null,20190701,20190930,38836.729999999996,0]
[null,"CHIHUAHUA","08DPT0002B",120,"ROMM8706134U5","ROMM870613HCHDNN05","MANUEL ANTONIO RODRIGUEZ MONREAL",30102,208,83101,1001,"00",26,"E3711",17,0,3,null,20190701,20190930,28504.74,0]
[null,"CHIHUAHUA","08DPT0002B",100,"ROPE5908038V9","ROPE590803HCHDRL01","ELIGIO RODRIGUEZ PRIETO",30102,224,83101,1001,"00",26,"E3713",18,0,3,null,20190701,20190930,32860.85,0]
[null,"CHIHUAHUA","08DPT0002B",200,"SAVY820923BCA","SAVY820923MCHLLM00","YAMET VERENICE SALAZAR VELAZQUEZ",30102,240,83101,1001,"00",26,"E3725",20,0,3,null,20190701,20190930,39450.78,0]
[null,"CHIHUAHUA","08DPT0002B",200,"SELV800114DJ4","SELV800114HCHGZC03","VICTOR ANDRES SEGOVIA LOZOYA",30102,232,83101,1001,"00",26,"E3725",19,0,3,null,20190701,20190930,40118.770000000004,0]
[null,"CHIHUAHUA","08DPT0002B",100,"SOOA7210299X8","SOOA721029MCHLLN06","ANA LUISA SOLIS OLIVAS",30102,168,83101,1001,"00",26,"E3725",16,0,3,null,20190701,20190930,30002.430000000004,0]
[null,"CHIHUAHUA","08DPT0002B",120,"TERG520428J43","TERG520428HDFLVL09","GUILLERMO TELLEZ REVILLA",30102,224,83101,1001,"00",26,"E3725",18,0,3,null,20190701,20190930,38896.759999999995,0]
[null,"CHIHUAHUA","08DPT0002B",100,"VAOA630813IE8","VAOA630813MDGLRN07","ANGELA MARIA VALTIERRA  ORTEGA",30102,240,83101,1001,"00",26,"E3725",20,0,3,null,20190701,20190930,41340.78,0]
[null,"CHIHUAHUA","08DPT0002B",200,"VEGD970725699","VEGD970725HCHNNN08","DANIEL ARTURO VENZOR GONZALEZ",30102,120,83101,1001,"00",26,"E3701",10,0,3,null,20190701,20190930,12426.21,0]
[null,"CHIHUAHUA","08DPT0002B",120,"YAGC851128SX6","YAGC851128MCHXNY03","CYNTHIA AURORA YAÑEZ GONZALEZ",30102,220,83101,1001,"00",26,"E3725",20,0,3,null,20190701,20190930,37790.620000000003,0]
[null,"CHIHUAHUA","08DPT0002B",120,"AUSL630319SG0","AUSL630319HZSGFC09","JOSE LUCIANO AGUILERA SIFUENTES","20101",480,83101,1003,"00",26,"CF33206","00.0",13754,2,null,20190701,20190930,147243.59000000003,0]
[null,"CHIHUAHUA","08DPT0002B",100,"AAAJ9101208M3","AAAJ910120HCHLCS03","JESUS FABIAN ALVARADO  ACOSTA","20401",480,83101,1003,"00",26,"S01201","00.0",2431,2,null,20190701,20190930,45940.58,0]
[null,"CHIHUAHUA","08DPT0002B",100,"AAAN671110TZ0","AAAN671110MCHLCC06","NICOLASA ALVARADO  ACOSTA","20201",480,83101,1003,"00",26,"CF33204","00.0",9182,2,null,20190701,20190930,127989.61000000002,0]
[null,"CHIHUAHUA","08DPT0002B",100,"AAEM620508I55","AAEM620508HCLLSG04","MIGUEL ANGEL ALVARADO  ESPARZA","20401",480,83101,1003,"00",26,"CF19201","00.0",2447,2,null,20190701,20190930,49170.619999999995,0]
[null,"CHIHUAHUA","08DPT0002B",120,"AISJ790419494","AISJ790419HCHRTN04","JUAN MANUEL ARIAS  SOTELO","20206",480,83101,1003,"00",26,"CF33204","00.0",2435,2,null,20190701,20190930,94958.5,0]
[null,"CHIHUAHUA","08DPT0002B",100,"AIBC800120C20","AIBC800120HCHVLS02","CESAR NOE AVILA BOLIVAR",20401,480,83101,1003,"00",26,"S01201","00.0",2440,2,null,20190701,20190930,47097.357999999993,0]
[null,"CHIHUAHUA","08DPT0002B",100,"BAML650601B92","BAML650601HDFRLS03","JOSE LUIS  BARRIENTOS MILAN","20401",480,83101,1003,"00",26,"S01201","00.0",2444,2,null,20190701,20190930,44175.34,0]
[null,"CHIHUAHUA","08DPT0002B",200,"BOMA6710214E1","BOMA671021HDFLXR07","ARMANDO BOLAÑOS MUÑOZ","20205",480,83101,1003,"00",26,"CF33204","00.0",2432,2,null,20190701,20190930,116891.06,0]
[null,"CHIHUAHUA","08DPT0002B",100,"CAPL820818LQ5","CAPL820818HCHMRS04","LUIS ROBERTO CAMPOS PORTILLO","20206",480,83101,1003,"00",26,"S01202","00.0",10590,2,null,20190701,20190930,46660.19,0]
[null,"CHIHUAHUA","08DPT0002B",100,"CACL731031A17","CACL731031MCHRNR01","LORENA CARRILLO CANO",20211,480,83101,1003,"00",26,"S01202","00.0",2426,2,null,20190701,20190930,41582.289999999994,0]
[null,"CHIHUAHUA","08DPT0002B",100,"CARJ6012178GA","CARJ601217HCHRLS07","JOSE DE JESUS CARRILLO RUELAS","20401",480,83101,1003,"00",26,"S01202","00.0",2434,2,null,20190701,20190930,64391.719999999994,0]
[null,"CHIHUAHUA","08DPT0002B",100,"CARP8408274S7","CARP840827MCHHCR02","PERLA CHAVEZ ROCHA",20215,480,83101,1003,"00",26,"CF33204","00.0",2441,2,null,20190701,20190930,109198.65333333335,0]
[null,"CHIHUAHUA","08DPT0002B",120,"CIBA710920FVA","CIBA710920MDGTRL04","ALMA ROSA CITAL BERTAHUD","20101",480,83101,1003,"00",26,"CF33206","00.0",14304,2,null,20190701,20190930,136446.96000000002,0]
[null,"CHIHUAHUA","08DPT0002B",200,"COMA6908143J5","COXM690814HCHNXR11","MARIO CONTRERAS N/A","20206",480,83101,1003,"00",26,"CF18203","00.0",2420,2,null,20190701,20190930,66426.86,0]
[null,"CHIHUAHUA","08DPT0002B",200,"COCR830702UW4","COCR830702HVZRDB00","RUBEN OMAR CORTEZ CADENA",20401,480,83101,1003,"00",26,"S01201","00.0",2440,2,null,20190701,20190930,26612.98,0]
[null,"CHIHUAHUA","08DPT0002B",100,"DEMA661118M56","DEMA661118HCHLRB07","JOSE ABELARDO DELGADO  MORALES","20205",480,83101,1003,"00",26,"CF33204","00.0",2429,2,null,20190701,20190930,109828.02000000002,0]
[null,"CHIHUAHUA","08DPT0002B",100,"EAGK7806257R9","EAGK780625MCHSBR04","KARLA ESPARZA GABALDON",20101,400,83101,1003,"00",26,"CF33206","00.0",13756,2,null,20190701,20190930,112718.48000000001,0]
[null,"CHIHUAHUA","08DPT0002B",200,"FACF8611101I7","FACF861110HCHVNR02","FERNANDO FAVELA  CONTRERAS","20401",480,83101,1003,"00",26,"CF19201","00.0",2451,2,null,20190701,20190930,48245.146666666667,0]
[null,"CHIHUAHUA","08DPT0002B",100,"FIGS610608SA8","FIGS610608MJCGNL02","SILVIA FIGUEROA GONZALEZ","20206",480,83101,1003,"00",26,"CF33204","00.0",2433,2,null,20190701,20190930,103689.28,0]
[null,"CHIHUAHUA","08DPT0002B",200,"GAMA6609167M4","GAXM660916MCHLXR06","MARIBEL GALLARDO N/A","20216",480,83101,1003,"00",26,"CF34201","00.0",11119,2,null,20190701,20190930,55815.093999999997,0]
[null,"CHIHUAHUA","08DPT0002B",100,"GAAD780823AVA","GAAD780823MCHRLL01","DULCE AURORA DEL CONSUELO GARCIA ALEMAN",20214,480,83101,1003,"00",26,"CF33204","00.0",10007,2,null,20190701,20190930,75125.927333333326,0]
[null,"CHIHUAHUA","08DPT0002B",100,"GALE580105G5A","GALE580105HCHRNN03","ENRIQUE GARCIA DE LUNA","20302",480,83101,1003,"00",26,"S01202","00.0",2421,2,null,20190701,20190930,50014.17,0]
[null,"CHIHUAHUA","08DPT0002B",100,"LAGP591112155","LAGP591112HCHRYD07","PEDRO LARES GAYTAN","20302",480,83101,1003,"00",26,"S01202","00.0",2455,2,null,20190701,20190930,49758.87,0]
[null,"CHIHUAHUA","08DPT0002B",100,"LIHJ9107073M0","LIHJ910707HCHRRS09","JASSON RAYMUNDO LIRA HERRERA","20211",480,83101,1003,"00",26,"S01201","00.0",2428,2,null,20190701,20190930,19711.14,0]
[null,"CHIHUAHUA","08DPT0002B",100,"LOCJ6307091T8","LOCJ630709HCHPRS08","JESUS MARTIN LOPEZ CARO","20102",480,83101,1003,"00",26,"CF33206","00.0",13757,2,null,20190701,20190930,141788.13549333334,0]
[null,"CHIHUAHUA","08DPT0002B",100,"LORE9304089K5","LORE930408HCHYSR01","EARVIN MANUEL LOYA  RIOS","20205",480,83101,1003,"00",26,"CF18201","00.0",2453,2,null,20190701,20190930,39903.57,0]
[null,"CHIHUAHUA","08DPT0002B",200,"LOCJ681030V96","LOCJ681030HCHZLS07","JESUS EDUARDO LOZOYA  CALDERON","20302",480,83101,1003,"00",26,"A03202","00.0",2419,2,null,20190701,20190930,54620.14,0]
[null,"CHIHUAHUA","08DPT0002B",100,"MALL890207EW5","MALL890207MVZRRY06","LEIDY YAZMIN MARTINEZ LORENZO",20214,"480.0","83101","1003","00","26","S01201","00.0","2440","2",null,20190701,20190930,30182.82,0]
[null,"CHIHUAHUA","08DPT0002B",200,"MOMN850815I1A","MOMN850815HCLNRX07","NOE MONSIVAIS MARIN","20211",480,83101,1003,"00",26,"S01201","00.0",2428,2,null,20190701,20190930,13098.810000000001,0]
[null,"CHIHUAHUA","08DPT0002B",100,"MODC711228F67","MODC711228HCLNRR07","CARLOS EDUARDO MONTANO DURAN",50201,480,83101,1003,"00",26,"S01202","00.0",2434,5,null,20190701,20190930,100611.18,0]
[null,"CHIHUAHUA","08DPT0002B",100,"MOSG761016858","MOSG761016HCLNNR06","GERARDO MONTOYA SANCHEZ","20401",480,83101,1003,"00",26,"S01201","00.0",2440,2,null,20190701,20190930,46762.21,0]
[null,"CHIHUAHUA","08DPT0002B",100,"OOGL660522NA4","OOGL660522HCHCRS08","LUIS FELIX OCHOA GARCIA",50401,480,83101,1003,"00",26,"CF18203","00.0",2442,2,null,20190701,20190930,68757.179999999993,0]
[null,"CHIHUAHUA","08DPT0002B",100,"OORE7405071DA","OORE740507MCHRYS00","MARIA ESTHER OROZCO REYES","20211",480,83101,1003,"00",26,"ED01201","00.0",2424,2,null,20190701,20190930,55415.344000000005,0]
[null,"CHIHUAHUA","08DPT0002B",100,"RARF8407015TA","RARF840701MCHMML00","FLOR MINERVA RAMIREZ RAMIREZ",20214,480,83101,1003,"00",26,"CF04201","00.0",2418,2,null,20190701,20190930,56414.184000000001,0]
[null,"CHIHUAHUA","08DPT0002B",200,"ROGJ6511161S5","ROGJ651116HDGCRN00","JUAN JESUS ROCHA GARCIA","20301",480,83101,1003,"00",26,"CF18203","00.0",2436,2,null,20190701,20190930,50307.02,0]
[null,"CHIHUAHUA","08DPT0002B",100,"ROGM631230AD4","ROGM631230MCHMRR18","MARCIA IMELDA ROMERO GARCIA","20406",480,83101,1003,"00",26,"S01202","00.0",131,2,null,20190701,20190930,65776.679999999993,0]
[null,"CHIHUAHUA","08DPT0002B",120,"SAPP7109042V0","SAPP710904HCHLLD06","PEDRO SALAS PALOMINO","20214",480,83101,1003,"00",26,"CF33204","00.0",2459,2,null,20190701,20190930,109874.20000000001,0]
[null,"CHIHUAHUA","08DPT0002B",100,"TULO5510064A6","TULO551006MCHDYL01","OLGA ESPERANZA TUDA LEYVA",20109,480,83101,1003,"00",26,"CF33206","00.0",9278,2,null,20190701,20190930,98421.68,0]
[null,"CHIHUAHUA","08DPT0002B",100,"VASC8109266G6","VASC810926MCHLLL08","CLAUDIA VALVERDE SALAZAR","20211",480,83101,1003,"00",26,"ED01201","00.0",2445,2,null,20190701,20190930,53565.2,0]
[null,"CHIHUAHUA","08DPT0002B",100,"VAFM681203S84","VAFM681203MCHZGR05","MARICRUZ VAZQUEZ FIGUEROA","20203",480,83101,1003,"00",26,"CF19201","00.0",2451,2,null,20190701,20190930,102919.30486666667,0]
[null,"CHIHUAHUA","08DPT0003A",120,"AUVJ9103083J2","AUVJ910308HCHGLN15","AGUIRRE VILLARREAL JUAN DE DIOS",20401,480,83101,1003,"01",56,"S01201",0,7494,2,null,20190701,20190930,35473.370000000003,0]
[null,"CHIHUAHUA","08DPT0003A",120,"AAIV730701KH6","AAIV730701MCHLTR08","ALARCON ITURRALDE VERONICA",50401,400,83101,1003,"01",56,"CF33206",0,14306,2,null,20190701,20190930,75459.899999999994,0]
[null,"CHIHUAHUA","08DPT0003A",120,"AOOC791125GF8","AOOC791125HCHLRR17","ALOR ORTEGA CRISTHIAN OMAR",20109,480,83101,1003,"01",56,"CF33206",0,13763,2,null,20190701,20190930,85260.71,0]
[null,"CHIHUAHUA","08DPT0003A",120,"AEHL721013358","AEHL721013MCHRRR04","ARMENDARIZ HUERTA LAURA ELENA",20216,480,83101,1003,"01",56,"CF19201",0,7495,2,null,20190701,20190930,46403.03,0]
[null,"CHIHUAHUA","08DPT0003A",120,"AOGA850323MS8","AOGA850323MCHRRD09","ARZOLA GARIBAY ADRIANA",20216,480,83101,1003,"01",56,"CF33203",0,7484,2,null,20190701,20190930,49543.02,0]
[null,"CHIHUAHUA","08DPT0003A",120,"BALJ741015QJ5","BALJ741015HNTCPR09","BACA LOPEZ JORGE GERARDO",50401,480,83101,1003,"01",56,"CF02103",0,12683,5,null,20190701,20190930,95992.48,0]
[null,"CHIHUAHUA","08DPT0003A",120,"CALS630411D26","CALS630411HCHNSL01","CANO LEOS SALVADOR",20206,480,83101,1003,"01",56,"CF02103",0,12683,5,null,20190701,20190930,108553.12,0]
[null,"CHIHUAHUA","08DPT0003A",120,"COSC761202AU8","COSC761202MCHRNL00","CORONADO SAENZ CLAUDIA",20215,480,83101,1003,"01",56,"CF02105",0,14575,2,null,20190701,20190930,53547.55,0]
[null,"CHIHUAHUA","08DPT0003A",120,"CORE740806FH5","CORE740806HCHRYN08","CORRAL REYES ENCARNACION",20401,480,83101,1003,"01",56,"CF34202",0,7498,2,null,20190701,20190930,40239.71,0]
[null,"CHIHUAHUA","08DPT0003A",120,"EABJ810502G45","EABJ810502HCHSYR08","ESPARZA BAYLON JORGE HUMBERTO",20215,480,83101,1003,"01",56,"S01201",0,7498,2,null,20190701,20190930,45547.09,0]
[null,"CHIHUAHUA","08DPT0003A",120,"EIHE740513ST9","EIHE740513MCHSRV03","ESPINOSA HERNANDEZ EVA CELINA",20216,480,83101,1003,"01",56,"CF33206",0,14307,2,null,20190701,20190930,88943.59,0]
[null,"CHIHUAHUA","08DPT0003A",120,"FOEA490908UE3","FOEA490908HCHLND09","FLORES ENRIQUEZ ADRIAN GUADALUPE",20401,480,83101,1003,"01",56,"S01201",0,7494,2,null,20190701,20190930,26170.26,0]
[null,"CHIHUAHUA","08DPT0003A",120,"FAJA861008RA4","FAJA861008MCHRRL05","FRANCO JURADO MARIA ALEJANDRA",20216,480,83101,1003,"01",56,"CF33206",0,13765,2,null,20190701,20190930,62775.43,0]
[null,"CHIHUAHUA","08DPT0003A",120,"GAFS650908R84","GAFS650908HCHRLR07","GARCIA FLORES SERGIO MARTIN",20212,480,83101,1003,"01",56,"A03202",0,7472,2,null,20190701,20190930,46600.56,0]
[null,"CHIHUAHUA","08DPT0003A",120,"GAAV670716S40","GAAV670716HCHRRC06","GARDEA ARREDONDO VICTOR MANUEL",20206,480,83101,1003,"01",56,"CF34201",0,7504,2,null,20190701,20190930,81129.440000000002,0]
[null,"CHIHUAHUA","08DPT0003A",120,"GAHA8701284V2","GAHA870128HCHRRL07","GARDEA HEREDIA ALVARO",20401,480,83101,1003,"01",56,"S01201",0,7480,2,null,20190701,20190930,36397.22,0]
[null,"CHIHUAHUA","08DPT0003A",120,"GOVJ720801R43","GOVJ720801MCHNLD09","GONZALEZ VALLES JUDITH",20201,480,83101,1003,"01",56,"CF33204",0,7493,2,null,20190701,20190930,141614.43,0]
[null,"CHIHUAHUA","08DPT0003A",120,"HECG831209L74","HECG831209MCHRBB09","HEREDIA CABALLERO GABRIELA JUDITH",20401,240,83101,1003,"01",56,"S01201",0,7494,2,null,20190816,20190930,11377.59,0]
[null,"CHIHUAHUA","08DPT0003A",120,"HESH611022NF3","HESH611022HCHRNL03","HEREDIA SAENZ HILADRIO",20401,480,83101,1003,"01",56,"S01201",0,7485,2,null,20190701,20190930,45629.08,0]
[null,"CHIHUAHUA","08DPT0003A",120,"HEGM7510295L3","HEGM751029MCHRTY07","HERNANDEZ GUTIERREZ MAYRA VERONICA",20215,480,83101,1003,"01",56,"CF33206",0,13762,2,null,20190701,20190930,55329.01,0]
[null,"CHIHUAHUA","08DPT0003A",120,"MEHP811017GD5","MEHP811017HCHNRL02","MENDEZ HERRERA PAUL ALONSO",20402,480,83101,1003,"01",56,"S01201",0,7479,2,null,20190701,20190930,41807.33,0]
[null,"CHIHUAHUA","08DPT0003A",120,"MEMD550401S32","MEMD550401HCHNTL01","MENDEZ MOTA JOSE DOLORES",20401,480,83101,1003,"01",56,"CF04201",0,10159,2,null,20190701,20190930,43282.67,0]
[null,"CHIHUAHUA","08DPT0003A",120,"MOIR7306072Z5","MOIR730607HCHLBM08","MOLINA IBARRA RAMON HUMBERTO",20401,480,83101,1003,"01",56,"CF18201",0,7491,2,null,20190701,20190930,36265.199999999997,0]
[null,"CHIHUAHUA","08DPT0003A",120,"MOME900109M68","MOHR810216HCHNLN06","MONTES HOLGUIN RENE GUADALUPE",20401,480,83101,1003,"01",56,"S01201",0,7494,2,null,20190701,20190930,34367.79,0]
[null,"CHIHUAHUA","08DPT0003A",120,"MOHR810216267","MOME900109MCHNNS03","MONTES MONTES ESMERALDA JANETH",20401,480,83101,1003,"01",56,"A03202",0,7472,2,null,20190701,20190930,38407.54,0]
[null,"CHIHUAHUA","08DPT0003A",120,"MOCY820701FR6","MOCY820701MCHRHS01","ORTIZ CHAVEZ MARTHA ELVIRA",20201,480,83101,1003,"01",56,"S01201",0,7492,2,null,20190701,20190930,66140.36,0]
[null,"CHIHUAHUA","08DPT0003A",120,"PESB570420393","PESB570420HCHRSN03","PEREZ SOSA BENJAMIN",20401,480,83101,1003,"01",56,"CF21202",0,7499,2,null,20190701,20190930,44459.22,0]
[null,"CHIHUAHUA","08DPT0003A",120,"QURM641112699","QURM641112HCHXMR08","QUIÑONEZ RAMIREZ MARTIN RENE",20302,480,83101,1003,"01",56,"S01202",0,7500,2,null,20190701,20190930,51230.04,0]
[null,"CHIHUAHUA","08DPT0003A",120,"QUYA890925Q52","QUYA890925MCHXXN07","QUIÑONEZ YAÑEZ ANABEL",20215,480,83101,1003,"01",56,"S01202",0,7501,2,null,20190701,20190930,41032.85,0]
[null,"CHIHUAHUA","08DPT0003A",120,"SUCM720601QH7","SUCM720601MCHRRY01","SUAREZ CORRAL MYRNA MANUELA",20214,480,83101,1003,"01",56,"CF33206",0,14306,2,null,20190701,20190930,96510.95,0]
[null,"CHIHUAHUA","08DPT0003A",120,"VATA751225F38","VATA751225HCHLRL00","VALLES TORRES ALFREDO",20205,480,83101,1003,"01",56,"A03202",0,7470,2,null,20190701,20190930,89378.34,0]
[null,"CHIHUAHUA","08DPT0003A",120,"YADR7710046J3","YADR771004MCHXZS02","YAÑEZ DIAZ ROSA IVONNE",20214,480,83101,1003,"01",56,"CF33204",0,7487,2,null,20190701,20190930,69592.88,0]
[null,"CHIHUAHUA","08DPT0003A",100,"AOCF7610047IA","AOCF761204HCHCBR06","FRANCISCO ACOSTA CONTRERAS",30102,229,83101,1001,"01",56,"E3725",16,0,3,null,20190701,20190930,28100.68,0]
[null,"CHIHUAHUA","08DPT0003A",120,"AOMM7702115QA","AOMM770211MCHCRD18","MIDIAM LOURDES ACOSTA MERAZ",30102,220,83101,1001,"01",56,"E3713",16,0,3,null,20190701,20190930,26515.919999999998,0]
[null,"CHIHUAHUA","08DPT0003A",100,"AUQN701229G72","AUQN701229MCHGNR05","NORMA AGUIRRE QUINTANA ",30102,264,83101,1001,"01",56,"E3713",20,0,3,null,20190701,20190930,30434.97,0]
[null,"CHIHUAHUA","08DPT0003A",120,"AAHE730629HA8","AAHE730629HDGLRD05","EDGAR JESUS ALBA HERNANDEZ",30102,228,83101,1001,"01",56,"E3713",17,0,3,null,20190701,20190930,27391.22,0]
[null,"CHIHUAHUA","08DPT0003A",200,"AEOP850816BU5","AEOP850816HCHRLD08","PEDRO RAFAEL ARMENDARIZ OLIVAS",30102,238,83101,1001,"01",56,"E3725",18,0,3,null,20190701,20190930,30997.09,0]
[null,"CHIHUAHUA","08DPT0003A",120,"AERG670801H43","AERG670801HCHRVB09","GABRIEL ARMENDARIZ RIVAS",30102,246,83101,1001,"01",56,"E3725",19,0,3,null,20190701,20190930,31885.03,0]
[null,"CHIHUAHUA","08DPT0003A",200,"BASJ720920637","BASJ720920HCHCMV04","JAVIER BACA SAMPER",30102,237,83101,1001,"01",56,"E3725",18,0,3,null,20190701,20190930,32174.89,0]
[null,"CHIHUAHUA","08DPT0003A",100,"BAMF820909BC1","BAMF820909MCHLRT08","FATIMA DEL CARMEN BALDERAS MORALES",30102,224,83101,1001,"01",56,"E3725",18,0,3,null,20190701,20190930,32156.3,0]
[null,"CHIHUAHUA","08DPT0003A",200,"CACF650131IUA","CACF650131HCHNHL00","FILIBERTO CANO CHAVEZ",30102,245,83101,1001,"01",56,"E3711",18,0,3,null,20190701,20190930,23269.25,0]
[null,"CHIHUAHUA","08DPT0003A",100,"CALA591128150","CALA591128HCHNSB00","ABRAHAM CANO LEOS",30102,132,83101,1001,"01",56,"E3725",10,0,3,null,20190701,20190930,18807.03,0]
[null,"CHIHUAHUA","08DPT0003A",200,"CATI910806HS0","CATI910806HCHRRV03","IVAN DOROTEO CARRERA DE LA TORRE",30102,264,83101,1001,"01",56,"E3713",20,0,3,null,20190701,20190930,30434.97,0]
[null,"CHIHUAHUA","08DPT0003A",200,"CATN8302135X1","CATN830213MCHRRD06","NADIA BEATRIZ CARRERA DE LA TORRE",30102,259,83101,1001,"01",56,"E3725",20,0,3,null,20190701,20190930,34840.720000000001,0]
[null,"CHIHUAHUA","08DPT0003A",100,"CAGG681119QE9","CAGG681119MCHRRB25","MARIA GABRIELA CARRILLO GARDEA",30102,239,83101,1001,"01",56,"E3725",20,0,3,null,20190701,20190930,32493.01,0]
[null,"CHIHUAHUA","08DPT0003A",120,"CAMA550415A18","CAMA550415HCHRLR08","ARISTEO CARRILLO MALDONADO",30102,46,83101,1001,"01",56,"E3701",0,0,3,null,20190701,20190930,6618.72,0]
[null,"CHIHUAHUA","08DPT0003A",120,"CATA900830PFA","CATA900830MCHRRL03","ALEJANDRA IVETTE  CARRILLO TRUJILLO",30102,258,83101,1001,"01",56,"E3713",20,0,3,null,20190701,20190930,29301.759999999998,0]
[null,"CHIHUAHUA","08DPT0003A",100,"CATI851219KEA","CATI851219MCHRRR12","IRMA RAQUEL CARRILLO TRUJILLO",30102,160,83101,1001,"01",56,"E3725",12,0,3,null,20190701,20190930,21766.59,0]
[null,"CHIHUAHUA","08DPT0003A",100,"CAGL680404GU5","CAGL680404MCHSTT08","LETICIA CASILLAS GUTIERREZ",30102,246,83101,1001,"01",56,"E3725",20,0,3,null,20190701,20190930,33079.94,0]
[null,"CHIHUAHUA","08DPT0003A",100,"CEBC880121MJ0","CEBC880121MCHBCL06","CLAUDIA INES CEBALLOS BACA",30102,256,83101,1001,"01",56,"E3725",19,0,3,null,20190701,20190930,33181.089999999997,0]
[null,"CHIHUAHUA","08DPT0003A",200,"CEHF701204P69","CEHF701204HDGRRR02","FRANCISCO JAVIER CERENIL HERRERA",30102,255,83101,1001,"01",56,"E3725",20,0,3,null,20190701,20190930,32953.800000000003,0]
[null,"CHIHUAHUA","08DPT0003A",100,"CASC781201J96","CASC781201MCHHNR02","CORINA CHAVEZ SANCHEZ",30102,237,83101,1001,"01",56,"E3725",18,0,3,null,20190701,20190930,33107.089999999997,0]
[null,"CHIHUAHUA","08DPT0003A",200,"DERI7801118J5","DEXR780111HCHLXC03","RICARDO DELGADO",30102,238,83101,1001,"01",56,"E3725",18,0,3,null,20190701,20190930,30997.09,0]
[null,"CHIHUAHUA","08DPT0003A",200,"LEPJ860727765","LEPJ860727HCHNRV08","JAVIER EDUVIGES DE LEON PARADA",30102,223,83101,1001,"01",56,"E3713",16,0,3,null,20190701,20190930,24758.59,0]
[null,"CHIHUAHUA","08DPT0003A",100,"EARD8007284EA","EARD800728MCHSCL06","DULCE MARGARITA ELIZABETH ESCALANTE ROCHA",30102,265,83101,1001,"01",56,"E3725",20,0,3,null,20190701,20190930,36237.65,0]
[null,"CHIHUAHUA","08DPT0003A",100,"FEAL8707295J5","DUPB710508MCHRRR02","LUIS RAUL FERNANDEZ ACOSTA",30102,244,83101,1001,"01",56,"E3725",20,0,3,null,20190701,20190930,33729.94,0]
[null,"CHIHUAHUA","08DPT0003A",200,"GAQL770122HI2","GAQL770122MCHLXZ06","LUZ ELIZABETH GALVAN QUIÑONEZ",30102,223,83101,1001,"01",56,"E3725",18,0,3,null,20190701,20190930,26676.13,0]
[null,"CHIHUAHUA","08DPT0003A",120,"GACP590517MU6","GACP590517MCHRHT05","PATRICIA EUGENIA GARCIA CHAVEZ",30102,225,83101,1001,"01",56,"E3725",18,0,3,null,20190701,20190930,30472.73,0]
[null,"CHIHUAHUA","08DPT0003A",100,"GARJ67122131A","GARJ671221HCHRZM09","JAIME GARCIA RUIZ",30102,256,83101,1001,"01",56,"E3725",19,0,3,null,20190701,20190930,33767.53,0]
[null,"CHIHUAHUA","08DPT0003A",120,"GODK810903VC5","GODK810903MCHNVN04","KENIS GONZALEZ DAVILA",30102,233,82101,1001,"01",56,"E3725",19,0,3,null,20190701,20190930,31706.44,0]
[null,"CHIHUAHUA","08DPT0003A",200,"GOGA810922999","GOGA810922HCHNRG02","AGUSTIN GONZALEZ GARCIA",30102,267,83101,1001,"01",56,"E3725",20,0,3,null,20190701,20190930,34191.21,0]
[null,"CHIHUAHUA","08DPT0003A",100,"GOGJ8811064X6","GOGJ881106MCHNTS09","JESSICA JANETH GONZALEZ GUTIERREZ",30102,240,83101,1001,"01",56,"E3725",18,0,3,null,20190701,20190930,32820.46,0]
[null,"CHIHUAHUA","08DPT0003A",200,"GOHD580525IP0","GOHD580525HCHNRV01","DAVID GONZALEZ HERNANDEZ",30102,263,83101,1001,"01",56,"E3711",20,0,3,null,20190701,20190930,26227.42,0]
[null,"CHIHUAHUA","08DPT0003A",200,"GUCG610126B56","GUCG610126HCHTNR03","JOSE GERARDO GUTIERREZ CONTRERAS",30102,149,83101,1001,"01",56,"E3725",12,0,3,null,20190701,20190930,20240.87,0]
[null,"CHIHUAHUA","08DPT0003A",100,"HEAV711202QZ8","HEAV711202MCHRGV01","VIVIANA HERNANDEZ AGUILERA",30102,129,83101,1001,"01",56,"E3725",10,0,3,null,20190701,20190930,17633.68,0]
[null,"CHIHUAHUA","08DPT0003A",200,"HEAA900716PY3","HEAA900716HCHRGL00","ALFREDO HERNANDEZ AGUIRRE",30102,230,83101,1001,"01",56,"E3713",17,0,3,null,20190701,20190930,23283.89,0]
[null,"CHIHUAHUA","08DPT0003A",200,"HEAA881029IG6","HEAA881029MCHRNN04","ANGELICA HERNANDEZ ANGEL",30102,261,83101,1001,"01",56,"E3725",20,0,3,null,20190701,20190930,35064.28,0]
[null,"CHIHUAHUA","08DPT0003A",200,"HERM720618VE6","HERM720618MCHRMN07","MANUELA OLIVIA HERNANDEZ RAMIREZ",30102,53,83101,1001,"01",56,"E3711",0,0,3,null,20190701,20190930,2260.8000000000002,0]
[null,"CHIHUAHUA","08DPT0003A",200,"HISE750912LP7","HISE750912MCHNNT05","ETHEL JANETH HINOJOS SANCHEZ",30102,261,83101,1001,"01",56,"E3725",20,0,3,null,20190701,20190930,35427.65,0]
[null,"CHIHUAHUA","08DPT0003A",200,"HOOJ841127R23","HOOJ841127HCHLJS04","JESUS MANUEL HOLGUIN OJEDA",30102,248,83101,1001,"01",56,"E3725",18,0,3,null,20190701,20190930,33407.39,0]
[null,"CHIHUAHUA","08DPT0003A",100,"HOQS841119E44","HOQS841119MCHLNL02","SILVIA HOLGUIN QUINTANA",30102,255,83101,1001,"01",56,"E3725",20,0,3,null,20190701,20190930,33667.360000000001,0]
[null,"CHIHUAHUA","08DPT0003A",100,"IEPA690710Q2A","IEPA690710HZSRRL07","ALEJANDRO IRENE PEREZ",30102,253,83101,1001,"01",56,"E3725",20,0,3,null,20190701,20190930,34254.28,0]
[null,"CHIHUAHUA","08DPT0003A",100,"JUEM870729SW2","JUEM870729MCHRSR04","MARINA JUAREZ ESPARZA",30102,143,83101,1001,"01",56,"E3711",8,0,3,null,20190701,20190930,15071.26,0]
[null,"CHIHUAHUA","08DPT0003A",120,"JUGE790622JJ2","JUGE790622HCHRRD03","EDGAR ELIEL JUAREZ GRAJEDA",30102,262,83101,1001,"01",56,"E3725",20,0,3,null,20190701,20190930,34191.21,0]
[null,"CHIHUAHUA","08DPT0003A",200,"LARJ611212G44","LARJ611212HCHZDL03","JOEL GUADALUPE LAZCANO RODRIGUEZ",30102,199,83101,1001,"01",56,"E3711",15,0,3,null,20190701,20190930,21082.29,0]
[null,"CHIHUAHUA","08DPT0003A",200,"LISA761208237","LISA761208HCHCLN05","ANGEL LICERIO SILVEYRA",30102,246,83101,1001,"01",56,"E3711",20,0,3,null,20190701,20190930,26079,0]
[null,"CHIHUAHUA","08DPT0003A",100,"LOGJ770422620","LOGJ770422HCHPRL08","JOEL ALONSO LOPEZ GRANADOS",30102,245,83101,1001,"01",56,"E3725",20,0,3,null,20190701,20190930,33079.94,0]
[null,"CHIHUAHUA","08DPT0003A",100,"LOSS7606157X9","LOSS760615MCHPLL02","SILVIA LOPEZ SALCIDO",30102,199,83101,1001,"01",56,"E3725",15,0,3,null,20190701,20190930,24505.91,0]
[null,"CHIHUAHUA","08DPT0003A",200,"LOCM7912081Q9","LOCM791208MCHYLR09","MARTHA LAURA LOYA CELESTIN",30102,242,83101,1001,"01",56,"E3725",20,0,3,null,20190701,20190930,32493.5,0]
[null,"CHIHUAHUA","08DPT0003A",200,"MAAK800331I60","MAAK800331MCHCGR00","KAREN LOURDES MACIAS AGUIRRE",30102,175,83101,1001,"01",56,"E3725",14,0,3,null,20190701,20190930,22784.29,0]
[null,"CHIHUAHUA","08DPT0003A",120,"MAMF571028UH3","MAMF571028HCHRCR08","FRANCISCO ROBERTO MARTINEZ MACIAS",30102,239,83101,1001,"01",56,"E3725",19,0,3,null,20190701,20190930,31420.3,0]
[null,"CHIHUAHUA","08DPT0003A",100,"MAMS761009L43","MASS761009HCHRCR04","SERGIO RENE MARTINEZ MACIAS",30102,198,83101,1001,"01",56,"E3713",14,0,3,null,20190701,20190930,23149.48,0]
[null,"CHIHUAHUA","08DPT0003A",200,"MAML781222TP2","MAML781222MCHRNR05","LAURA GABRIELA MARTINEZ MONARREZ",30102,229,83101,1001,"01",56,"E3725",17,0,3,null,20190701,20190930,29336.959999999999,0]
[null,"CHIHUAHUA","08DPT0003A",100,"MAPJ881207NN8","MAPJ881207MCHRRN07","JANETH DERAT MARTINEZ PROSPERO",30102,264,83101,1001,"01",56,"E3725",20,0,3,null,20190701,20190930,35651.21,0]
[null,"CHIHUAHUA","08DPT0003A",100,"MARB780909MG5","MARB780909MCHRSR07","BRENDA SOCORRO MARTINEZ RIOS",30102,262,83101,1001,"01",56,"E3725",20,0,3,null,20190701,20190930,34191.21,0]
[null,"CHIHUAHUA","08DPT0003A",100,"MEMP850117HB8","MEMP850117MCHNNL01","PALOMA DEL CARMEN MENDEZ MENDEZ",30102,244,83101,1001,"01",56,"E3725",19,0,3,null,20190701,20190930,32657.22,0]
[null,"CHIHUAHUA","08DPT0003A",100,"MOHE7612192R9","MOHE761219HCHNLD06","EDGAR OBEK MONTES HOLGUIN",30102,193,83101,1001,"01",56,"E3725",14,0,3,null,20190701,20190930,29544.5,0]
[null,"CHIHUAHUA","08DPT0003A",100,"MOMA830930QR2","MOMA830930MCHRRN04","ANTONIA MORENO MORALES",30102,242,83101,1001,"01",56,"E3725",18,0,3,null,20190701,20190930,32883.53,0]
[null,"CHIHUAHUA","08DPT0003A",100,"NASG7104118K1","NASG710411MDGJNR04","GRISELDA NAJERA SAENZ",30102,43,83101,1001,"01",56,"E3711",0,0,3,null,20190701,20190930,1695.6,0]
[null,"CHIHUAHUA","08DPT0003A",120,"NAMR830722I63","NAMR830722MCHXNB01","REBECA DIANA NANEZ MENDOZA",30102,255,83101,1001,"01",56,"E3713",19,0,3,null,20190701,20190930,31019.71,0]
[null,"CHIHUAHUA","08DPT0003A",100,"PAQR840612BHA","PAQR840612HCHLXM03","JOSE RAMON PALMA QUIÑONEZ",30102,253,83101,1001,"01",56,"E3711",20,0,3,null,20190701,20190930,25861.01,0]
[null,"CHIHUAHUA","08DPT0003A",120,"PAMZ880803S42","PAMZ880803MCHTRM09","ZAMISH GABRIELA PATIÑO MORALES",30102,223,83101,1001,"01",56,"E3711",18,0,3,null,20190701,20190930,25977.06,0]
[null,"CHIHUAHUA","08DPT0003A",200,"PERO820514295","PERO820514HCHRMM06","OMAR ARMANDO PEREZ RAMIREZ",30102,248,83101,1001,"01",56,"E3725",20,0,3,null,20190701,20190930,32429.94,0]
[null,"CHIHUAHUA","08DPT0003A",120,"QUVC860208IX4","QUVC860208MCHNLR06","CRISTINA QUINTANA VILLEGAS",30102,242,83101,1001,"01",56,"E3711",18,0,3,null,20190701,20190930,25517.21,0]
[null,"CHIHUAHUA","08DPT0003A",100,"QUGG830326LY2","QUGG830326MCHXRR05","GEORGINA ALHELI QUIÑONEZ GARCIA",30102,240,83101,1001,"01",56,"E3725",20,0,3,null,20190701,20190930,32493,0]
[null,"CHIHUAHUA","08DPT0003A",100,"QUYD920620SG7","QUYD920620MCHXXN07","DANIA ANGELICA QUIÑONEZ YAÑEZ",30102,260,83101,1001,"01",56,"E3713",20,0,3,null,20190701,20190930,31386.42,0]
[null,"CHIHUAHUA","08DPT0003A",100,"RACG650805Q12","RACG650805HSRMNM07","GAMALIEL RAMOS CONTRERAS",30102,232,83101,1001,"01",56,"E3711",17,0,3,null,20190701,20190930,25633.89,0]
[null,"CHIHUAHUA","08DPT0003A",200,"RACA620817IU7","RACA620817HCHSHN09","ANTONIO RASCON CHAVEZ",30102,255,83101,1001,"01",56,"E3711",20,0,3,null,20190701,20190930,25332.34,0]
[null,"CHIHUAHUA","08DPT0003A",200,"RERH8005305SA","RERH800530HCHNDC03","HECTOR RAUL RENTERIA RODRIGUEZ",30102,201,83101,1001,"01",56,"E3713",18,0,3,null,20190701,20190930,21040.639999999999,0]
[null,"CHIHUAHUA","08DPT0003A",100,"RIPS680731I67","RIPS680731HCHCRR07","SERGIO RICO PEREZ",30102,246,83101,1001,"01",56,"E3711",18,0,3,null,20190701,20190930,25121.91,0]
[null,"CHIHUAHUA","08DPT0003A",200,"RIAJ830525SU3","RIAJ830525HCHVCM08","JAIME MICHAEL RIVERA ACOSTA",30102,267,83101,1001,"01",56,"E3725",20,0,3,null,20190701,20190930,34191.21,0]
[null,"CHIHUAHUA","08DPT0003A",200,"ROSL891018R33","ROSL891018HCHDNS03","LUIS ISIDRO RODRIGUEZ SAENZ",30102,220,83101,1001,"01",56,"E3725",17,0,3,null,20190701,20190930,25673.27,0]
[null,"CHIHUAHUA","08DPT0003A",200,"ROSL8112066G9","ROSL811206HCHDFS05","LUIS CARLOS RODRIGUEZ SIFUENTES",30102,256,83101,1001,"01",56,"E3725",19,0,3,null,20190701,20190930,35067.53,0]
[null,"CHIHUAHUA","08DPT0003A",100,"ROMC790529SQ8","ROMC790529HCHJZR03","CARLOS GERMAN ROJAS MEZA",30102,233,83101,1001,"01",56,"E3725",18,0,3,null,20190701,20190930,33080.43,0]
[null,"CHIHUAHUA","08DPT0003A",100,"ROMJ820824341","ROMJ820824HCHMRN09","JUAN PABLO ROMO MARTINEZ",30102,132,83101,1001,"01",56,"E3725",10,0,3,null,20190701,20190930,17570.599999999999,0]
[null,"CHIHUAHUA","08DPT0003A",100,"ROQM800726NK3","ROQM800726MCHNXR09","MARISA JUDITH RONQUILLO QUIÑONEZ",30102,201,83101,1001,"01",56,"E3713",17,0,3,null,20190701,20190930,24339.83,0]
[null,"CHIHUAHUA","08DPT0003A",200,"SARJ830528CW0","SARJ830528HCHLDR12","JORGE ARTURO SALAS RODRIGUEZ",30102,235,83101,1001,"01",56,"E3713",18,0,3,null,20190701,20190930,27159.15,0]
[null,"CHIHUAHUA","08DPT0003A",100,"SADC810906EH7","SADC810906MCHNZR07","MARIA CRISTINA SANCHEZ DIAZ",30102,264,83101,1001,"01",56,"E3713",20,0,3,null,20190701,20190930,29926.83,0]
[null,"CHIHUAHUA","08DPT0003A",200,"SERM730609876","SERM730609MCHPYY01","MYRIAM SEPULVEDA REYES",30102,240,83101,1001,"01",56,"E3725",18,0,3,null,20190701,20190930,32204.21,0]
[null,"CHIHUAHUA","08DPT0003A",200,"TEAR760610A38","TEAR760610HCHRGL01","RAUL FELIPE TERRAZAS AGUIRRE",30102,132,83101,1001,"01",56,"E3725",10,0,3,null,20190701,20190930,19457.03,0]
[null,"CHIHUAHUA","08DPT0003A",200,"TOBT8310246R6","TOBT831024MCHRRH05","THELMA GUADALUPE TORRES BARRETO",30102,260,83101,1001,"01",56,"E3725",20,0,3,null,20190701,20190930,34574.28,0]
[null,"CHIHUAHUA","08DPT0003A",100,"UUAJ8910286B1","UUAJ891028HCHRRL00","JOEL URTUZUASTEGUI ARZOLA",30102,247,83101,1001,"01",56,"E3725",18,0,3,null,20190701,20190930,31387.119999999999,0]
[null,"CHIHUAHUA","08DPT0003A",100,"VASM721005K88","VASM721005HCHLRR06","MARIO ALBERTO VALDEZ SIERRA",30102,127,83101,1001,"01",56,"E3725",10,0,3,null,20190701,20190930,17926.900000000001,0]
[null,"CHIHUAHUA","08DPT0003A",100,"VATE6505053PA","VATE650505HCHLRR02","ERNESTO VALLEJO TERRAZAS",30102,216,83101,1001,"01",56,"E3725",16,0,3,null,20190701,20190930,28976.34,0]
[null,"CHIHUAHUA","08DPT0003A",100,"VAGS580921NS3","VAGS580921MCHZRL04","SOLEDAD VAZQUEZ GARCIA",30102,248,83101,1001,"01",56,"E3725",20,0,3,null,20190701,20190930,33079.94,0]
[null,"CHIHUAHUA","08DPT0003A",100,"VASI870422IA8","VASI870422MCHZVS04","ISIS KRYSTAL VAZQUEZ SAENZ",30102,242,83101,1001,"01",56,"E3725",20,0,3,null,20190701,20190930,32493,0]
[null,"CHIHUAHUA","08DPT0003A",200,"VEMA770621BW5","VEMA770621MCHLRN02","ANA ISABEL VELAZQUEZ MARTINEZ",30102,238,83101,1001,"01",56,"E3725",17,0,3,null,20190701,20190930,32460.82,0]
[null,"CHIHUAHUA","08DPT0003A",200,"VEDA870119GY2","VEDA870119MDGRMD03","ADRIANA VERGARA DOMINGUEZ",30102,162,83101,1001,"01",56,"E3713",14,0,3,null,20190701,20190930,19487.46,0]
[null,"CHIHUAHUA","08DPT0003A",200,"VILJ810613D4A","VILJ810613HCHLRR06","JORGE ANTONIO VILLAR LOERA",30102,265,83101,1001,"01",56,"E3713",20,0,3,null,20190701,20190930,29926.83,0]
[null,"CHIHUAHUA","08DPT0003A",200,"VIGR710609UT2","VIGR710609HCHLRF00","RAFAEL VILLEGAS GARCIA",30102,241,83101,1001,"01",56,"E3725",20,0,3,null,20190701,20190930,33793,0]
[null,"CHIHUAHUA","08DPT0007X",100,"AUAC800520NRA","AUAC800520HDGGNS04","CESAR ALEJANDRO AGUILAR ANTUNEZ",20102,480,83101,1003,"02","07","CF18203","00.0",11986,2,null,20190701,20190930,62930.3,0]
[null,"CHIHUAHUA","08DPT0007X",100,"AARJ7003036F2","AARJ700303MCHNMS07","MARIA DE JESUS ANAYA RAMIREZ",20102,480,83101,1003,"02","07","CF33204","00.0",2390,2,null,20190701,20190930,101776.76,0]
[null,"CHIHUAHUA","08DPT0007X",100,"AIEL6711121J4","AIXE671112MCHRXL03","MARÍA ELIZABETTH ARRIETA",20102,480,83101,1003,"02","07","S01201","00.0",9329,2,null,20190701,20190930,38921.89,0]
[null,"CHIHUAHUA","08DPT0007X",100,"BELH630930M26","BELH630930HCHNNM06","JOSE HUMBERTO BENITEZ LONGORIA",20102,480,83101,1003,"02","07","CF19201","00.0",9327,2,null,20190701,20190930,62510.96,0]
[null,"CHIHUAHUA","08DPT0007X",100,"CADE710915BB6","CADE710915MCHRZL02","ELVIRA CARRASCO DIAZ",50102,480,83101,1003,"02","07","CF02103","00.0",12600,5,null,20190701,20190930,100611.18,0]
[null,"CHIHUAHUA","08DPT0007X",100,"CACI7205151S9","CACI720515HOCHRS01","ISIDRO MANUEL CHAVEZ CARRERA",20102,480,83101,1003,"02","07","CF33204","00.0",9338,2,null,20190701,20190930,96148.05,0]
[null,"CHIHUAHUA","08DPT0007X",100,"DEML700812U65","DEML700812MDGLRR03","LAURA DIANA DELGADO MARRERO",20102,480,83101,1003,"02","07","A03202","00.0",9319,2,null,20190701,20190930,56490.68,0]
[null,"CHIHUAHUA","08DPT0007X",200,"EALJ731221FM3","EALJ731221HSLSRN06","JUAN DE DIOS ESCALANTE LAUREAN",20102,480,83101,1003,"02","07","S01202","00.0",9342,2,null,20190701,20190930,49325.75,0]
[null,"CHIHUAHUA","08DPT0007X",100,"GAEM680908Q97","GAEC680908MCLLSN03","MA. CONCEPCION GALLARDO ESPARZA",20102,480,83101,1003,"02","07","S01202","00.0",9337,2,null,20190701,20190930,43417.73,0]
[null,"CHIHUAHUA","08DPT0007X",100,"GADA760726L20","GADA760726MCHRZD02","ADRIANA GARCIA DIAZ",20102,480,83101,1003,"02","07","A03202","00.0",465,2,null,20190701,20190930,55127.48,0]
[null,"CHIHUAHUA","08DPT0007X",100,"HEGJ620729F26","HEGJ620729HCHRNV07","JOSE JAVIER HERNANDEZ GONZALEZ",20102,480,83101,1003,"02","07","CF33206","00.0",14112,2,null,20190701,20190930,94258.74,0]
[null,"CHIHUAHUA","08DPT0007X",100,"HEGL611117FN5","HEGL611117MCHRNZ00","LUZ MARIA HERNANDEZ GONZALEZ",20102,480,83101,1003,"02","07","CF33204","00.0",2229,2,null,20190701,20190930,108278.23,0]
[null,"CHIHUAHUA","08DPT0007X",100,"HEPH660312FI8","HEPH660312HCHRRC02","HECTOR HERNANDEZ PEREZ",20102,480,83101,1003,"02","07","CF18203","00.0",9332,2,null,20190701,20190930,68698.94,0]
[null,"CHIHUAHUA","08DPT0007X",100,"LIMR6608162E8","LIMR660816HZSRNY01","RAYMUNDO LIRA MENDOZA",20102,480,83101,1003,"02","07","CF33206","00.0",13756,2,null,20190701,20190930,148721,0]
[null,"CHIHUAHUA","08DPT0007X",100,"MASF580311IY9","MASF580311HDGGCR04","FRANCISCO MAGDALENO SAUCEDO",20102,480,83101,1003,"02","07","CF33204","00.0",210,2,null,20190701,20190930,94937.17,0]
[null,"CHIHUAHUA","08DPT0007X",100,"MARL701010AR4","MARL701010MCLRBD02","LUDIVINA MARTINEZ REBOLLOSO",20102,480,83101,1003,"02","07","CF04201","00.0",11955,2,null,20190701,20190930,62381.95,0]
[null,"CHIHUAHUA","08DPT0007X",100,"MECL790627CP7","MEXC790627MCHJXL02","CLAUDIA FABIOLA MEJIA",20102,480,83101,1003,"02","07","CF34202","00.0",12097,2,null,20190701,20190930,55873.78,0]
[null,"CHIHUAHUA","08DPT0007X",100,"MONL710121CT7","MONL710121MSLGVR08","LORENA INES MOGUEL NOVELO",20102,480,83101,1003,"02","07","CF33206","00.0",13431,2,null,20190816,20190930,47812.79,0]
[null,"CHIHUAHUA","08DPT0007X",100,"MONM720514D8A","MONM720514HCHRXR04","MARCIAL EZEQUIEL MORALES NUÑEZ",20102,480,83101,1003,"02","07","CF33206","00.0",13430,2,null,20190701,20190930,130617.22,0]
[null,"CHIHUAHUA","08DPT0007X",100,"OIPL750706829","OIPL750706HNTRXS09","LUIS ALBERTO ORTIZ PEÑA",20102,480,83101,1003,"02","07","CF33204","00.0",9348,2,null,20190701,20190930,85262.25,0]
[null,"CHIHUAHUA","08DPT0007X",100,"PECG710113QA8","PECG710113MCHRRB06","GABRIELA PEREZ CRUZ",20102,480,83101,1003,"02","07","S01202","00.0",7505,2,null,20190701,20190930,51246.13,0]
[null,"CHIHUAHUA","08DPT0007X",100,"ROCS700130LMA","ROCS700130MDGDLL00","SILVIA ESTELA RODRIGUEZ CALVILLO",20102,480,83101,1003,"02","07","CF33206","00.0",13432,2,null,20190701,20190930,94258.74,0]
[null,"CHIHUAHUA","08DPT0007X",100,"ROMA711015CL1","ROMA711015MDFDLN06","ANA LUISA RODRIGUEZ MILAN",20102,480,83101,1003,"02","07","A03202","00.0",9322,2,null,20190701,20190930,63958.83,0]
[null,"CHIHUAHUA","08DPT0007X",100,"ROME6706013EA","ROME670601MDFJLD04","MARIA EDITH ROJAS MELENDEZ",20102,480,83101,1003,"02","07","A03202","00.0",9320,2,null,20190701,20190930,55809.07,0]
[null,"CHIHUAHUA","08DPT0007X",100,"SOGC711207N65","SOGC711207MCHTRN06","MARIA CONCEPCION SOTO GUERRERO",20102,480,83101,1003,"02","07","CF33206","00.0",13433,2,null,20190701,20190930,138380.26999999999,0]
[null,"CHIHUAHUA","08DPT0007X",100,"SOHJ7805045P4","SOHJ780504HCHTRS02","JOSE DE JESUS SOTO HERNANDEZ",20102,480,83101,1003,"02","07","CF33203","00.0",9335,2,null,20190701,20190930,58272,0]
[null,"CHIHUAHUA","08DPT0007X",100,"ZAVE920703L47","ZAVE920703HCHVLD09","EDGAR ALEJANDRO ZAVALA VALLES",20102,480,83101,1003,"02","07","S01201","00.0",9325,2,null,20190701,20190930,37097.519999999997,0]
[null,"CHIHUAHUA","08DPT0007X",100,"AAVJ670109VEA","AAVJ670109HVZBLL08","ABSALON VILLEGAS JULIAN MIGUEL",30102,228,83101,1001,"02","07","E3711",19,0,3,null,20190701,20190930,28776.182530000002,0]
[null,"CHIHUAHUA","08DPT0007X",200,"AOLJ680721RSA","AOLJ680721MCHCJL09","ACOSTA LUJAN JULIA ROSA",30102,216,83101,1001,"02","07","E3725",18,0,3,null,20190701,20190930,35486.7768,0]
[null,"CHIHUAHUA","08DPT0007X",200,"AEMV850720NG8","AEMV850720MCHLNR03","ALMEIDA MONTES VIRIDIANA",30102,216,83101,1001,"02","07","E3725",18,0,3,null,20190701,20190930,34066.716800000002,0]
[null,"CHIHUAHUA","08DPT0007X",100,"AAGP8807274Z4","AAGP880727MMCLLB04","ALVARADO GALICIA PABLOVA",30102,240,83101,1001,"02","07","E3725",20,0,3,null,20190701,20190930,37458.432000000001,0]
[null,"CHIHUAHUA","08DPT0007X",200,"AASJ7104236Z2","AASJ710423HCHLNR06","ALVARADO SANCHEZ JORGE ADRIAN",30102,240,83101,1001,"02","07","E3725",20,0,3,null,20190701,20190930,38403.161999999997,0]
[null,"CHIHUAHUA","08DPT0007X",100,"AATG900815VD7","AATG900815MCHLRL09","ALVARADO TARANGO GLORIA YARALDY",30102,240,83101,1001,"02","07","E3725",20,0,3,null,20190701,20190930,37220.762000000002,0]
[null,"CHIHUAHUA","08DPT0007X",100,"AARP801213GG6","AARP801213HCHVDD14","AVALOS RODARTE PEDRO ALONSO",30102,240,83101,1001,"02","07","E3725",20,0,3,null,20190701,20190930,38640.831999999995,0]
[null,"CHIHUAHUA","08DPT0007X",100,"BACJ730108BV7","BACJ730108MDFYRH00","BAYARDO CARVAJAL JAHEL",30102,240,83101,1001,"02","07","E3713",20,0,3,null,20190701,20190930,31733.839749999999,0]
[null,"CHIHUAHUA","08DPT0007X",100,"BECI670819Q93","BECI670819HCHLRV03","BELMONTE CARRILLO IVAN",30102,240,83101,1001,"02","07","E3725",20,0,3,null,20190701,20190930,37930.792000000001,0]
[null,"CHIHUAHUA","08DPT0007X",100,"BEMY780623E38","BEMY780623MCHRRS01","BERUMEN MARTINEZ YESICA",30102,240,83101,1001,"02","07","E3725",20,0,3,null,20190701,20190930,34380.642,0]
[null,"CHIHUAHUA","08DPT0007X",100,"BUEL761105V38","BUEL761105MCHSSR05","BUSTAMANTE ESCOBEDO LAURA ISELA",30102,240,83101,1001,"02","07","E3725",20,0,3,null,20190701,20190930,37220.762000000002,0]
[null,"CHIHUAHUA","08DPT0007X",200,"CAVM69042817A","CAVM690428HCHBGR00","CABALLERO VEGA MARIO ALBERTO",30102,180,83101,1001,"02","07","E3711",15,0,3,null,20190701,20190930,23925.060980000002,0]
[null,"CHIHUAHUA","08DPT0007X",200,"CAVM6006195R6","CAVM600619HCHLLN01","CALLEROS VILLALOBOS MANUEL ALBERTO ",30102,240,83101,1001,"02","07","E3713",20,0,3,null,20190701,20190930,33585.229749999999,0]
[null,"CHIHUAHUA","08DPT0007X",100,"CIGJ801220RP4","CIGJ801220HCHSRL09","CISNEROS GARCIA JULIO ALBERTO",30102,240,83101,1001,"02","07","E3725",20,0,3,null,20190701,20190930,38640.831999999995,0]
[null,"CHIHUAHUA","08DPT0007X",100,"RORA58083143A","RORA580831HOCSMD15","DE LA ROSA ROMERO ADAN",30102,228,83101,1001,"02","07","E3711",19,0,3,null,20190701,20190715,4319.1750000000002,0]
[null,"CHIHUAHUA","08DPT0007X",200,"DIAA860226874","DIAA860226MSRZGN04","DIAZ AGUILAR ANA FABIOLA",30102,144,83101,1001,"02","07","E3725",12,0,3,null,20190701,20190930,23184.4912,0]
[null,"CHIHUAHUA","08DPT0007X",200,"DOBG610203LR2","DOBG610203HCHMRL02","DOMINGUEZ BARAY GILBERTO",30102,240,83101,1001,"02","07","E3725",20,0,3,null,20190701,20190930,38640.831999999995,0]
[null,"CHIHUAHUA","08DPT0007X",100,"DOEJ630916HP1","DOEJ630916HCLRSN05","DORADO ESPINO JUAN JESUS",30102,156,83101,1001,"02","07","E3711",13,0,3,null,20190701,20190930,17816.590037499998,0]
[null,"CHIHUAHUA","08DPT0007X",200,"EADJ860902I17","EADJ860902HCHSZV01","ESPARZA DIAZ JAVIER EDUARDO",30102,240,83101,1001,"02","07","E3725",20,0,3,null,20190701,20190930,37220.762000000002,0]
[null,"CHIHUAHUA","08DPT0007X",200,"EACL8412183L3","EACL841218MCHSRR08","ESTRADA CARRILLO LAURA VERONICA",30102,240,83101,1001,"02","07","E3725",20,0,3,null,20190701,20190930,37930.792000000001,0]
[null,"CHIHUAHUA","08DPT0007X",200,"EAHJ881022RT6","EAHJ881022HCHSRQ05","ESTRADA HERNANDEZ JOAQUIN JOEL",30102,240,83101,1001,"02","07","E3725",20,0,3,null,20190701,20190930,38640.831999999995,0]
[null,"CHIHUAHUA","08DPT0007X",200,"EASA951019EL5","EASA951019HCHSLN00","ESTRADA SALAYANDIA JOSE ANGEL",30102,192,83101,1001,"02","07","E3701",16,0,3,null,20190701,20190930,19262.833200000001,0]
[null,"CHIHUAHUA","08DPT0007X",200,"FOCG620409LQ0","FOCG620409HDGLHN03","FLORES CHACON GONZALO",30102,204,83101,1001,"02","07","E3725",17,0,3,null,20190701,20190930,34974.794200000004,0]
[null,"CHIHUAHUA","08DPT0007X",100,"GAEH711103S52","GAEH711103HCHBNC07","GABALDON ENRÍQUEZ HECTOR GERARDO                  ",30102,168,83101,1001,"02","07","E3725",14,0,3,null,20190701,20190930,26338.546400000003,0]
[null,"CHIHUAHUA","08DPT0007X",200,"GAJE670908MV9","GAJE670908HDGLRV06","GALVAN JUAREZ EVARISTO",30102,240,83101,1001,"02","07","E3713",20,0,3,null,20190701,20190930,33201.370000000003,0]
[null,"CHIHUAHUA","08DPT0007X",100,"GAMY7604228L5","GAMY760422MDGLXL00","GALVAN MUÑOZ YOLANDA ALEJANDRA",30102,216,83101,1001,"02","07","E3725",18,0,3,null,20190701,20190930,32320.336800000001,0]
[null,"CHIHUAHUA","08DPT0007X",200,"GAOR861127BG3","GAOR861127MCHMNQ19","GAMBOA ONTIVEROS RAQUEL",30102,216,83101,1001,"02","07","E3725",18,0,3,null,20190701,20190930,36196.806799999998,0]
[null,"CHIHUAHUA","08DPT0007X",100,"GAAN631226D5A","GAAN631226MCHNNR03","GANDARA ANGUIANO NORMA",30102,240,83101,1001,"02","07","E3725",20,0,3,null,20190701,20190930,34380.642,0]
[null,"CHIHUAHUA","08DPT0007X",100,"GARA6105276N5","GARA610527HCHRZL00","GARAY RUIZ JOSE ALFONSO",30102,240,83101,1001,"02","07","E3725",20,0,3,null,20190701,20190930,38640.831999999995,0]
[null,"CHIHUAHUA","08DPT0007X",100,"GOTD6910121D1","GOTD691012MCHMVY06","GOMEZ TAVARES DEYANIRA",30102,120,83101,1001,"02","07","E3725",10,0,3,null,20190701,20190930,19320.415999999997,0]
[null,"CHIHUAHUA","08DPT0007X",100,"GOGG8703244X4","GOGG870324MCHNNB07","GONZALEZ GANDARA GABRIELA ALEJANDRA",30102,204,83101,1001,"02","07","E3701",17,0,3,null,20190701,20190930,18744.584649999997,0]
[null,"CHIHUAHUA","08DPT0007X",100,"GONM640214JC7","GONM640214HJCNVG03","GONZÁLEZ NAVA MIGUEL",30102,216,83101,1001,"02","07","E3711",18,0,3,null,20190701,20190930,27290.376974999999,0]
[null,"CHIHUAHUA","08DPT0007X",100,"GUCH710602IC3","GUCH710602HCHTSC09","GUTIERREZ CISNEROS HECTOR",30102,192,83101,1001,"02","07","E3711",16,0,3,null,20190701,20190715,3637.2,0]
[null,"CHIHUAHUA","08DPT0007X",100,"HEPR900403KQ2","HEPR900403HCHRRC03","HERNANDEZ PEREZ RICARDO",30102,120,83101,1001,"02","07","E3725",10,0,3,null,20190701,20190930,19320.415999999997,0]
[null,"CHIHUAHUA","08DPT0007X",100,"HEMA6604046K4","HEMA660404HCHRXN05","HERRERA MUÑOZ JOSE ANGEL",30102,240,83101,1001,"02","07","E3725",20,0,3,null,20190701,20190930,38640.831999999995,0]
[null,"CHIHUAHUA","08DPT0007X",100,"HEOS840726F25","HEOS840726HCHRGR06","HERRERA OGAZ SERGIO ARTURO",30102,240,83101,1001,"02","07","E3725",20,0,3,null,20190701,20190930,38640.831999999995,0]
[null,"CHIHUAHUA","08DPT0007X",100,"HOAG621120KT8","HOAG621120MCHLVB08","HOLGUIN AVILA GABRIELA ALEJANDRA",30102,216,83101,1001,"02","07","E3713",18,0,3,null,20190701,20190930,30226.705774999999,0]
[null,"CHIHUAHUA","08DPT0007X",100,"HUJD820323M58","HUJD820323HMCRMN01","HUERTA JIMENEZ DANIEL",30102,156,83101,1001,"02","07","E3701",13,0,3,null,20190701,20190930,13452.718849999999,0]
[null,"CHIHUAHUA","08DPT0007X",200,"LOHA840518CS8","LOHA840518HCHPRL07","LOPEZ HERNANDEZ ALBERTO",30102,216,83101,1001,"02","07","E3713",18,0,3,null,20190701,20190930,29609.585775000003,0]
[null,"CHIHUAHUA","08DPT0007X",400,"LOGM9410315T5","LOGM941031HVZRNL01","LORENZO GONZALEZ MELESIO",30102,216,83101,1001,"02","07","E3701",18,0,3,null,20190816,20190930,9414.9760999999999,0]
[null,"CHIHUAHUA","08DPT0007X",200,"MAVA850717159","MAVA850717MCHCLL06","MACÍAS VELAZQUEZ ALEJANDRA",30102,240,83101,1001,"02","07","E3725",20,0,3,null,20190701,20190930,38640.831999999995,0]
[null,"CHIHUAHUA","08DPT0007X",100,"MAER720708DH1","MAXE720708MCHNXR00","MANCHA ERIKA SELENE",30102,228,83101,1001,"02","07","E3725",19,0,3,null,20190701,20190930,34578.689400000003,0]
[null,"CHIHUAHUA","08DPT0007X",100,"MAOD8107099T0","MAOD810709HCHRLN01","MARQUEZ OLIVAS DANIEL ANTONIO",30102,240,83101,1001,"02","07","E3711",20,0,3,null,20190701,20190930,29715.917750000001,0]
[null,"CHIHUAHUA","08DPT0007X",100,"MARS830130RA7","MARS830130HCHRVR05","MARTINEZ RIVERA SERGIO ALONSO",30102,120,83101,1001,"02","07","E3725",10,0,3,null,20190701,20190930,19320.415999999997,0]
[null,"CHIHUAHUA","08DPT0007X",200,"MALA850527KR1","MALA850527HTLTCN04","MATUS LECOURTOIS ANDRES ISAAC",30102,120,83101,1001,"02","07","E3711",10,0,3,null,20190701,20190930,17588.143875000002,0]
[null,"CHIHUAHUA","08DPT0007X",100,"MESO501218RY9","MESO501218HJCNLS04","MENDOZA SALAS OSCAR  IGNAC IO",30102,240,83101,1001,"02","07","E3725",20,0,3,null,20190701,20190930,35090.671999999999,0]
[null,"CHIHUAHUA","08DPT0007X",200,"MESS970703G31","MESS970703MCHNGL02","MENDOZA SEGOVIA SALMA YESENIA",30102,108,83101,1001,"02","07","E3701",9,0,3,null,20190701,20190820,3542.7,0]
[null,"CHIHUAHUA","08DPT0007X",200,"MESB8507159W0","MESB850715HCHNRN00","MENDOZA SORIANO BENJAMIN ALEJANDRO",30102,240,83101,1001,"02","07","E3725",20,0,3,null,20190701,20190930,38640.831999999995,0]
[null,"CHIHUAHUA","08DPT0007X",200,"MOAJ681102IQ0","MOAJ681102HCHNGS07","MONTES AGUILAR JESUS GERARDO",30102,216,83101,1001,"02","07","E3711",18,0,3,null,20190701,20190930,27290.376974999999,0]
[null,"CHIHUAHUA","08DPT0007X",200,"MOMM791027B8A","MOMM791027MCHRRY08","MORALES MORENO MAYRA MARGARITA",30102,228,83101,1001,"02","07","E3725",19,0,3,null,20190701,20190930,35998.749400000008,0]
[null,"CHIHUAHUA","08DPT0007X",100,"NEVI930902L97","NEVI930902MVZRRM00","NERI VARGAS IMELDA",30102,156,83101,1001,"02","07","E3711",13,0,3,null,20190816,20190930,9162.6850374999995,0]
[null,"CHIHUAHUA","08DPT0007X",200,"OEPH7911267A5","OEPH791126HCHRNC09","ORNELAS DEL PINO HECTOR RICARDO",30102,216,83101,1001,"02","07","E3713",18,0,3,null,20190701,20190930,28375.315775000003,0]
[null,"CHIHUAHUA","08DPT0007X",100,"OOMB8207037W4","OOMB820703HCHRLN09","OROZCO MONTES BLAS",30102,216,83101,1001,"02","07","E3711",18,0,3,null,20190816,20190930,12686.776974999999,0]
[null,"CHIHUAHUA","08DPT0007X",200,"OIGC960301QQA","OIGC960301HCHRNR04","ORTIZ GONZALEZ CARLOS ANDRES",30102,216,83101,1001,"02","07","E3701",18,0,3,null,20190816,20190930,10964.286099999999,0]
[null,"CHIHUAHUA","08DPT0007X",200,"OIGA8509273I1","OIGA850927HCHRTL04","ORTIZ GUTIERREZ JOSE ALBERTO",30102,180,83101,1001,"02","07","E3725",15,0,3,null,20190701,20190930,24591.189000000002,0]
[null,"CHIHUAHUA","08DPT0007X",200,"PEME750130UP9","PEME750130HCHRRR00","PEREZ MARTINEZ ERICK DAVID",30102,216,83101,1001,"02","07","E3713",18,0,3,null,20190701,20190930,30606.225774999999,0]
[null,"CHIHUAHUA","08DPT0007X",100,"PERL8208024K1","PERL820802MCHRMR03","PEREZ RAMOS LAURA ANGELICA",30102,228,83101,1001,"02","07","E3725",19,0,3,null,20190701,20190930,35619.229400000004,0]
[null,"CHIHUAHUA","08DPT0007X",200,"PESD840502CP3","PESD840502HCHRCG00","PEREZ SAUCEDO DIEGO ALEJANDRO",30102,180,83101,1001,"02","07","E3711",15,0,3,null,20190701,20190930,22286.970980000002,0]
[null,"CHIHUAHUA","08DPT0007X",200,"POMJ860826TB2","POMJ860826HCHRDN05","PORRAS MEDINA JUAN CARLOS",30102,240,83101,1001,"02","07","E3725",20,0,3,null,20190701,20190930,37930.792000000001,0]
[null,"CHIHUAHUA","08DPT0007X",200,"RIBG810102KB8","RIBG810102MCHVRR02","RIVAS BARRAGAN GRACIELA",30102,204,83101,1001,"02","07","E3713",17,0,3,null,20190701,20190930,29164.578787499999,0]
[null,"CHIHUAHUA","08DPT0007X",100,"ROMP8008014S4","ROMP800801MCSBZT07","ROBLERO MAZARIEGOS PATRICIA",30102,240,83101,1001,"02","07","E3725",20,0,3,null,20190701,20190930,32960.582000000002,0]
[null,"CHIHUAHUA","08DPT0007X",200,"ROCG680807P47","ROCG680807MCLLSR09","ROLDAN CASTILLO GRISELDA",30102,169,83101,1001,"02","07","E3725",14,0,3,null,20190701,20190930,29178.666400000006,0]
[null,"CHIHUAHUA","08DPT0007X",200,"RUGA7605108F9","RUGA760510MCHVTN01","RUVALCABA GUTIERREZ MARIA ANTONIETA",30102,180,83101,1001,"02","07","E3713",15,0,3,null,20190701,20190930,20868.984812499999,0]
[null,"CHIHUAHUA","08DPT0007X",100,"SAMR880304CG8","SAMR880304HCHLXF03","SALAS MUÑOZ RAFAEL",30102,180,83101,1001,"02","07","E3711",15,0,3,null,20190701,20190930,19073.930812500003,0]
[null,"CHIHUAHUA","08DPT0007X",100,"SAFA580219G58","SAFA580219HVZMLL08","SAMARIO FLORES ALVARO",30102,240,83101,1001,"02","07","E3725",20,0,3,null,20190701,20190930,38640.831999999995,0]
[null,"CHIHUAHUA","08DPT0007X",100,"SAOA880909JJ6","SAOA880909HOCMSL00","SAMARIO OSORIO ALVARO OSCAR",30102,240,83101,1001,"02","07","E3711",20,0,3,null,20190701,20190930,29169.89775,0]
[null,"CHIHUAHUA","08DPT0007X",200,"SAON851028RE1","SAON851028MVZMSL07","SAMARIO OSORIO NALLELY",30102,96,83101,1001,"02","07","E3711",8,0,3,null,20190701,20190930,12184.5131,0]
[null,"CHIHUAHUA","08DPT0007X",200,"SAEO910403QK8","SAEO910403HNLNSS08","SANCHEZ ESTRADA OSCAR IVAN",30102,216,83101,1001,"02","07","E3711",18,0,3,null,20190701,20190930,26744.326975000004,0]
[null,"CHIHUAHUA","08DPT0007X",100,"SEEI760505188","SEEI760505MCHRSL09","SERRATOS ESPARZA ILSE",30102,216,83101,1001,"02","07","E3725",18,0,3,null,20190701,20190930,34066.716800000002,0]
[null,"CHIHUAHUA","08DPT0007X",200,"TAVY911105KV5","TAVY911105MCHGNS05","TAGLE VENZOR YASSMIN",30102,228,83101,1001,"02","07","E3713",19,0,3,null,20190701,20190930,32523.102762500002,0]
[null,"CHIHUAHUA","08DPT0007X",200,"TENA800305KZ2","TENA800305HCHJVN00","TEJADA NEVAREZ ANGEL ADRIAN",30102,216,83101,1001,"02","07","E3725",18,0,3,null,20190701,20190930,36196.806799999998,0]
[null,"CHIHUAHUA","08DPT0007X",200,"TORE8012234Y9","TORE801223HNTPYD08","TOPETE REYES EDGAR",30102,240,83101,1001,"02","07","E3725",20,0,3,null,20190701,20190930,38640.831999999995,0]
[null,"CHIHUAHUA","08DPT0007X",100,"TOCJ650407CT0","TOCJ650407HVZRNS07","TORRES CANTERO JOSE",30102,240,83101,1001,"02","07","E3725",20,0,3,null,20190701,20190930,38640.831999999995,0]
[null,"CHIHUAHUA","08DPT0007X",200,"TORN791114PY6","TORN791114MCHRYD07","TORRES REY NADIA MARIA",30102,240,83101,1001,"02","07","E3725",20,0,3,null,20190701,20190930,37220.762000000002,0]
[null,"CHIHUAHUA","08DPT0007X",100,"UUAR860131EV3","UUAR860131HCHRRF06","URTUZUASTEGUI ARZOLA RAFAEL",30102,240,83101,1001,"02","07","E3725",20,0,3,null,20190701,20190930,38640.831999999995,0]
[null,"CHIHUAHUA","08DPT0007X",200,"VAAF840608FK3","VAAF840608HCHZCR03","VAZQUEZ ACEVEDO FERNANDO",30102,228,83101,1001,"02","07","E3713",19,0,3,null,20190701,20190930,32523.102762500002,0]
[null,"CHIHUAHUA","08DPT0007X",200,"VIAS640217RZ1","VIAS640217HCHLGL08","VILLALOBOS AGUIRRE SAUL",30102,228,83101,1001,"02","07","E3713",19,0,3,null,20190701,20190930,31906.002930000002,0]
[null,"CHIHUAHUA","08DPT0007X",100,"VIGR720403880","VIGR720403HVZLBC14","VILLARAUZ GABINO RICARDO",30102,240,83101,1001,"02","07","E3725",20,0,3,null,20190701,20190930,37930.792000000001,0]
[null,"CHIHUAHUA","08DPT0008W",100,"AUED570608MR1","AUED570608HZSGSN08","DANIEL AGUILAR ESPARZA",20201,480,83101,1003,"02","08","CF33203",0,"9354",2,null,20190701,20190930,56184.369999999995,0]
[null,"CHIHUAHUA","08DPT0008W",100,"BESJ800501RQ3","BESJ800501HCLRLL06","JULIO CESAR BERNAL SALAS",20214,480,83101,1003,"02","08","CF33206",0,13383,2,null,20190701,20190930,99630.15,0]
[null,"CHIHUAHUA","08DPT0008W",100,"EOCA6608284C4","EOCA660828HCHSRG02","AGUSTIN ESCOBAR CERVANTES",20214,480,83101,1003,"02","08","CF18201",0,12852,2,null,20190701,20190930,38348.18,0]
[null,"CHIHUAHUA","08DPT0008W",100,"EOHE660901TLA","EOHE660901MCHSLV04","EVA MARIA ESCOBAR HOLGUIN",20402,480,83101,1003,"02","08","A03202",0,"9359",2,null,20190701,20190930,51595.979999999996,0]
[null,"CHIHUAHUA","08DPT0008W",100,"HEGA690525I40","HEGA690525MCHRRL02","ALICIA HERNANDEZ GARCIA",20215,480,83101,1003,"02","08","AO3202",0,"13382",2,null,20190701,20190930,51209.229999999996,0]
[null,"CHIHUAHUA","08DPT0008W",100,"HEGE6610076V0","HEGE661007MSIRLG06","MARIA EUGENIA HERRERA GOLARTE",20214,480,83101,1003,"02","08","CF33206",0,"9350",2,null,20190701,20190930,120622.58,0]
[null,"CHIHUAHUA","08DPT0008W",100,"MALM890515EN0","MALM890515HCHTCR05","MARIO ALBERTO MATA LICON",50101,480,83101,1003,"02","08","CF02103",0,"12588",5,null,20190701,20190930,85992.48,0]
[null,"CHIHUAHUA","08DPT0008W",100,"MEMF660302UM0","MEMF660302HCHNLD06","FEDERICO MENDOZA MOLINA",20305,480,83101,1003,"02","08","CF18203",0,"9369",2,null,20190701,20190930,60268.25,0]
[null,"CHIHUAHUA","08DPT0008W",100,"MOAG600916JW6","MOAG600916HCHYCL04","GUILLERMO MOY ACOSTA",50107,480,83101,1003,"02","08","CF02105",0,2377,2,null,20190701,20190930,66459.899999999994,0]
[null,"CHIHUAHUA","08DPT0008W",100,"OOVM6504302T1","OOVM650430HCHRLS07","MOISES OROZCO VALDEZ",20305,480,83101,1003,"02","08","CF18203",0,"9363",2,null,20190701,20190930,58134.2,0]
[null,"CHIHUAHUA","08DPT0008W",100,"PANA720117JW4","PANA720117HDGLVN01","ANTONIO PALMA NEVAREZ",20206,480,83101,1003,"02","08","CF19201",0,"9365",2,null,20190701,20190930,50823.85,0]
[null,"CHIHUAHUA","08DPT0008W",100,"PAHA640330KP3","PAHA640330MCHYLR06","ARMIDA IRENE PAYAN HOLGUIN",20214,480,83101,1003,"02","08","CF33206",0,"13385",2,null,20190701,20190930,139520.46000000002,0]
[null,"CHIHUAHUA","08DPT0008W",100,"POAJ710301PK6","POAJ710301MCHRLS06","MARIA DE JESUS PORTILLO ALARCON",20216,480,83101,1003,"02","08","CF34201",0,"9358",2,null,20190701,20190930,41835.350000000006,0]
[null,"CHIHUAHUA","08DPT0008W",100,"RIGR710129FB6","RIGR710129MCHVRQ06","RAQUEL ERENDIDA RIVERA GARCIA",20215,480,83101,1003,"02","08","CF04201",0,"9366",2,null,20190701,20190930,54215.020000000004,0]
[null,"CHIHUAHUA","08DPT0008W",100,"ROGJ660820EP3","ROGJ660820HCHDNN02","JOSE JUAN RODRIGUEZ GONZALEZ",20401,480,83101,1003,"02","08","S01201",0,2431,2,null,20190701,20190930,15170.08,0]
[null,"CHIHUAHUA","08DPT0008W",100,"SAML750404ND1","SAML750404MCHNXZ07","SAENZ MUNOZ LUZ MARIA",20401,480,83101,1003,"02","08","SO1201",0,9358,2,null,20190701,20190930,34595.550000000003,0]
[null,"CHIHUAHUA","08DPT0008W",100,"TAHJ7109304KA","TAHJ710930HCHRLV01","JAVIER EUSEBIO TARANGO HOLGUIN",20214,480,83101,1003,"02","08","CF33206",0,"14089",2,null,20190701,20190930,123269.63999999998,0]
[null,"CHIHUAHUA","08DPT0008W",100,"VARJ610925H36","VARJ610925HCHLSS00","JESUS ANTONIO VALDEZ ROSALES",20216,480,83101,1003,"02","08","S01202",0,"9367",2,null,20190701,20190930,42403.7,0]
[null,"CHIHUAHUA","08DPT0008W",100,"VEGR750904UR2","VEGR750904MCHLRS06","ROSALIA MARGARITA VELARDE GARCIA",20214,480,83101,1003,"02","08","CF33206",0,9350,2,null,20190701,20190930,88771.300000000017,0]
[null,"CHIHUAHUA","08DPT0008W",100,"VARO691222JA8","VAXR691222MCHLXS07","ROSA MARIA VALENZUELA",30102,216,83101,1001,"02","08","E3725",18,0,3,null,20190701,20190930,31447.09,0]
[null,"CHIHUAHUA","08DPT0008W",100,"AUMM780328A31","AUMM780328MCHGLN09","MINERVA AGUILAR MOLINAR",30102,228,83101,1001,"02","08","E3725",19,0,3,null,20190701,20190930,33631.089999999997,0]
[null,"CHIHUAHUA","08DPT0008W",100,"AEGL800105RF6","AEGL800105MCHLNZ06","LIZETTE JOHANNA ALEJANDRO GONZALEZ",30102,216,83101,1001,"02","08","E3725",18,0,3,null,20190701,20190930,32620.949999999997,0]
[null,"CHIHUAHUA","08DPT0008W",100,"AAGJ670423U8A","AAGJ670423HCHMNR05","JORGE AMPARAN GONZALEZ",30102,228,83101,1001,"02","08","E3725",19,0,3,null,20190701,20190930,30931.089999999997,0]
[null,"CHIHUAHUA","08DPT0008W",100,"AESS721002N67","AESS721002MCHRTS00","SUSANA ARMENDARIZ SOTO",30102,240,83101,1001,"02","08","E3725",20,0,3,null,20190701,20190930,34641.21,0]
[null,"CHIHUAHUA","08DPT0008W",100,"BAVM821203FN0","BAVM821203MCHRLN06","MONICA LOURDES BARRAZA VILLALOBOS",30102,240,83101,1001,"02","08","E3725",20,0,3,null,20190701,20190930,34641.21,0]
[null,"CHIHUAHUA","08DPT0008W",100,"CAVS820702FV1","CAVS820702MCHRRN01","SANDRA ELIZABETH CARDENAS VARGAS",30102,216,83101,1001,"02","08","E3713",18,0,3,null,20190701,20190930,26959.149999999998,0]
[null,"CHIHUAHUA","08DPT0008W",100,"ROMJ731201675","CANA840815MCHRVN00","ANA ISABEL CARREON NAVA",30102,240,83101,1001,"02","08","E3713",20,0,3,null,20190701,20190930,29218.280000000002,0]
[null,"CHIHUAHUA","08DPT0008W",100,"COMR940524BD4","COMR940524HCHNRD00","CONTRERAS MARTINEZ RODOLFO",30102,240,83101,1001,"02","08","E3711",20,0,3,null,20190701,20190930,17772,0]
[null,"CHIHUAHUA","08DPT0008W",100,"COFA750408JB9","COFA750408MCHRRZ08","AZUCENA CORRAL FRANCO",30102,216,83101,1001,"02","08","E3725",18,0,3,null,20190701,20190930,30860.16,0]
[null,"CHIHUAHUA","08DPT0008W",100,"DIHL770620B93","DIHL770620MCHZRZ06","LUZ IMELDA DIAZ HERNANDEZ",30102,240,83101,1001,"02","08","E3725",20,0,3,null,20190701,20190930,34641.21,0]
[null,"CHIHUAHUA","08DPT0008W",100,"DUMJ9006174T4","DUMJ900617MCHRRS05","MARIA JOSE DURAN MARQUEZ",30102,216,83101,1001,"02","08","E3711",18,0,3,null,20190701,20190930,7009.4,0]
[null,"CHIHUAHUA","08DPT0008W",100,"GASJ850822GF7","GASJ850822HCHLNS04","JOSE GALVEZ SANTANA",30102,216,83101,1001,"02","08","E3725",18,0,3,null,20190701,20190930,31970.949999999997,0]
[null,"CHIHUAHUA","08DPT0008W",100,"GASA8103319V2","GASA810331MCHRRD08","ADRIANA GARDEA SERRANO",30102,240,83101,1001,"02","08","E3713",20,0,3,null,20190701,20190930,29726.83,0]
[null,"CHIHUAHUA","08DPT0008W",100,"GULM750313628","GULM750313HCHLNN08","MANUEL ALEJANDRO GULLEN LUNA",30102,204,83101,1001,"02","08","E3725",17,0,3,null,20190701,20190930,30373.890000000003,0]
[null,"CHIHUAHUA","08DPT0008W",100,"HEAJ8610295N1","HEAJ861029HCHRCN09","JUAN CARLOS HERNANDEZ ACOSTA ",30102,228,83101,1001,"02","08","E3725",19,0,3,null,20190701,20190930,32981.089999999997,0]
[null,"CHIHUAHUA","08DPT0008W",100,"HEGE760311918","HEGE760311HCHRTF05","EFRAIN ARTURO HERNANDEZ GUTIERREZ",30102,240,83101,1001,"02","08","E3701",20,0,3,null,20190701,20190930,18104.919999999998,0]
[null,"CHIHUAHUA","08DPT0008W",100,"LAGL840311IS1","LAGL840311MCHRMZ07","LIZBETH LARES GOMEZ",30102,240,83101,1001,"02","08","E3711",20,0,3,null,20190701,20190930,7788.22,0]
[null,"CHIHUAHUA","08DPT0008W",100,"MAML7703077T7","MAML770307MCHCRS01","LESSLEY MYRLEE MACIAS MARTINEZ",30102,240,83101,1001,"02","08","E3725",20,0,3,null,20190701,20190930,34117.360000000001,0]
[null,"CHIHUAHUA","08DPT0008W",100,"MAEJ690219AK2","MAEJ690219HCHRSS06","JESUS MARTINEZ ESPARZA",30102,240,83101,1001,"02","08","E3725",20,0,3,null,20190701,20190930,32356.57,0]
[null,"CHIHUAHUA","08DPT0008W",100,"MECO5508271G3","MECO550827MSLXSL09","MEXIA CASTRO OLGA PATRICIA",30102,240,83101,1001,"02","08","E3725",20,0,3,null,20190701,20190930,34641.21,0]
[null,"CHIHUAHUA","08DPT0008W",100,"MOGE730414EA4","MOGE730414HCHRRL09","MORENO GARCIA ELISEO",30102,240,83101,1001,"02","08","E3711",20,0,3,null,20190701,20190930,26422.34,0]
[null,"CHIHUAHUA","08DPT0008W",100,"MUMP8911284K8","MUMP891128HCHXXS06","PASCUAL ABRAHAM MUÑOZ MUÑOZ",30102,240,83101,1001,"02","08","E3713",20,0,3,null,20190701,20190930,29726.83,0]
[null,"CHIHUAHUA","08DPT0008W",100,"NAHJ790815BF0","NAHJ790815HCHVRS00","JESUS MIGUEL NAVARRO HERNANDEZ",30102,216,83101,1001,"02","08","E3711",18,0,3,null,20190701,20190930,22617.21,0]
[null,"CHIHUAHUA","08DPT0008W",100,"OIGM890424IC1","OIGM890424MCHLRR06","MARTHA ALEJANDRA OLIVAS GUERRERO",30102,240,83101,1001,"02","08","E3725",20,0,3,null,20190701,20190930,32754.28,0]
[null,"CHIHUAHUA","08DPT0008W",100,"OINS5902223YA","OINS590222HMNLXL02","OLIVO NUÑEZ JOSE SALVADOR",30102,240,83101,1001,"02","08","E3725",20,0,3,null,20190701,20190930,34641.21,0]
[null,"CHIHUAHUA","08DPT0008W",100,"PAVF6602076Y9","PAVF660207MCHLRL06","PALMA VARGAS FLOR",30102,216,83101,1001,"02","08","E3711",18,0,3,null,20190701,20190930,16264.8,0]
[null,"CHIHUAHUA","08DPT0008W",100,"PAFV661205KZ5","PAFV661205HCHTRC01","PATENA FIERRO VICTOR MANUEL",30102,216,83101,1001,"02","08","E3713",18,0,3,null,20190701,20190930,26959.149999999998,0]
[null,"CHIHUAHUA","08DPT0008W",100,"RATV881128H34","RATV881128HCHMRC05","VICTOR HUGO RAMIREZ",30102,180,83101,1001,"02","08","E3711",15,0,3,null,20190701,20190930,5841.17,0]
[null,"CHIHUAHUA","08DPT0008W",100,"RERP770809FK9","RERP770809HCHDDD04","PEDRO OSWALDO REDE RODRIGUEZ",30102,240,83101,1001,"02","08","E3725",20,0,3,null,20190701,20190930,30767.360000000001,0]
[null,"CHIHUAHUA","08DPT0008W",100,"REVY780409NT1","REVY780409MCHYLZ05","YASMIN LISSET REYES VALLES",30102,216,83101,1001,"02","08","E3713",18,0,3,null,20190701,20190930,24909.16,0]
[null,"CHIHUAHUA","08DPT0008W",100,"RIGJ610311956","RIGJ610311HDFVRL08","JOEL RAUL RIVAS GARCIA",30102,240,83101,1001,"02","08","E3713",20,0,3,null,20190701,20190930,29359.699999999997,0]
[null,"CHIHUAHUA","08DPT0008W",100,"ROGR680108PWA","ROGR680108HCHDRC09","RICARDO RODRIGUEZ GARCIA",30102,228,83101,1001,"02","08","E3725",19,0,3,null,20190701,20190930,34281.089999999997,0]
[null,"CHIHUAHUA","08DPT0008W",100,"ROTC8606147U1","ROTC860614MCHDLY03","RODRIGUEZ TALAMANTES CYNTHIA",30102,120,83101,1001,"02","08","E3711",10,0,3,null,20190701,20190930,1884,0]
[null,"CHIHUAHUA","08DPT0008W",100,"SADR840831726","SADR840831HCHNZM02","RAMON AGUSTO SANCHEZ DIAZ",30102,120,83101,1001,"02","08","E3725",10,0,3,null,20190701,20190930,18020.599999999999,0]
[null,"CHIHUAHUA","08DPT0008W",100,"SARJ650111CB4","SARJ650111HCHNVM05","JAIME SANCHEZ RIVERA",30102,120,83101,1001,"02","08","E3725",10,0,3,null,20190701,20190930,15970.6,0]
[null,"CHIHUAHUA","08DPT0008W",100,"VAVS740521TK5","VAVS740521HCHLLL09","SAUL ARMANDO VALLES VALLE",30102,180,83101,1001,"02","08","E3725",15,0,3,null,20190701,20190930,14267.5,0]
[null,"CHIHUAHUA","08DPT0008W",100,"VICG5002047Q6","VICG500204HCHTRL01","GILBERTO FELICIANO VITELA CARRASCO",30102,240,83101,1001,"02","08","E3725",20,0,3,null,20190701,20190930,34641.21,0]
[null,"CHIHUAHUA","08DPT0012I",124,"CAMC8511068L5","CAMC851106MCHRRR00","CARMEN IVONNE CARMONA MURILLO","20216",480,83101,1003,"02","18","S01201",0,9680,2,null,20190701,20190930,33059.26,0]
[null,"CHIHUAHUA","08DPT0012I",100,"CAJG690110UD1","CAJG690110HCHHRN00","GONZALO CHAVEZ JUAREZ","20109",480,83101,1003,"02","18","CF33206",0,13932,2,null,20190701,20190930,80752.67,0]
[null,"CHIHUAHUA","08DPT0012I",124,"COVC830703U30","COVC830703MCHRZY01","CYNTHIA ROSARIO CORONADO VAZQUEZ","20109",480,83101,1003,"02","18","CF33206",0,14308,2,null,20190701,20190930,105799.47,0]
[null,"CHIHUAHUA","08DPT0012I",124,"EIRL670407TS6","EIRL670407MCHNDT08","LETICIA ENRIQUEZ RODRIGUEZ","20105",480,83101,1003,"02","18","CF33206",0,13934,2,null,20190701,20190930,140913.65000000002,0]
[null,"CHIHUAHUA","08DPT0012I",124,"GACI7107098NA","GACI710709MCHRRM01","IMELDA IVONE GARCIA CARMONA","20201",480,83101,1003,"02","18","CF33203",0,9688,2,null,20190701,20190930,57669.380000000005,0]
[null,"CHIHUAHUA","08DPT0012I",124,"GOMB690116428","GOMB690116MCHNRL02","BELIA LORENA GONZALEZ  MORENO","20206",480,83101,1003,"02","18","A03202",0,9677,2,null,20190701,20190930,49299.979999999996,0]
[null,"CHIHUAHUA","08DPT0012I",124,"IAMM880831RY4","IAMM880831MCHZRR03","MAR ELISA IZAGUIRRE MARTINEZ","20216",480,83101,1003,"02","18","A03202",0,9678,2,null,20190701,20190930,44177.179999999993,0]
[null,"CHIHUAHUA","08DPT0012I",124,"LECG700827GY1","LECG700827MCHCHL00","GLORIA A LECHUGA CHAVEZ","20201",480,83101,1003,"02","18","CF33204",0,9675,2,null,20190701,20190930,91925.81,0]
[null,"CHIHUAHUA","08DPT0012I",124,"LOLJ670723J90","LOLJ670723HCHPZV05","JAVIER LOPEZ LOZANO","20401",480,83101,1003,"02","18","S01201",0,9681,2,null,20190701,20190930,33059.26,0]
[null,"CHIHUAHUA","08DPT0012I",124,"MAAS821018113","MAAS821018HCHRNG05","SIGIFREDO MARQUEZ ANCHONDO","20216",480,83101,1003,"02","18","CF18203",0,8788,2,null,20190701,20190930,51926.369999999995,0]
[null,"CHIHUAHUA","08DPT0012I",124,"MAQS651014TH4","MAQS651014HCHRNL03","SAUL MARQUEZ QUINTANA","20302",480,83101,1003,"02","18","CF18201",0,9689,2,null,20190701,20190930,38262.89,0]
[null,"CHIHUAHUA","08DPT0012I",124,"PEDR620906HG6","PEDR620906HCHRMM07","RAMON JAVIER PEREZ DOMINGUEZ","50401",480,83101,1003,"02","18","CF02104",0,12726,5,null,20190701,20190930,85992.48,0]
[null,"CHIHUAHUA","08DPT0012I",124,"ROCR700830F58","ROCR700830HCHDNC08","RICARDO ANTELMO RODRIGUEZ CANO","20302",480,83101,1003,"02","18","S01202",0,9681,2,null,20190701,20190930,43624.43,0]
[null,"CHIHUAHUA","08DPT0012I",124,"ROTF760823LY5","ROTF760823MCHDRL03","FLOR GUADALUPE RODRIGUEZ TREJO","20216",480,83101,1003,"02","18","CF04201",0,9676,2,null,20190701,20190930,50202.86,0]
[null,"CHIHUAHUA","08DPT0012I",124,"SOMD561124TEA","SOMD561124HCHTDV09","DAVID SOTELO MEDRANO","20205",480,83101,1003,"02","18","T08201",0,11851,2,null,20190701,20190930,54136.1,0]
[null,"CHIHUAHUA","08DPT0012I",124,"TERL781019J60","TERL781019HCHNDS08","LUIS CARLOS TENA RODELAS","20206",480,83101,1003,"02","18","CF21202",0,9694,2,null,20190701,20190930,51448.200000000004,0]
[null,"CHIHUAHUA","08DPT0012I",124,"UIST6008045JA","UIST600804HDGRMM07","TOMAS URBINA SIMENTAL","20216",480,83101,1003,"02","18","CF18203",0,9691,2,null,20190701,20190930,58264.479999999996,0]
[null,"CHIHUAHUA","08DPT0012I",124,"VAGA800112LSA","VAGA800112HCHLTL07","ALBERTO VALENZUELA GUTIERREZ",20216,480,83101,1003,"02","18","CF19201",0,9692,2,null,20190701,20190930,46375.45,0]
[null,"CHIHUAHUA","08DPT0012I",200,"AARP7710257KA","AARP771025MCHLZL02","PALMA LILIANA ALMANZA RUIZ","30102",168,83101,1001,"02","18","E3725","14.0",0,3,null,20190701,20190930,25058.85,0]
[null,"CHIHUAHUA","08DPT0012I",124,"AAOG811026Q47","AAOG811026MCHRRB02","GABRIELA MARIA ARAGON ORTIZ","30102",240,83101,1001,"02","18","E3725","20.0",0,3,null,20190701,20190930,33341.21,0]
[null,"CHIHUAHUA","08DPT0012I",100,"AEGL940102TD8","AEGL940102HCHRNS03","LUIS DANIEL ARMENDARIZ GONZALEZ","30102",144,83101,1001,"02","18","E3711","12.0",0,3,null,20190701,20190930,7009.47,0]
[null,"CHIHUAHUA","08DPT0012I",100,"BALL820222AW6","BALL820222HCHYNR00","LORENZO ANTONIO BAYLON DE LEON","30102",180,83101,1001,"02","18","E3711","15.0",0,3,null,20190701,20190930,8761.84,0]
[null,"CHIHUAHUA","08DPT0012I",100,"CARE8810091J2","CARE881009HCHRMD08","EDGAR ENRIQUE CARREON RAMOS","30102",228,83101,1001,"02","18","E3725","19.0",0,3,null,20190701,20190930,33694.160000000003,0]
[null,"CHIHUAHUA","08DPT0012I",100,"CACP850903KT2","CACP850903MCHHHR00","PERLA JAZMIN CHAIREZ CHACON","30102",216,83101,1001,"02","18","E3725","18.0",0,3,null,20190701,20190930,32097.09,0]
[null,"CHIHUAHUA","08DPT0012I",200,"CAMN760505UE4","CAMN760505MCHHNN03","NANCY LORENA CHAVEZ MONCADA","30102",180,83101,1001,"02","18","E3725","15.0",0,3,null,20190701,20190930,27242.84,0]
[null,"CHIHUAHUA","08DPT0012I",100,"PEMC8412061M5","PEMC841206HCHXRR02","CARLOS DE LA PEÑA MERAZ","30102",240,83101,1001,"02","18","E3725","20.0",0,3,null,20190701,20190930,16711,0]
[null,"CHIHUAHUA","08DPT0012I",100,"DOCE610806AJ3","DOCE610806MCHMMS03","ESPERANZA DOMINGUEZ CAMUÑEZ","30102",240,83101,1001,"02","18","E3711","20.0",0,3,null,20190701,20190930,25772.34,0]
[null,"CHIHUAHUA","08DPT0012I",200,"DOTW8710023S3","DOTW871002HCHMRL06","WALTER ALEJANDRO DOMINGUEZ TORRES","30102",192,83101,1001,"02","18","E3725","16.0",0,3,null,20190701,20190930,27016.04,0]
[null,"CHIHUAHUA","08DPT0012I",124,"DUIA911217JM8","DUIA911217HCHRBR05","ARMANDO ALEXIS DUARTE IBARRA","30102",240,83101,1001,"02","18","E3713","20.0",0,3,null,20190701,20190930,29726.83,0]
[null,"CHIHUAHUA","08DPT0012I",100,"EIRK930402BZ7","EIRK930402MCHNDR04","KARINA LIZETH ENRIQUEZ RODRIGUEZ","30102",216,83101,1001,"02","18","E3711","18.0",0,3,null,20190701,20190930,21625.68,0]
[null,"CHIHUAHUA","08DPT0012I",200,"EACL761108IA6","EACL761108HCHSHS08","JOSE LUIS ESTRADA CHAVEZ","30102",168,83101,1001,"02","18","E3701","14.0",0,3,null,20190701,20190930,14073.44,0]
[null,"CHIHUAHUA","08DPT0012I",124,"FITM7609208P9","FITM760920MCHGVR05","MARISOL FIGUEROA TOVAR","30102",216,83101,1001,"02","18","E3725","18.0",0,3,null,20190701,20190930,32097.09,0]
[null,"CHIHUAHUA","08DPT0012I",100,"GAMC820716BJ4","GAMC820716MCHLRR08","MARIA DEL CARMEN GALLEGOS MARTINEZ","30102",240,83101,1001,"02","18","E3725","20.0",0,3,null,20190701,20190930,35291.21,0]
[null,"CHIHUAHUA","08DPT0012I",100,"GOCS820528T91","GOCS820528MCHNLN05","SANDRA BERENICE GONZALEZ COLMENERO","30102",240,83101,1001,"02","18","E3725","20.0",0,3,null,20190701,20190930,35291.21,0]
[null,"CHIHUAHUA","08DPT0012I",100,"GOGG631226J88","GOGG631226MCHNLL06","GLORIA MARINA GONZALEZ GALLEGOS","30102",240,83101,1001,"02","18","E3725","20.0",0,3,null,20190701,20190930,34641.21,0]
[null,"CHIHUAHUA","08DPT0012I",124,"GOQM960413969","GOQM960413HCHNXR03","MARCO ANTONIO GONZALEZ QUIÑONEZ","30102",192,83101,1001,"02","18","E3701","16.0",0,3,null,20190701,20190930,16866.61,0]
[null,"CHIHUAHUA","08DPT0012I",100,"GAMO630830H94","GAMO630830MCHRRL07","OLGA CECILIA GRAJEDA  MIRAMONTES","30102",240,83101,1001,"02","18","E3725","20.0",0,3,null,20190701,20190930,35291.21,0]
[null,"CHIHUAHUA","08DPT0012I",200,"HEGP741201TCA","HEGP741201MCHRRT03","PATRICIA OLAYA HERRERA GARCIA","30102",228,83101,1001,"02","18","E3725","19.0",0,3,null,20190701,20190930,33694.160000000003,0]
[null,"CHIHUAHUA","08DPT0012I",100,"IIOF8012093M1","IIOF801209HCHRLR08","FRANCISCO IRIGOYEN OLIVAS","30102",240,83101,1001,"02","18","E3725","20.0",0,3,null,20190701,20190930,17361,0]
[null,"CHIHUAHUA","08DPT0012I",124,"IAPJ9005168T2","IAPJ900516MCHBRS04","JESIKA EDITH IBARRA PEREZ","30102",216,83101,1001,"02","18","E3711","18.0",0,3,null,20190701,20190930,7009.4,0]
[null,"CHIHUAHUA","08DPT0012I",200,"IAFR620519979","IAFR620519HSLZRM07","RAMON  IZAGUIRRE FIERRO","30102",228,83101,1001,"02","18","E3713","19.0",0,3,null,20190701,20190930,29501.57,0]
[null,"CHIHUAHUA","08DPT0012I",200,"JAAG74101784A","JAAG741017MCHQRL01","GLORIA LINDA JAQUEZ ARBALLO","30102",240,83101,1001,"02","18","E3725","20.0",0,3,null,20190701,20190930,34641.21,0]
[null,"CHIHUAHUA","08DPT0012I",124,"LAGL890709J41","LAGL890709MCHZNL07","LLUVIA CRISTINA LAZO GONZALEZ","30102",216,83101,1001,"02","18","E3725","18.0",0,3,null,20190701,20190930,32684.019999999997,0]
[null,"CHIHUAHUA","08DPT0012I",200,"MALS840210DM2","MALS840210MCHCYL02","SILVIA ISELA MACIAS LOYA","30102",120,83101,1001,"02","18","E3725","10.0",0,3,null,20190701,20190930,19320.599999999999,0]
[null,"CHIHUAHUA","08DPT0012I",124,"MAGZ860917JB4","MAGZ860917MCHLLL02","ZULEYKA MARIELA MALDONADO GIL","30102",240,83101,1001,"02","18","E3725","20.0",0,3,null,20190701,20190930,34641.21,0]
[null,"CHIHUAHUA","08DPT0012I",200,"MATM841124GU1","MATM841124MCHRLY00","MAYTEE ABRIL MARQUEZ TELLO","30102",168,83101,1001,"02","18","E3725","14.0",0,3,null,20190701,20190930,25058.85,0]
[null,"CHIHUAHUA","08DPT0012I",200,"MAGM880802UR1","MAGM880802MCHRRR08","MARINA ANGELICA MARTINEZ GARCIA","30102",240,83101,1001,"02","18","E3725","20.0",0,3,null,20190701,20190930,34704.28,0]
[null,"CHIHUAHUA","08DPT0012I",200,"MEOE6606187C0","MEOE660618HCHLRF02","EFREN MELENDEZ ORTIZ","30102",216,83101,1001,"02","18","E3725","18.0",0,3,null,20190701,20190930,29036.3,0]
[null,"CHIHUAHUA","08DPT0012I",100,"MERA900126FD2","MERA900126MCHNMN03","ANA ISABEL MENDOZA RAMOS","30102",240,83101,1001,"02","18","E3713","20.0",0,3,null,20190701,20190930,31026.83,0]
[null,"CHIHUAHUA","08DPT0012I",100,"MOEJ8410204P7","MOEJ841020HCHRSS09","JESUS MORENO ESTRADA","30102",120,83101,1001,"02","18","E3725","10.0",0,3,null,20190701,20190930,18020.599999999999,0]
[null,"CHIHUAHUA","08DPT0012I",124,"NUMR860506DV4","NUMR860506MCHXRQ03","RAQUEL NUÑEZ MARTINEZ","30102",240,83101,1001,"02","18","E3725","20.0",0,3,null,20190701,20190930,34641.21,0]
[null,"CHIHUAHUA","08DPT0012I",200,"OIPC830620AE8","OIPC830620HCHRRR03","CARLOS ALEJANDRO ORTIZ PAREDES","30102",240,83101,1001,"02","18","E3725","20.0",0,3,null,20190701,20190930,31580.43,0]
[null,"CHIHUAHUA","08DPT0012I",100,"PAVC680810379","PAVC680810MCHLLR09","CARMEN LORENA PALMA VALVERDE","30102",240,83101,1001,"02","18","E3725","20.0",0,3,null,20190701,20190930,31283.35,0]
[null,"CHIHUAHUA","08DPT0012I",200,"PAVK8303143F4","PAVK830314MCHYLR05","KARLA DENISSE PAYAN VALVERDE","30102",240,83101,1001,"02","18","E3725","20.0",0,3,null,20190701,20190930,34641.21,0]
[null,"CHIHUAHUA","08DPT0012I",100,"POED8604086S3","POED860408MCHRCN03","DIANA ELIZABETH PORTILLO ECHAVARRIA","30102",240,83101,1001,"02","18","E3725","20.0",0,3,null,20190701,20190930,35291.21,0]
[null,"CHIHUAHUA","08DPT0012I",200,"ROAN6811104YA","ROAN681110HVZDGX08","JOSE NOE RODRIGUEZ AGUILERA","30102",156,83101,1001,"02","18","E3725","13.0",0,3,null,20190701,20190930,24111.79,0]
[null,"CHIHUAHUA","08DPT0012I",124,"ROVC830522ILA","ROVC830522MCHDLR00","CRISTINA RODRIGUEZ VALVERDE","30102",216,83101,1001,"02","18","E3711","18.0",0,3,null,20190701,20190930,24214.67,0]
[null,"CHIHUAHUA","08DPT0012I",200,"SAME780216645","SAME780216MCHCLS05","ESMERALDA SAUCEDO MOLINA","30102",240,83101,1001,"02","18","E3725","20.0",0,3,null,20190701,20190930,34641.21,0]
[null,"CHIHUAHUA","08DPT0012I",124,"SATL841206QI8","SATL841206HCHZRS00","LUIS MIGUEL SAUZAMEDA TORRES","30102",228,83101,1001,"02","18","E3711","19.0",0,3,null,20190701,20190930,24472.489999999998,0]
[null,"CHIHUAHUA","08DPT0012I",100,"UUGA831111DY9","UUGA831111MCHRND03","ADRIANA ARMINE URQUIZA GONZALEZ","30102",240,83101,1001,"02","18","E3725","20.0",0,3,null,20190701,20190930,34641.21,0]
[null,"CHIHUAHUA","08DPT0012I",200,"VATL8403292K8","VATL840329HCHLRS05","LUIS OCTAVIO VALVERDE TORRES","30102",240,83101,1001,"02","18","E3713","20.0",0,3,null,20190701,20190930,29726.83,0]
[null,"CHIHUAHUA","08DPT0012I",100,"VACA8309027BA","VXCA830902HCHZHN07","ANDRES VAZQUEZ  CHAVEZ","30102",228,83101,1001,"02","18","E3725","19.0",0,3,null,20190701,20190930,31807.230000000003,0]
[null,"CHIHUAHUA","08DPT0012I",100,"VIMG940827G9A","VIMG940827MCHLNL05","GUILLE LIZBETH VILLALOBOS MONAÑO","30102",216,83101,1001,"02","18","E3711","18.0",0,3,null,20190701,20190930,17018.400000000001,0]
[null,"CHIHUAHUA","08DPT0012I",200,"VIVR8208282I1","VIVR820828HDGLLB03","ROBERTO RENE VILLALPALDO VILLALPANDO","30102",240,83101,1001,"02","18","E3701","20.0",0,3,null,20190701,20190930,20154.919999999998,0]
[null,"CHIHUAHUA","08DPT0011J",120,"AAEJ730109C94","AAEJ730109HCHLSL06","ALVAREZ ESCARCEGA JULIAN ","20206",480,83101,1003,"02",19,"S01201",0,"9738",2,null,20190701,20190930,33059.26,0]
[null,"CHIHUAHUA","08DPT0011J",120,"AOJS831129TE8","AOJS831129MCHNRL09","ANCHONDO JUAREZ SILVIA GRACIELA",20206,480,83101,1003,"02",19,"A03202",0,"2386",2,null,20190701,20190930,43882.61,0]
[null,"CHIHUAHUA","08DPT0011J",120,"AOLY671118ELA","AOLY671118MDGRCZ05","ARROYO LECHUGA YAZMIN",20109,480,83101,1003,"02",19,"CF33206",0,"14302",2,null,20190701,20190930,126963.86000000002,0]
[null,"CHIHUAHUA","08DPT0011J",120,"AIAA780609P70","AIAA780609HCHVGG01","AVITIA AGUILAR AGUSTIN ",50105,480,83101,1003,"02",19,"CF02105",0,"14576",5,null,20190701,20190930,66459.899999999994,0]
[null,"CHIHUAHUA","08DPT0011J",120,"BARM6606271QA","BARM660627HCHRBR03","MARIO ALBERTO BARBA RUBIO ","20216",480,83101,1003,"02",19,"CF18201",0,"9741",2,null,20190701,20190930,34297.480000000003,0]
[null,"CHIHUAHUA","08DPT0011J",120,"CAMF661018JC7","CAMF661018HCHHDR08","FRANCISCO JAVIER CABRERA MEDINA","20205",480,83101,1003,"02",19,"CF33204",0,"6359",2,null,20190701,20190930,93119.01999999999,0]
[null,"CHIHUAHUA","08DPT0011J",120,"CAVJ9010233Z3","CAVJ901023MCHXZH05","CAÑAS VAZQUEZ JAHAIRA ARANI ",20205,480,83101,1003,"02",19,"CF33204",0,"9734",2,null,20190701,20190930,63918.380000000005,0]
[null,"CHIHUAHUA","08DPT0011J",120,"EUGM7504107E2","EUGM750410HCHSRR05","ESQUIVEL GUERRERO MAURO EZEQUIEL ",20216,480,83101,1003,"02",19,"S01202",0,"9718",2,null,20190701,20190930,36256.959999999992,0]
[null,"CHIHUAHUA","08DPT0011J",120,"FACG681029MZ8","FACG681029MCHDRR04","GEORGINA FAUDOA CRUZ",20408,480,83101,1003,"02",19,"CF19201",0,9706,2,null,20190701,20190930,55531.85,0]
[null,"CHIHUAHUA","08DPT0011J",120,"FOTL710111D65","FOTL710111MDFLNL02","LILLIAN KARINA FLOTTE TINOCO ",20109,480,83101,1003,"02",19,"CF33206",0,"13638",2,null,20190701,20190930,84634.569999999992,0]
[null,"CHIHUAHUA","08DPT0011J",120,"FUCJ631107GN9","FUCJ631107MCHNHL09","JULIETA FUENTES CHAVEZ",20109,480,83101,1003,"02",19,"CF33206",0,"14303",2,null,20190701,20190930,108897.49,0]
[null,"CHIHUAHUA","08DPT0011J",120,"GAGJ740328P75","GAGJ740328HCHLNR03","JORGE ARTURO GALLEGOS GONZALEZ","20109",480,83101,1003,"02",19,"CF18203",0,"9725",2,null,20190701,20190930,51841.54,0]
[null,"CHIHUAHUA","08DPT0011J",120,"GOQG650428BVA","GOQG650428MCHNNR07","GEORGINA GONZALEZ QUINTANA","20216",480,83101,1003,"02",19,"A03202",0,"9700",2,null,20190701,20190930,45637.38,0]
[null,"CHIHUAHUA","08DPT0011J",120,"GURJ541104T10","GURJ541104HCHRMS04","JESUS LUIS GUERRA RAMIREZ","20206",480,83101,1003,"02",19,"S01202",0,"9720",2,null,20190701,20190930,53107.43,0]
[null,"CHIHUAHUA","08DPT0011J",120,"HENE680323MJ1","HENE680323MCHRRL03","ELIDA HERNANDEZ NORES","20214",480,83101,1003,"02",19,"A03202",0,"9701",2,null,20190701,20190930,49896.28,0]
[null,"CHIHUAHUA","08DPT0011J",120,"LIGG8206272AA","LIGG820627HCLRRZ15","GIEZI LIRA GARCIA","20214",160,83101,1003,"02",19,"CF18203",0,"9710",2,null,20190701,20190930,50061.66,0]
[null,"CHIHUAHUA","08DPT0011J",120,"LOPO671113I30","LOPO671113HCHPRS00","OSCAR BENJAMIN LOPEZ PEREZ","20216",480,83101,1003,"02",19,"CF33206",0,"13188",2,null,20190701,20190930,132201.89999999997,0]
[null,"CHIHUAHUA","08DPT0011J",120,"MACE880915VB1","MACE880915HCHRNR04","ERICK MARTELL CONTRERAS ",20205,400,83101,1003,"02",19,"CF33204",0,"9705",2,null,20190701,20190915,47120.57,0]
[null,"CHIHUAHUA","08DPT0011J",120,"MAGI710826BY5","MAGI710826HCHRNV05","IVONNE ARACELI MARTINEZ GONZALEZ","20216",480,83101,1003,"02",19,"CF33204",0,"9699",2,null,20190701,20190930,86225.75,0]
[null,"CHIHUAHUA","08DPT0011J",120,"MAVE810424SY3","MAVE810424MCHRLL08","ELIA ZURASY MARTINEZ VELO","20206",320,83101,1003,"02",19,"S01202",0,"9738",2,null,20190701,20190930,25750.509999999995,0]
[null,"CHIHUAHUA","08DPT0011J",120,"MEGM480906839","MEGM480906HCHNNG00","MIGUEL ANGEL MENDOZA GONZALEZ","20206",480,83101,1003,"02",19,"S01201",0,"9728",2,null,20190701,20190930,36913.15,0]
[null,"CHIHUAHUA","08DPT0011J",120,"MOCY820701FR6","MOCY820701MCHRHS01","YESSENIA IVONNE MORENO CHAVEZ","20202",480,83101,1003,"02",19,"CF33206",0,"13640",2,null,20190701,20190930,118668.16000000002,0]
[null,"CHIHUAHUA","08DPT0011J",120,"OIFL620226IA5","OIFL620226MCHLLD03","LIDIA GUADALUPE OLIVAS FLORES",20102,480,83101,1003,"02",19,"CF33206",0,"14303",2,null,20190701,20190930,84634.569999999992,0]
[null,"CHIHUAHUA","08DPT0011J",120,"OESN6905137N5","OESN690513MCHRCR06","NORMA ORTEGA SCOTT","20104",480,83101,1003,"02",19,"CF33204",0,"9704",2,null,20190701,20190930,88552.499999999985,0]
[null,"CHIHUAHUA","08DPT0011J",120,"OIAA580304QJA","OIAA580304HCHRRB04","ABRAHAM ORTIZ ARMENDARIZ","20206",480,83101,1003,"02",19,"S01202",0,"9722",2,null,20190701,20190930,43965.75,0]
[null,"CHIHUAHUA","08DPT0011J",120,"ROAA860101KQ4","ROAA860101HCHCNL04","JOSE ALBERTO ROCHA ANTUNA",20206,480,83101,1003,"02",19,"CF18201",0,"9776",2,null,20190701,20190930,30554.799999999999,0]
[null,"CHIHUAHUA","08DPT0011J",120,"RUAJ680828NZ1","RUAJ680828HCHZGN01","JUAN CARLOS RUIZ AGUIRRE","20214",480,83101,1003,"02",19,"S01201",0,"9709",2,null,20190701,20190930,33059.26,0]
[null,"CHIHUAHUA","08DPT0011J",120,"SADC620717A78","SADC620717MCHLMR01","CARMEN ESTELA SALAS DOMINGUEZ",20214,480,83101,1003,"02",19,"CF33204",0,"9702",2,null,20190701,20190930,73630.91,0]
[null,"CHIHUAHUA","08DPT0011J",120,"SACG701206260","SACG701206MCHLND02","MARIA GUADALUPE SALAZAR CONTRERAS","20214",480,83101,1003,"02",19,"CF33204",0,"9730",2,null,20190701,20190930,92000.9,0]
[null,"CHIHUAHUA","08DPT0011J",121,"SAOD961029SV8","SAOD961029MCHNRN08","DIANA GUADALUPE SANDATE ORTEGA",20206,80,83101,1003,"02",19,"S01202",0,"9738",2,null,20190701,20190930,4067.22,0]
[null,"CHIHUAHUA","08DPT0011J",120,"VAAG6312036W2","VAAG631203HTSLVR03","GERARDO VALDEZ AVILA",50105,480,83101,1003,"02",19,"CF02103",0,"12652",5,null,20190701,20190930,85992.48,0]
[null,"CHIHUAHUA","08DPT0011J",120,"VILA590828MZ1","VILA590828HCHLZG06","AGUSTIN VILLAGRAN LOZOYA","20214",480,83101,1003,"02",19,"S01202",0,"9737",2,null,20190701,20190930,38763.449999999997,0]
[null,"CHIHUAHUA","08DPT0011J",120,"VIDV791004RJ0","VIDV791004MCHLRR04","VIRGINIA VILLALBA DURAN","20206",480,83101,1003,"02",19,"CF04201",0,"9696",2,null,20190701,20190930,52320.73,0]
[null,"CHIHUAHUA","08DPT0011J",120,"VIMS620916I47","VIMS620916MCHLRN00","SANDRA HORTENSIA VILLALOBOS MARIN","20214",480,83101,1003,"02",19,"CF33204",0,"2404",2,null,20190701,20190930,88510.76999999999,0]
[null,"CHIHUAHUA","08DPT0011J",120,"VIYD6702201Q6","VIYD670220MCHLXR09","DORA EMMA VILLALOBOS YAÑEZ","20214",480,83101,1003,"02",19,"A03202",0,"9695",2,null,20190701,20190930,49451.399999999994,0]
[null,"CHIHUAHUA","08DPT0011J",120,"AOAJ720609R46","AOAJ720609MCHCLS06","MARÍA DE JESÚS ACOSTA ÁLVAREZ",30102,240,83101,1001,"02",19,"E3711",20,0,3,null,20190701,20190930,25772.34,0]
[null,"CHIHUAHUA","08DPT0011J",120,"AOPA860917JK2","AOPA860917MCHCRG05","AGLAE BERENICE ACOSTA PORTILLO",30102,156,83101,1001,"02",19,"E3711",13,0,3,null,20190701,20190930,18707.82,0]
[null,"CHIHUAHUA","08DPT0011J",120,"AORC6607129B3","AORC660712HCHCMS03","CÉSAR RENÉ ACOSTA ROMO",30102,192,83101,1001,"02",19,"E3713",16,0,3,null,20190701,20190930,20615.79,0]
[null,"CHIHUAHUA","08DPT0011J",120,"AUVX671108950","AUVX671108MCHGLC09","XOCHITL MARGARITA AGUILAR VILLALOBOS",30102,240,83101,1001,"02",19,"E3725",20,0,3,null,20190701,20190930,30767.360000000001,0]
[null,"CHIHUAHUA","08DPT0011J",120,"AADF760822JB4","AADF760822MCHLML07","FLOR ANEL ALMANZA DOMÍNGUEZ",30102,216,83101,1001,"02",19,"E3725",18,0,3,null,20190701,20190930,32097.09,0]
[null,"CHIHUAHUA","08DPT0011J",120,"AADF541004UL3","AADF541004HDGLMR07","FRANCISCO ALVARADO DOMÍNGUEZ",30102,240,83101,1001,"02",19,"E3725",20,0,3,null,20190701,20190930,33991.21,0]
[null,"CHIHUAHUA","08DPT0011J",120,"AAGD820816HU2","AAGD820816MCHLTL09","DALYLA ALVARADO GUTIÉRREZ",30102,240,83101,1001,"02",19,"E3725",20,0,3,null,20190701,20190930,34641.21,0]
[null,"CHIHUAHUA","08DPT0011J",120,"AASE930324BT6","AASE930324MCHLLD02","EDITH ALVAREZ SALASAR",30102,240,83101,1001,"02",19,"E3711",20,0,3,null,20190701,20190930,25448.780000000002,0]
[null,"CHIHUAHUA","08DPT0011J",120,"AIRL900105A19","AIRL900105HCHLSS09","JOSÉ LUIS ALVÍDREZ RÍOS",30102,240,83101,1001,"02",19,"E3713",20,0,3,null,20190701,20190930,29868.280000000002,0]
[null,"CHIHUAHUA","08DPT0011J",120,"AALU670310HX2","AAXL670310HCHMXS16","LUIS CARLOS AMAYA X",30102,240,83101,1001,"02",19,"E3725",20,0,3,null,20190701,20190930,34054.28,0]
[null,"CHIHUAHUA","08DPT0011J",120,"AAAM8805014VA","AAAM880501MCHNCL02","MILDRET ARLETTE ANDRADE ACOSTA",30102,240,83101,1001,"02",19,"E3711",18,0,3,null,20190701,20190930,25769.75,0]
[null,"CHIHUAHUA","08DPT0011J",120,"AIDJ6101296Q4","AIDJ610129HCHVLS09","JESÚS HUMBERTO ÁVILA DELGADO",30102,240,83101,1001,"02",19,"E3725",20,0,3,null,20190701,20190930,31941.21,0]
[null,"CHIHUAHUA","08DPT0011J",120,"AIQC690227LQ0","AIQC690227HCHVNS05","CESAR ROGACIANO ÁVILA QUINTANA",30102,240,83101,1001,"02",19,"E3725",20,0,3,null,20190701,20190930,33991.21,0]
[null,"CHIHUAHUA","08DPT0011J",120,"BAGA570401CF3","BAGA570401HCHRNN09","ANDRÉS BARBA GÁNDARA",30102,240,83101,1001,"02",19,"E3725",20,0,3,null,20190701,20190930,32185.5,0]
[null,"CHIHUAHUA","08DPT0011J",120,"BABR540126HB4","BABR540126HCHZDL02","RAÚL GABRIEL BAEZA BEDOY",30102,240,83101,1001,"02",19,"E3725",20,0,3,null,20190701,20190930,29295.780000000002,0]
[null,"CHIHUAHUA","08DPT0011J",120,"BASZ650208NL8","BASZ650208MMCRTH02","ZHENIA PATRICIA BARRAZA STOELTING",30102,48,83101,1001,"02",19,"E3725",10,0,3,null,20190701,20190930,7330.5,0]
[null,"CHIHUAHUA","08DPT0011J",120,"BEAG740617SI1","BEAG740617MSLJRB00","MARÍA GABIELA BEJARANO ARREDONDO",30102,240,83101,1001,"02",19,"E3725",20,0,3,null,20190701,20190930,35941.21,0]
[null,"CHIHUAHUA","08DPT0011J",120,"BEML730902B28","BEML730902HCHLRS07","JOSÉ LUIS BELTRÁN MÁRQUEZ",30102,216,83101,1001,"02",19,"E3725",18,0,3,null,20190701,20190930,31447.09,0]
[null,"CHIHUAHUA","08DPT0011J",120,"BACJ820811R51","BACJ820811HCHLRN02","JUAN JOSÉ BLANCO CRUZ",30102,108,83101,1001,"02",19,"E3725",9,0,3,null,20190701,20190930,14960.479999999998,0]
[null,"CHIHUAHUA","08DPT0011J",120,"BASH700602N82","BASH700602HCHLNR08","HERNÁN BLANCO SÁENZ",30102,120,83101,1001,"02",19,"E3725",10,0,3,null,20190701,20190930,22192.18,0]
[null,"CHIHUAHUA","08DPT0011J",120,"CAHJ821204323","CAHJ821204HCHBRL07","JOEL ANTONIO CABALLERO HERNÁNDEZ",30102,216,83101,1001,"02",19,"E3725",18,0,3,null,20190701,20190930,31447.09,0]
[null,"CHIHUAHUA","08DPT0011J",120,"CADL780717DQ0","CADL780717HCHMLS06","LUIS MANUEL CAMACHO DELGADO",30102,240,83101,1001,"02",19,"E3713",20,0,3,null,20190701,20190930,29359.699999999997,0]
[null,"CHIHUAHUA","08DPT0011J",120,"CAML770621S57","CAML770621HCHRRS02","LUIS CARMONA MORA",30102,120,83101,1001,"02",19,"E3725",10,0,3,null,20190701,20190930,15970.6,0]
[null,"CHIHUAHUA","08DPT0011J",120,"CAEI831214746","CAEI831214MCHRSV05","IVETH SELENE CARO ESCUDERO",30102,240,83101,1001,"02",19,"E3713",20,0,3,null,20190701,20190930,27184.030000000002,0]
[null,"CHIHUAHUA","08DPT0011J",120,"CAGS5611036P5","CAGS561103MCHRLL06","SILVIA CARRASCO GALVÁN",30102,240,83101,1001,"02",19,"E3725",20,0,3,null,20190701,20190930,31706.57,0]
[null,"CHIHUAHUA","08DPT0011J",120,"CAVJ780821N37","CAVJ780821HCHZLS05","JESÚS MANUEL CAZARES VILLARREAL",30102,240,83101,1001,"02",19,"E3713",20,0,3,null,20190701,20190930,48726.83,0]
[null,"CHIHUAHUA","08DPT0011J",120,"CEPJ5209176A4","CEPJ520917MCLDXS03","MARÍA DE JESÚS CEDILLO PEÑA",30102,228,83101,1001,"02",19,"E3725",19,0,3,null,20190701,20190930,28285.659999999996,0]
[null,"CHIHUAHUA","08DPT0011J",120,"CACL6504048EA","CACL650404HCHHHS06","JOSÉ LUIS CHAVARRÍA CHÁVEZ",30102,216,83101,1001,"02",19,"E3725",18,0,3,null,20190701,20190930,30734.019999999997,0]
[null,"CHIHUAHUA","08DPT0011J",120,"CALM790104KB2","CALM790104HCHHPN06","MANUEL ALBERTO CHAVIRA LÓPEZ",30102,240,83101,1001,"02",19,"E3725",20,0,3,null,20190701,20190930,32356.57,0]
[null,"CHIHUAHUA","08DPT0011J",120,"CORI861010967","CORI861010HCHNVS07","ISAÚL CONTRERAS RIVERA",30102,240,83101,1001,"02",19,"E3713",20,0,3,null,20190701,20190930,29140.89,0]
[null,"CHIHUAHUA","08DPT0011J",120,"COVM710719995","COVM710719HCHRLR08","MARCO ANTONIO CORONADO VILLARREAL",30102,240,83101,1001,"02",19,"E3725",20,0,3,null,20190701,20190930,34054.28,0]
[null,"CHIHUAHUA","08DPT0011J",120,"DIVM670828475","DIVM670828HCHZQN04","MANUEL DÍAZ VAQUERA",30102,156,83101,1001,"02",19,"E3725",13,0,3,null,20190701,20190930,21348.719999999998,0]
[null,"CHIHUAHUA","08DPT0011J",120,"EICP660518T31","EICP660518MCHSRT02","PATRICIA EISSA CARRILLO",30102,180,83101,1001,"02",19,"E3725",15,0,3,null,20190701,20190930,26655.91,0]
[null,"CHIHUAHUA","08DPT0011J",120,"EIAL6904095Y1","EIAL690409MCHSLR06","LORENA MARGARITA ESPINOZA ALCALÁ",30102,240,83101,1001,"02",19,"E3725",20,0,3,null,20190701,20190930,35291.21,0]
[null,"CHIHUAHUA","08DPT0011J",120,"FOSJ7411047Y2","FOSJ741104HCHLLV00","JAVIER ARTURO FLORES SALAS",30102,108,83101,1001,"02",19,"E3725",18,0,3,null,20190701,20190930,11728.8,0]
[null,"CHIHUAHUA","08DPT0011J",120,"GAGJ7110079I6","GAGJ711007HCHBRL03","JULIÁN GABIRA DE LA GARZA",30102,240,83101,1001,"02",19,"E3725",20,0,3,null,20190701,20190930,33991.21,0]
[null,"CHIHUAHUA","08DPT0011J",120,"GALP8605195S6","GALP860519MCHRCR06","PERLA LILIANA GARCÍA LUCERO",30102,240,83101,1001,"02",19,"E3713",20,0,3,null,20190701,20190930,31026.83,0]
[null,"CHIHUAHUA","08DPT0011J",120,"GOCC7107156X6","GOCC710715MCHNHR03","CARMEN GUADALUPE GONZÁLEZ CHACÓN",30102,240,83101,1001,"02",19,"E3725",20,0,3,null,20190701,20190930,29295.780000000002,0]
[null,"CHIHUAHUA","08DPT0011J",120,"GOGJ721103UI4","GOGJ721103HCHNRL03","JULIO CESAR GONZÁLEZ GRANADOS",30102,240,83101,1001,"02",19,"E3725",20,0,3,null,20190701,20190930,35291.21,0]
[null,"CHIHUAHUA","08DPT0011J",120,"GOPS631119234","GOPS631119HCHNZX06","SIXTO HUMBERTO GONZÁLEZ PÁEZ",30102,228,83101,1001,"02",19,"E3725",19,0,3,null,20190701,20190930,32981.089999999997,0]
[null,"CHIHUAHUA","08DPT0011J",120,"GUTM700125HI4","GUTM700125MCHRRR03","MARGARITA GUARDADO TORRES",30102,204,83101,1001,"02",19,"E3725",17,0,3,null,20190701,20190930,27900.68,0]
[null,"CHIHUAHUA","08DPT0011J",120,"GUGL640702V28","GUGL640702HCHTRS02","LUIS ROGELIO GUTIÉRREZ GARCÍA",30102,240,83101,1001,"02",19,"E3725",20,0,3,null,20190701,20190930,33991.21,0]
[null,"CHIHUAHUA","08DPT0011J",120,"HECM730118LI9","HECM730118HCHRDR06","MAURICIO HERNÁNDEZ CAUDILLO",30102,156,83101,1001,"02",19,"E3725",13,0,3,null,20190701,20190930,14803.680000000002,0]
[null,"CHIHUAHUA","08DPT0011J",120,"HEOD870714897","HEOD870714MCLRLN06","DIANA HERNÁNDEZ OLIVARES",30102,216,83101,1001,"02",19,"E3725",18,0,3,null,20190701,20190930,33920.949999999997,0]
[null,"CHIHUAHUA","08DPT0011J",120,"HETC830217EB1","HETC830217MCHRRN07","CINTHIA LIZETH HERNÁNDEZ TREVIÑO",30102,228,83101,1001,"02",19,"E3725",19,0,3,null,20190701,20190930,32457.230000000003,0]
[null,"CHIHUAHUA","08DPT0011J",120,"HEDM761211T33","HEDM761211MCHRZY08","MAYRA GUADALUPE HERRERA DÍAZ",30102,216,83101,1001,"02",19,"E3725",18,0,3,null,20190701,20190930,31447.09,0]
[null,"CHIHUAHUA","08DPT0011J",120,"JAMF9503242Q6","JAMF950324MCHYRT02","FATME JANETH JAYDAR MARQUEZ ",30102,40,83101,1001,"02",19,"E3701",20,0,3,null,20190701,20190930,2631.5,0]
[null,"CHIHUAHUA","08DPT0011J",120,"JASX660321NQ4","JASX660321HZSYTM15","XAMIR JAYDAR SOTO",30102,120,83101,1001,"02",19,"E3725",10,0,3,null,20190701,20190930,21605.25,0]
[null,"CHIHUAHUA","08DPT0011J",120,"JILS7804098R3","JILS780409HCHMZR04","SERGIO ARMANDO JIMÉNEZ LOZANO",30102,240,83101,1001,"02",19,"E3713",20,0,3,null,20190701,20190930,27692.58,0]
[null,"CHIHUAHUA","08DPT0011J",120,"JISR460111595","JISR460111HBCMLY00","REYNALDO JIMÉNEZ SOLÍS",30102,32,83101,1001,"02",19,"E3725",8,0,3,null,20190701,20190930,3909.6,0]
[null,"CHIHUAHUA","08DPT0011J",120,"LEGI810812S76","LEGI810812HCHYNR04","IRVING LEYVA GONZÁLEZ",30102,228,83101,1001,"02",19,"E3725",19,0,3,null,20190701,20190930,32457.230000000003,0]
[null,"CHIHUAHUA","08DPT0011J",120,"LOGE770513DS3","LOGE770513MCHPLL01","ELENA DEL ROSARIO LÓPEZ GALAVIZ",30102,240,83101,1001,"02",19,"E3725",20,0,3,null,20190701,20190930,34117.360000000001,0]
[null,"CHIHUAHUA","08DPT0011J",120,"LUCL830421CC7","LUCL830421HCHVNS03","LUIS FERNANDO LUÉVANO CONTRERAS",30102,240,83101,1001,"02",19,"E3713",20,0,3,null,20190701,20190930,28059.699999999997,0]
[null,"CHIHUAHUA","08DPT0011J",120,"LURI7603163W9","LURI760316MCHJDR01","IRMA EMILLIA LUJAN RODRÍGUEZ",30102,240,83101,1001,"02",19,"E3713",20,0,3,null,20190701,20190930,28484.030000000002,0]
[null,"CHIHUAHUA","08DPT0011J",120,"MEFJ6010186V1","MEFJ601018HCHNNS07","JESÚS ALBERTO MENCHACA FUENTES",30102,240,83101,1001,"02",19,"E3725",20,0,3,null,20190701,20190930,34054.28,0]
[null,"CHIHUAHUA","08DPT0011J",120,"MEEJ750705D34","MEEJ750705HCHNSS02","JESÚS MENDOZA ESTEVANÉ",30102,216,83101,1001,"02",19,"E3725",18,0,3,null,20190701,20190930,31447.09,0]
[null,"CHIHUAHUA","08DPT0011J",120,"MOVI660317J46","MOXV660317HCHLXC08","VÍCTOR MANUEL MOLINAR X",30102,228,83101,1001,"02",19,"E3713",19,0,3,null,20190701,20190930,21266.230000000003,0]
[null,"CHIHUAHUA","08DPT0011J",120,"MORR640403339","MORR640403MCHNDS08","ROSARIO FLORENTINA MONTOYA RODRÍGUEZ",30102,240,83101,1001,"02",19,"E3725",20,0,3,null,20190701,20190930,35291.21,0]
[null,"CHIHUAHUA","08DPT0011J",120,"MOEC8307215B7","MOEC830721HCHRSR06","CARLOS DANIEL MORALES ESPINOZA",30102,240,83101,1001,"02",19,"E3725",20,0,3,null,20190701,20190930,33378.53,0]
[null,"CHIHUAHUA","08DPT0011J",120,"MOSV610329FQ2","MOSV610329HCHRTC06","VÍCTOR MORENO SOTO",30102,240,83101,1001,"02",19,"E3725",20,0,3,null,20190701,20190930,34641.21,0]
[null,"CHIHUAHUA","08DPT0011J",120,"MOOL690713831","MOOL690713MCHRSR07","LAURA MAGDALENA MORONES OSUNA",30102,180,83101,1001,"02",19,"E3725",15,0,3,null,20190701,20190930,26655.91,0]
[null,"CHIHUAHUA","08DPT0011J",120,"MORC720201UY4","MORC720201MCHRDL09","CLAUDIA MORONES RODRÍGUEZ",30102,216,83101,1001,"02",19,"E3725",18,0,3,null,20190701,20190930,24864.730000000003,0]
[null,"CHIHUAHUA","08DPT0011J",120,"MUNL690829H48","MUNL690829MCHXTZ04","LUZ EMILIA MUÑOZ NATIVIDAD",30102,72,83101,1001,"02",19,"E3725",12,0,3,null,20190701,20190930,10262.700000000001,0]
[null,"CHIHUAHUA","08DPT0011J",120,"NADJ630505N67","NADJ630505HCHVLN05","JUAN NAVA DELGADO",30102,240,83101,1001,"02",19,"E3725",20,0,3,null,20190701,20190930,33991.21,0]
[null,"CHIHUAHUA","08DPT0011J",120,"NAML740428B29","NAML740428MCHVRR05","LORENA IVONNE NAVA MORALES",30102,180,83101,1001,"02",19,"E3725",15,0,3,null,20190701,20190930,29653.63,0]
[null,"CHIHUAHUA","08DPT0011J",120,"MOSV610329FQ2","OOMJ610830MCHCDN00","JUANA ROSA OCHOA MADRID",30102,240,83101,1001,"02",19,"E3725",20,0,3,null,20190701,20190930,34117.360000000001,0]
[null,"CHIHUAHUA","08DPT0011J",120,"OOGI7603109Y9","OOGI760310HDGRNS08","ISIDRO OROZCO GONZÁLEZ",30102,228,83101,1001,"02",19,"E3725",19,0,3,null,20190701,20190930,33631.089999999997,0]
[null,"CHIHUAHUA","08DPT0011J",120,"OORA820321MG3","OORA820321MCHRNY08","AYDE OROZCO RENOVA",30102,240,83101,1001,"02",19,"E3725",20,0,3,null,20190701,20190930,31804.799999999999,0]
[null,"CHIHUAHUA","08DPT0011J",120,"PAMC840828GP8","PAMC840828MCHCRR08","CRISTINA PACHECO MÁRQUEZ",30102,180,83101,1001,"02",19,"E3725",15,0,3,null,20190701,20190930,26655.91,0]
[null,"CHIHUAHUA","08DPT0011J",120,"PAPA610623V58","PAPA610623HCHLXN04","ANTONIO PALACIO PIÑA",30102,168,83101,1001,"02",19,"E3725",14,0,3,null,20190701,20190930,27930.42,0]
[null,"CHIHUAHUA","08DPT0011J",120,"PEHJ6802298H5","PEHJ680229HCHRRN03","JUAN JOSÉ PÉREZ HERNÁNDEZ",30102,120,83101,1001,"02",19,"E3725",10,0,3,null,20190701,20190930,18083.68,0]
[null,"CHIHUAHUA","08DPT0011J",120,"PERM720917SD7","PERM720917MCHRMR06","MARGARITA PÉREZ RAMÍREZ",30102,96,83101,1001,"02",19,"E3725",8,0,3,null,20190701,20190930,15413.41,0]
[null,"CHIHUAHUA","08DPT0011J",120,"PADM510809SZ5","PADM510809HNTLZG08","MIGUEL ÁNGEL PLASCENCIA DÍAZ",30102,240,83101,1001,"02",19,"E3725",20,0,3,null,20190701,20190930,31688.68,0]
[null,"CHIHUAHUA","08DPT0011J",120,"QUCC800518RJ7","QUCC800518MCHZML03","CLAUDIA ROCÍO QUEZADA CAMPOYA",30102,240,83101,1001,"02",19,"E3725",20,0,3,null,20190701,20190930,27925.5,0]
[null,"CHIHUAHUA","08DPT0011J",120,"QUME830808SH6","QUME830808HCHXRR06","ERIC QUIÑONES MARIÑELARENA",30102,180,83101,1001,"02",19,"E3725",15,0,3,null,20190701,20190930,28416.7,0]
[null,"CHIHUAHUA","08DPT0011J",120,"RARR491119L95","RARR491119HPLMVB06","ROBERTO PONCIANO RAMÍREZ RIVERA",30102,240,83101,1001,"02",19,"E3725",20,0,3,null,20190701,20190930,33467.360000000001,0]
[null,"CHIHUAHUA","08DPT0011J",120,"RAHA780618377","RAHA780618HCHMRD01","ADARIK QUILEO RAMOS HERRERA",30102,204,83101,1001,"02",19,"E3725",17,0,3,null,20190701,20190930,30083.780000000002,0]
[null,"CHIHUAHUA","08DPT0011J",120,"RARL740713SN9","RARL740713MCHSYR08","LOURDES GABRIELA RASCÓN REYES",30102,240,83101,1001,"02",19,"E3725",20,0,3,null,20190701,20190930,29847.550000000003,0]
[null,"CHIHUAHUA","08DPT0011J",120,"REGJ630501KR7","REGJ630501HDFNRN07","JUAN CARLOS RENDÓN GARCÍA",30102,204,83101,1001,"02",19,"E3725",17,0,3,null,20190701,20190930,32910.82,0]
[null,"CHIHUAHUA","08DPT0011J",120,"RILA820506DD4","RILA820506HCHVCN08","ÁNGEL ARMANDO RIVERA LECHUGA",30102,204,83101,1001,"02",19,"E3713",17,0,3,null,20190701,20190930,21922.67,0]
[null,"CHIHUAHUA","08DPT0011J",120,"ROVW790131VE9","ROVW790131HCHJLL05","WILFREDO ROJO VELÁZQUEZ",30102,240,83101,1001,"02",19,"E3725",20,0,3,null,20190701,20190930,32293.5,0]
[null,"CHIHUAHUA","08DPT0011J",120,"ROHE830406P40","ROHE830406MCHMRL03","ELSA SAMANTHA ROMERO HERRERA",30102,216,83101,1001,"02",19,"E3725",18,0,3,null,20190701,20190930,31447.09,0]
[null,"CHIHUAHUA","08DPT0011J",120,"RUBJ910211L87","RUBJ910211HCHZCS01","RUIZ ESPARZA BACASEHUA JOSÉ",30102,228,83101,1001,"02",19,"E3711",19,0,3,null,20190701,20190930,27848.579999999998,0]
[null,"CHIHUAHUA","08DPT0011J",120,"RUHJ7401277YA","RUHJ740127HCHZRR00","JORGE ARTURO RUIZ HEIRAS",30102,180,83101,1001,"02",19,"E3725",15,0,3,null,20190701,20190930,28416.7,0]
[null,"CHIHUAHUA","08DPT0011J",120,"RUCJ590315LP9","RUCJ590315HZSZMS00","JOSÉ RUIZ ESPARZA CAMARENA",30102,120,83101,1001,"02",19,"E3725",10,0,3,null,20190701,20190930,21605.25,0]
[null,"CHIHUAHUA","08DPT0011J",120,"SARC670203156","SARC670203MDGLZR00","MARIA DEL CARMEN SALAS RUIZ",30102,240,83101,1001,"02",19,"E3725",20,0,3,null,20190701,20190930,35291.21,0]
[null,"CHIHUAHUA","08DPT0011J",120,"SACD640228KY5","SACD640228HCHLNN03","DANIEL JAVIER SALAZAR CONTRERAS",30102,180,83101,1001,"02",19,"E3725",15,0,3,null,20190701,20190930,24182.059999999998,0]
[null,"CHIHUAHUA","08DPT0011J",120,"SASL611115CC2","SASL611115HCHMPP00","LEOPOLDO SAMANIEGO SEPÚLVEDA",30102,240,83101,1001,"02",19,"E3725",20,0,3,null,20190701,20190930,34641.21,0]
[null,"CHIHUAHUA","08DPT0011J",120,"SAMR770614MQ5","SAMR770614MCHNRS09","ROSA SANCHEZ MORONES",30102,24,83101,1001,"02",19,"E3711",12,0,3,null,20190701,20190930,2260.8000000000002,0]
[null,"CHIHUAHUA","08DPT0011J",120,"SAPJ770502I20","SAPJ770502HCHNRV00","JAVIER SÁNCHEZ PÉREZ",30102,168,83101,1001,"02",19,"E3725",14,0,3,null,20190701,20190930,22187.279999999999,0]
[null,"CHIHUAHUA","08DPT0011J",120,"SAAS931221QZ0","SAAS931221MCHNYN09","SANDRA ITZEL SANDOVAL AYALA",30102,180,83101,1001,"02",19,"E3711",15,0,3,null,20190701,20190930,9137.7000000000007,0]
[null,"CHIHUAHUA","08DPT0011J",120,"SEVK920127JG4","SEVK920127MCHGLR02","KAREN JEMIMA SEGOVIA VILLALOBOS",30102,216,83101,1001,"02",19,"E3725",18,0,3,null,20190701,20190930,32620.949999999997,0]
[null,"CHIHUAHUA","08DPT0011J",120,"TOMG6805124B0","TOMG680512MCHRRB05","GABRIELA TORRES MORENO",30102,228,83101,1001,"02",19,"E3725",19,0,3,null,20190701,20190930,26587.94,0]
[null,"CHIHUAHUA","08DPT0011J",120,"TOPD7211138C2","TOPD721113MCHRRL03","DELIA ARMIDA TORRES PORTILLO",30102,204,83101,1001,"02",19,"E3725",17,0,3,null,20190701,20190930,30436.959999999999,0]
[null,"CHIHUAHUA","08DPT0011J",120,"TORJ640811CX6","TORJ640811HCHVVS02","JOSÉ TOVAR RIVERO",30102,228,83101,1001,"02",19,"E3725",19,0,3,null,20190701,20190930,26146.829999999998,0]
[null,"CHIHUAHUA","08DPT0011J",120,"UUIL8212152F2","UUIL821215HCHRBS02","LUIS ALBERTO URQUIDI IBARBOL",30102,240,83101,1001,"02",19,"E3725",20,0,3,null,20190701,20190930,31182.71,0]
[null,"CHIHUAHUA","08DPT0011J",120,"VAPD660401U61","VAPD660401HCHLRN00","DANIEL VALADEZ PORTILLO",30102,204,83101,1001,"02",19,"E3725",17,0,3,null,20190701,20190930,29136.959999999999,0]
[null,"CHIHUAHUA","08DPT0011J",120,"VAGB5901245Z9","VAGB590124MCHLNL07","BLANCA ESTELA VALDERRABANO GONZÁLEZ ",30102,216,83101,1001,"02",19,"E3725",18,0,3,null,20190701,20190930,32097.09,0]
[null,"CHIHUAHUA","08DPT0011J",120,"VAHJ690910EY0","VAHJ690910HCHLRM02","JAIME VALENZUELA HERNÁNDEZ",30102,240,83101,1001,"02",19,"E3725",20,0,3,null,20190701,20190930,33991.21,0]
[null,"CHIHUAHUA","08DPT0011J",120,"VAGJ670203PVA","VAGJ670203HCLLVS03","JOSÉ VALLEJO GUEVARA",30102,144,83101,1001,"02",19,"E3725",12,0,3,null,20190701,20190930,25910.160000000003,0]
[null,"CHIHUAHUA","08DPT0011J",120,"VEDL620727PL3","VEDL620727MCHGRR05","LORETO VEGA DURAN",30102,240,83101,1001,"02",19,"E3725",20,0,3,null,20190701,20190930,33467.360000000001,0]
[null,"CHIHUAHUA","08DPT0011J",120,"VEMA551027JGA","VEMA551027HCHGRR06","ARIEL VEGA MIRANDA",30102,228,83101,1001,"02",19,"E3725",19,0,3,null,20190701,20190930,33126.01,0]
[null,"CHIHUAHUA","08DPT0011J",120,"VIBH7007255V7","VIBH700725MCHDNL05","HILDA MINERVA VIDAÑA BENCOMO",30102,240,83101,1001,"02",19,"E3725",20,0,3,null,20190701,20190930,34641.21,0]
[null,"CHIHUAHUA","08DPT0011J",120,"VIPT690222SN0","VIPT690222MCHLXR04","MARIA TERESA VILLARREAL PIÑON",30102,240,83101,1001,"02",19,"E3725",20,0,3,null,20190701,20190930,20202.64,0]
[null,"CHIHUAHUA","08DPT0013H",120,"AOVP680821N74","AOVP680821MCHLLT07","PATRICIA GUADALUPE ALONSO VALENZUELA",30102,240,83101,1001,"03",23,"E3711",120,0,3,null,20190701,20190930,33066.11,0]
[null,"CHIHUAHUA","08DPT0013H",200,"AAOP870805580","AAOP870805HCHLLD04","PEDRO TOMAS ALVARADO OLIVAS",30102,192,83101,1001,"03",23,"E3711",96,0,3,null,20190701,20190930,25975.200000000004,0]
[null,"CHIHUAHUA","08DPT0013H",120,"AIBS821008VBA","AIBS821008HVZRRR09","SERGIO ARIAS BRAVO",30102,240,83101,1001,"03",23,"E3725",120,0,3,null,20190701,20190930,41990.78,0]
[null,"CHIHUAHUA","08DPT0013H",120,"BAMG8304085L6","BAMG830408MCHRRR05","GEORGINA IVETH BARRAZA MARQUEZ",30102,240,83101,1001,"03",23,"E3725",120,0,3,null,20190701,20190930,41990.78,0]
[null,"CHIHUAHUA","08DPT0013H",100,"BAMM890408B93","BAMM890408HCHSLR00","MARTIN YAHIR BASURTO MELENDEZ",30102,160,83101,1001,"03",23,"E3725",80,0,3,null,20190701,20190930,23648,0]
[null,"CHIHUAHUA","08DPT0013H",100,"BUMA741111CX0","BUMA741111MCHSNN11","ANGELICA BUSTILLOS MINJAREZ",30102,240,83101,1001,"03",23,"E3725",120,0,3,null,20190701,20190930,41990.78,0]
[null,"CHIHUAHUA","08DPT0013H",120,"BURK950212RQ2","BURK950212MCHSNR03","KARLA ESTRELLA BUSTILLOS RENDON",30102,236,83101,1001,"03",23,"E3711",118,0,3,null,20190701,20190930,32520.09,0]
[null,"CHIHUAHUA","08DPT0013H",100,"CACR890101JE8","CACR890101HCHLRN05","RENE CALDERON CARNERO",30102,240,83101,1001,"03",23,"E3725",120,0,3,null,20190701,20190930,41340.78,0]
[null,"CHIHUAHUA","08DPT0013H",100,"CAMY820713FS4","CAMY820713MCHRTR09","YURIDIA ITZEL CARDONA MATA",30102,240,83101,1001,"03",23,"E3725",120,0,3,null,20190701,20190930,41990.78,0]
[null,"CHIHUAHUA","08DPT0013H",100,"CAVE870113T2A","CAVE870113HCHRLD06","EDUARDO CARDONA VILLAGRANA",30102,240,83101,1001,"03",23,"E3725",120,0,3,null,20190701,20190930,41340.78,0]
[null,"CHIHUAHUA","08DPT0013H",120,"CECD871010N16","CECD871010HCHRSG08","DIEGO ADOLFO CERVANTES CASTILLO",30102,226,83101,1001,"03",23,"E3711",113,0,3,null,20190701,20190930,30558.300000000003,0]
[null,"CHIHUAHUA","08DPT0013H",100,"COTD9112155M3","COTD911215MCHRRN03","DENISSE ALEJANDRA CORELLA TRUJILLO",30102,240,83101,1001,"03",23,"E3725",120,0,3,null,20190701,20190930,41990.78,0]
[null,"CHIHUAHUA","08DPT0013H",100,"CIFG921107419","CIFG921107HCHRLL01","GUILLERMO CRISPIN FLORES",30102,36,83101,1001,"03",23,"E3711",18,0,3,null,20190701,20190930,5310.5,0]
[null,"CHIHUAHUA","08DPT0013H",100,"CUAL871105HE1","CUAL871105HCHRLS08","LUIS ALEJANDRO CRUZ ALVARADO",30102,240,83101,1001,"03",23,"E3713",120,0,3,null,20190701,20190930,35853.69,0]
[null,"CHIHUAHUA","08DPT0013H",100,"CUSI930610MP7","CUSI930610HTCPNS05","ISAAC ESTEBAN CUPIL SANTIAGO",30102,164,83101,1001,"03",23,"E3711",82,0,3,null,20190701,20190930,20194.18,0]
[null,"CHIHUAHUA","08DPT0013H",100,"DAGR770317JPA","DAGR770317HCLVNF02","RAFAEL DAVILA GONZALEZ",30102,48,83101,1001,"03",23,"E3711",24,0,3,null,20190701,20190930,5638.68,0]
[null,"CHIHUAHUA","08DPT0013H",120,"ROCJ811214HD5","ROCJ811214HCLSMV04","JAVIER ROLANDO DE LA ROSA CAMPOS",30102,240,83101,1001,"03",23,"E3725",120,0,3,null,20190701,20190930,41990.78,0]
[null,"CHIHUAHUA","08DPT0013H",200,"LEVD880414UB2","LEVD880414MCLNLN07","DIANA GABRIELA DE LEON VELAZQUEZ",30102,232,83101,1001,"03",23,"E3725",116,0,3,null,20190701,20190930,38620.71,0]
[null,"CHIHUAHUA","08DPT0013H",120,"DODK891025237","DODK891025MCHMMR03","KARLA KARINA DOMINGUEZ DOMINGUEZ",30102,240,83101,1001,"03",23,"E3725",120,0,3,null,20190701,20190930,41340.78,0]
[null,"CHIHUAHUA","08DPT0013H",120,"EECA8503081Q2","EECA850308HSLCRB06","ABRAHAM JACOBO ECHEVARRIA CORRALES",30102,240,83101,1001,"03",23,"E3725",120,0,3,null,20190701,20190930,41340.78,0]
[null,"CHIHUAHUA","08DPT0013H",120,"EISC871230RT1","EISC871230MCHSNR08","CAROLINA ESPINOZA DE SANTIAGO",30102,240,83101,1001,"03",23,"E3713",120,0,3,null,20190701,20190930,36285.089999999997,0]
[null,"CHIHUAHUA","08DPT0013H",200,"FOLM7810127Q9","FOLM781012HCHLYG02","MIGUEL ANGEL FLORES LEYVA",30102,240,83101,1001,"03",23,"E3713",120,0,3,null,20190701,20190930,32362.68,0]
[null,"CHIHUAHUA","08DPT0013H",120,"GAOR680723LM5","GAOR680723HCHLRC05","RICARDO RAUL GALARZA ORTEGA",30102,240,83101,1001,"03",23,"E3713",120,0,3,null,20190701,20190930,36285.089999999997,0]
[null,"CHIHUAHUA","08DPT0013H",120,"GARS970720IY4","GARS970720MCHRDN02","SONIA YANIRA GARCIA RODRIGUEZ",30102,96,83101,1001,"03",23,"E3711",48,0,3,null,20190701,20190930,11277.289999999999,0]
[null,"CHIHUAHUA","08DPT0013H",200,"GONJ870317J36","GONJ870317MVZMCN02","JENNY PATRICIA GOMEZ NICIDA",30102,240,83101,1001,"03",23,"E3711",120,0,3,null,20190701,20190930,32416.11,0]
[null,"CHIHUAHUA","08DPT0013H",120,"GOHD860913N63","GOHD860913MCLNRL08","DALIA LIBERTAD GONZALEZ HERNANDEZ",30102,240,83101,1001,"03",23,"E3701",120,0,3,null,20190701,20190930,24752.43,0]
[null,"CHIHUAHUA","08DPT0013H",120,"GOMA820909QV4","GOMA820909MCHNRD09","ADRIANA GONZALEZ MARQUEZ",30102,240,83101,1001,"03",23,"E3725",120,0,3,null,20190701,20190930,41990.78,0]
[null,"CHIHUAHUA","08DPT0013H",100,"GORR890405IP7","GORR890405HCHNMY01","RAYMUNDO RAMIREZ GONZALEZ",30102,240,83101,1001,"03",23,"E3725",120,0,3,null,20190701,20190930,41340.78,0]
[null,"CHIHUAHUA","08DPT0013H",200,"GUCD860131S71","GUCD860131HCHRLV06","JOSE DAVID GUERRERO CALLEROS",30102,232,83101,1001,"03",23,"E3713",116,0,3,null,20190701,20190930,34486.92,0]
[null,"CHIHUAHUA","08DPT0013H",100,"GUMG891202IP6","GUMG891202MCHTRR04","GRECIA REYNA GUTIERREZ MARRUFO",30102,228,83101,1001,"03",23,"E3713",114,0,3,null,20190701,20190930,35255.870000000003,0]
[null,"CHIHUAHUA","08DPT0013H",200,"HEAN911008UH6","HEAN911008MCHRLN03","NANCY ELIZABETH HEREDIA ALVARADO",30102,240,83101,1001,"03",23,"E3711",120,0,3,null,20190701,20190930,32416.11,0]
[null,"CHIHUAHUA","08DPT0013H",100,"HEAL6501012W6","HEAL650101HCHRRR04","LORENZO HERNANDEZ ARMENTA",30102,240,83101,1001,"03",23,"E3725",120,0,3,null,20190701,20190930,40690.78,0]
[null,"CHIHUAHUA","08DPT0013H",100,"HEPM870418QNA","HEPM870418MDFRRR08","MARY CARMEN HERNANDEZ PERALES",30102,240,83101,1001,"03",23,"E3725",120,0,3,null,20190701,20190930,40690.78,0]
[null,"CHIHUAHUA","08DPT0013H",100,"IAVJ901113B56","IAVJ901113HVZXRL02","JULIO CESAR IXBA VARGAS",30102,160,83101,1001,"03",23,"E3725",80,0,3,null,20190701,20190930,26348,0]
[null,"CHIHUAHUA","08DPT0013H",100,"JUAS860801FD3","JUAS860801MCHRLL00","SILVIA ANGELICA JUAREZ ALVARADO",30102,240,83101,1001,"03",23,"E3725",120,0,3,null,20190701,20190930,41990.78,0]
[null,"CHIHUAHUA","08DPT0013H",200,"LINM5608318QA","LINM560731HDFVTG06","MIGUEL ARTURO LIEVANO NORMAN",30102,224,83101,1001,"03",23,"E3711",112,0,3,null,20190701,20190930,30536.57,0]
[null,"CHIHUAHUA","08DPT0013H",200,"LOMR7805084Z7","LOMR780508HCHRNL09","RAUL ERNESTO LOERA MONARREZ",30102,240,83101,1001,"03",23,"E3725",120,0,3,null,20190701,20190930,41340.78,0]
[null,"CHIHUAHUA","08DPT0013H",200,"LOAA850515Q46","LOAA850515HCHPRL03","ALEJANDRO LOPEZ ARMENDARIZ",30102,240,83101,1001,"03",23,"E3713",120,0,3,null,20190701,20190930,36285.089999999997,0]
[null,"CHIHUAHUA","08DPT0013H",120,"LOCS771008517","LOCS771008HCHPRR09","SERGIO LOPEZ DE LA CRUZ",30102,240,83101,1001,"03",23,"E3725",120,0,3,null,20190701,20190930,41340.78,0]
[null,"CHIHUAHUA","08DPT0013H",200,"MAGT901211DE9","MAGT901211MCHLNH09","THANIA GUADALUPE MALDONADO GONZALEZ",30102,240,83101,1001,"03",23,"E3725",120,0,3,null,20190701,20190930,41990.78,0]
[null,"CHIHUAHUA","08DPT0013H",200,"MAGC661008FYA","MAGC661008HCHRNN09","CANDELARIO MARTINEZ GONZALEZ",30102,240,83101,1001,"03",23,"E3725",120,0,3,null,20190701,20190930,41990.78,0]
[null,"CHIHUAHUA","08DPT0013H",120,"MEMO900505E38","MEMO900505HCHDJM04","OMAR ALONSO MEDINA MUJICA",30102,80,83101,1001,"03",23,"E3711",40,0,3,null,20190701,20190930,11793,0]
[null,"CHIHUAHUA","08DPT0013H",100,"METJ941115RJ7","METJ941115MCHDNN07","JENIFFER MEDINA TUNCHEZ",30102,224,83101,1001,"03",23,"E3711",112,0,3,null,20190701,20190930,30536.57,0]
[null,"CHIHUAHUA","08DPT0013H",200,"MUSF8807088K7","MUSF880708HCHRLR03","FRANCISCO JAVIER MURILLO SALAZAR",30102,240,83101,1001,"03",23,"E3711",120,0,3,null,20190701,20190930,31766.11,0]
[null,"CHIHUAHUA","08DPT0013H",100,"NARM960112JC1","NARM960112HCHVMB02","MOAB DANIEL NAVARRO RAMIREZ",30102,80,83101,1001,"03",23,"E3711",40,0,3,null,20190701,20190930,9397.7999999999993,0]
[null,"CHIHUAHUA","08DPT0013H",200,"OISE771121RD9","OISE771121HCHLNL07","ELIAS HERIBERTO OLIVAS SAENZ",30102,240,83101,1001,"03",23,"E3713",120,0,3,null,20190701,20190930,35635.089999999997,0]
[null,"CHIHUAHUA","08DPT0013H",120,"OISM951129R68","OISM951129MCHRLC03","MICHELLE ALEJANDRA ORTIZ SILVA",30102,236,83101,1001,"03",23,"E3701",118,0,3,null,20190701,20190930,24952,0]
[null,"CHIHUAHUA","08DPT0013H",120,"PEKC800825AD4","PEKC800825HCHRLH02","CHRISTIAN PEREZ KLAPEZ",30102,80,83101,1001,"03",23,"E3711",40,0,3,null,20190701,20190930,9093,0]
[null,"CHIHUAHUA","08DPT0013H",100,"POGD861005KA6","POGD861005MCHRMN00","DANIELA PORRAS GOMEZ",30102,240,83101,1001,"03",23,"E3725",120,0,3,null,20190701,20190930,41990.78,0]
[null,"CHIHUAHUA","08DPT0013H",120,"PUZM810413GK5","PUZM810413HDGNPN02","MANUEL ANTONIO PUENTE ZAPATA",30102,212,83101,1001,"03",23,"E3725",106,0,3,null,20190701,20190930,36667.629999999997,0]
[null,"CHIHUAHUA","08DPT0013H",120,"PUYR780420I72","PUYR780420MMCLXC00","ROCIO PULIDO YAÑEZ",30102,240,83101,1001,"03",23,"E3725",120,0,3,null,20190701,20190930,41990.78,0]
[null,"CHIHUAHUA","08DPT0013H",100,"QUPK7804119NA","QUPK780411MSRVRR11","KARLA LIZETTE  QUEVEDO PRECIADO",30102,240,83101,1001,"03",23,"E3725",120,0,3,null,20190701,20190930,41990.78,0]
[null,"CHIHUAHUA","08DPT0013H",120,"RESJ851201GQ9","RESJ851201HCHVPV07","JAVIER EDUARDO  REVELES SAPIEN",30102,240,83101,1001,"03",23,"E3725",120,0,3,null,20190701,20190930,41990.78,0]
[null,"CHIHUAHUA","08DPT0013H",200,"ROGM9209304F8","ROGM920930HMCDLG05","MIGUEL ANGEL RODRIGUEZ GALVAN",30102,240,83101,1001,"03",23,"E3711",120,0,3,null,20190701,20190930,29716.11,0]
[null,"CHIHUAHUA","08DPT0013H",120,"ROVC550831794","ROVC550831MQTDLN04","CONCEPCION ROSARIO RODRIGUEZ VALDIVIELSO",30102,224,83101,1001,"03",23,"E3711",112,0,3,null,20190701,20190930,26770.41,0]
[null,"CHIHUAHUA","08DPT0013H",200,"RORE881219EW3","RORE881219HVZJYR07","ERNESTO IVAN ROJAS REYES",30102,240,83101,1001,"03",23,"E3711",120,0,3,null,20190701,20190930,32416.11,0]
[null,"CHIHUAHUA","08DPT0013H",200,"SASG860316EQ4","SASG860316HCHNNN09","GENARO ALONSO SAENZ SAENZ",30102,232,83101,1001,"03",23,"E3701",116,0,3,null,20190701,20190930,24055.03,0]
[null,"CHIHUAHUA","08DPT0013H",200,"SACR870225HZ8","SACR870225HCHLLB02","ROBERTO ISMAEL SALAZAR CALDERA",30102,240,83101,1001,"03",23,"E3725",120,0,3,null,20190701,20190930,40690.78,0]
[null,"CHIHUAHUA","08DPT0013H",200,"SACE740906S3A","SACE740906HCLLMN05","ENRIQUE  SALAZAR CAMPOS",30102,240,83101,1001,"03",23,"E3725",120,0,3,null,20190701,20190930,38640.78,0]
[null,"CHIHUAHUA","08DPT0013H",120,"SARC911030SC8","SARC911030HCHLMR00","CARLOS SALGADO ROMO",30102,240,83101,1001,"03",23,"E3713",120,0,3,null,20190701,20190930,35635.089999999997,0]
[null,"CHIHUAHUA","08DPT0013H",100,"SESU611116K12","SESU611116HDFGRL05","ULISES SEGURA SIERRA",30102,240,83101,1001,"03",23,"E3701",120,0,3,null,20190701,20190930,24752.43,0]
[null,"CHIHUAHUA","08DPT0013H",120,"SIER8905149W5","SIER890514MCHGSS03","ROSA SELENE SIGALA ESQUIVEL",30102,240,83101,1001,"03",23,"E3725",120,0,3,null,20190701,20190930,41340.78,0]
[null,"CHIHUAHUA","08DPT0013H",120,"SORD901011B33","SORD901011MCHLSN01","DIANA BELEN SOLIS RIOS",30102,120,83101,1001,"03",23,"E3711",60,0,3,null,20190701,20190930,14096.61,0]
[null,"CHIHUAHUA","08DPT0013H",100,"SORR740817E88","SORR740817HCHSDC09","RICARDO SOSA RODRIGUEZ",30102,240,83101,1001,"03",23,"E3725",120,0,3,null,20190701,20190930,41340.78,0]
[null,"CHIHUAHUA","08DPT0013H",100,"TECI630106UW7","TECI630106MDFLBS09","MARIA ISABEL TELLEZ GIRON COBOS",30102,240,83101,1001,"03",23,"E3713",120,0,3,null,20190701,20190930,36935.089999999997,0]
[null,"CHIHUAHUA","08DPT0013H",120,"TORR840104UJ5","TORR840104MCHRMQ05","RAQUEL IVETTE TORRES RAMIREZ",30102,240,83101,1001,"03",23,"E3725",120,0,3,null,20190701,20190930,41340.78,0]
[null,"CHIHUAHUA","08DPT0013H",120,"UUMM850610TB5","UUMM850610HCHNNN02","MANUEL EDUARDO UNZUETA MONTES",30102,228,83101,1001,"03",23,"E3713",114,0,3,null,20190701,20190930,35066.49,0]
[null,"CHIHUAHUA","08DPT0013H",100,"VATB930812JK4","VATB930812MCHLRR05","BRENDA SUJEY VALADEZ TRUJILLO",30102,240,83101,1001,"03",23,"E3713",120,0,3,null,20190701,20190930,36935.089999999997,0]
[null,"CHIHUAHUA","08DPT0013H",100,"VEPS7608116K0","VEPS760811MCHLBS04","SUSANA ADRIANA VELAZQUEZ POBLANO",30102,240,83101,1001,"03",23,"E3725",120,0,3,null,20190701,20190930,41340.78,0]
[null,"CHIHUAHUA","08DPT0013H",200,"VIPL700512EU4","VIPL700512HCHDRS00","JOSE LUIS VIDAÑA PEREZ",30102,120,83101,1001,"03",23,"E3725",60,0,3,null,20190701,20190930,21370.39,0]
[null,"CHIHUAHUA","08DPT0013H",120,"AOVP680821N74","AOVP680821MCHLLT07","PATRICIA GUADALUPE ALONSO VALENZUELA","20212","480.0",83101,1003,"03",23,"T05801","00.0",0,2,"0512019",20190701,20190930,24895.5,0]
[null,"CHIHUAHUA","08DPT0013H",120,"AIBS821008VBA","AIBS821008HVZRRR09","SERGIO ARIAS BRAVO","20101","480.0",83101,1003,"03",23,"CF33206","00.0",0,2,"0522019",20190701,20190930,75911.87999999999,0]
[null,"CHIHUAHUA","08DPT0013H",120,"CURA8608053U4","CURA860805HCHRDB09","ABEL CRUZ RODRIGUEZ","20206","480.0",83101,1003,"03",23,"ED0280","00.0",0,2,"0532019",20190701,20190930,8298.5,0]
[null,"CHIHUAHUA","08DPT0013H",120,"ROLF551203KHA","ROLF551203HCLSRR07","FRANCISCO JAVIER DE LA ROSA LIRA","20401","480.0",83101,1003,"03",23,"S01201","00.0",0,2,"0542019",20190701,20190930,21088.920000000002,0]
[null,"CHIHUAHUA","08DPT0013H",120,"DODK891025237","DODK891025MCHMMR03","KARLA KARINA DOMINGUEZ DOMINGUEZ","20207","480.0",83101,1003,"03",23,"CF33204","00.0",0,2,"0552019",20190701,20190930,42218.22,0]
[null,"CHIHUAHUA","08DPT0013H",120,"EECA8503081Q2","EECA850308HSLCRB06","ABRAHAM JACOBO ECHEVARRIA CORRALES","20202","480.0",83101,1003,"03",23,"CF33204","00.0",0,2,"0562019",20190701,20190930,42218.22,0]
[null,"CHIHUAHUA","08DPT0013H",120,"EAGJ991008R37","EAGJ991008MCHSZS02","JESSICA LIZBETH ESCAÑUELAS GUZMAN","20201","480.0",83101,1003,"03",23,"CF33203","00.0",0,2,"0572019",20190701,20190930,27835.620000000003,0]
[null,"CHIHUAHUA","08DPT0013H",120,"EISC871230RT1","EISC871230MCHSNR08","CAROLINA ESPINOZA DE SANTIAGO","20206","480.0",83101,1003,"03",23,"ED0280","00.0",0,2,"0772019",20190801,20190930,24256.84,0]
[null,"CHIHUAHUA","08DPT0013H",120,"GAEH930405EV6","GAEH930405HCHRSC05","HECTOR RICARDO GARCIA  ESPINOZA","20302","480.0",83101,1003,"03",23,"S01202","00.0",0,2,"0592019",20190701,20190930,22979.519999999997,0]
[null,"CHIHUAHUA","08DPT0013H",120,"GOHD860913N63","GOHD860913MCLNRL08","DALIA LIBERTAD GONZALEZ HERNANDEZ","20206","480.0",83101,1003,"03",23,"CF33204","00.0",0,2,"0602019",20190701,20190930,42218.22,0]
[null,"CHIHUAHUA","08DPT0013H",120,"HEAC5605024W8","HEAC560502HTCRRR19","JOSE CRUZ HERNANDEZ ARA","20402","480.0",83101,1003,"03",23,"S01201","00.0",0,2,"0612019",20190701,20190930,21088.920000000002,0]
[null,"CHIHUAHUA","08DPT0013H",120,"JUAS860801FD3","JUAS860801MCHRLL00","SILVIA ANGELICA JUAREZ ALVARADO","20214","480.0",83101,1003,"03",23,"CF33204","00.0",0,2,"0622019",20190701,20190730,14072.74,0]
[null,"CHIHUAHUA","08DPT0013H",120,"LOCS771008517","LOCS771008HCHPRR09","SERGIO LOPEZ  DE LA CRUZ","20104","480.0",83101,1003,"03",23,"CF33206","00.0",0,2,"0632019",20190701,20190930,75911.87999999999,0]
[null,"CHIHUAHUA","08DPT0013H",120,"NEAA910928HC9","NEAA910928HCHGCN09","ANTONIO NEGRETE ACOSTA","20214","480.0",83101,1003,"03",23,"S01201","00.0",0,2,"0782019",20190801,20190930,14059.28,0]
[null,"CHIHUAHUA","08DPT0013H",120,"OIFM6211126H4","OIFM621112MDGLLR07","MARTHA ELENA OLIVAS FLORES","20206","480.0",83101,1003,"03",23,"S01201","00.0",0,2,"0792019",20190801,20190930,14059.28,0]
[null,"CHIHUAHUA","08DPT0013H",120,"OISM951129R68","OISM951129MCHRLC03","MICHELLE ALEJANDRA ORTIZ SILVA","20214","480.0",83101,1003,"03",23,"S01202","00.0",0,2,"0802019",20190801,20190930,22349.519999999997,0]
[null,"CHIHUAHUA","08DPT0013H",120,"PAVS900926C55","PAVS900926MVZDZN02","SANDY YUNUEN PADILLA VAZQUEZ","20214","480.0",83101,1003,"03",23,"CF33204","00.0",0,2,"0812019",20190801,20190930,35805.32,0]
[null,"CHIHUAHUA","08DPT0013H",120,"PUYR780420I72","PUYR780420MMCLXC00","ROCIO PULIDO  YAÑEZ","20101","480.0",83101,1003,"03",23,"CF33206","00.0",0,2,"0662019",20190701,20190930,75911.87999999999,0]
[null,"CHIHUAHUA","08DPT0013H",120,"RESJ851201GQ9","RESJ851201HCHVPV07","JAVIER EDUARDO REVELES  SAPIEN","20101","480.0",83101,1003,"03",23,"CF33206","00.0",0,2,"0672019",20190701,20190930,75911.87999999999,0]
[null,"CHIHUAHUA","08DPT0013H",120,"RICJ981124TJ7","RICJ981124HCHSVS02","JESUS RAYMUNDO RIOS COVARRUBIAS","20302","480.0",83101,1003,"03",23,"S01202","00.0",0,2,"0682019",20190701,20190930,22979.519999999997,0]
[null,"CHIHUAHUA","08DPT0013H",120,"ROES970521Q99","ROES970521MCHDSN09","SINAI CAROLINA RODRIGUEZ ESTRADA","20206","480.0",83101,1003,"03",23,"S01202","00.0",0,2,"0822019",20190701,20190930,22349.32,0]
[null,"CHIHUAHUA","08DPT0013H",120,"RUMJ670308JU5","RUMJ670308HSPBRN01","JUAN RUBIO MARTINEZ","20401","480.0",83101,1003,"03",23,"S01201","00.0",0,2,"0702019",20190701,20190930,21088.920000000002,0]
[null,"CHIHUAHUA","08DPT0013H",120,"SARC911030SC8","SARC911030HCHLMR00","CARLOS SALGADO  ROMO","20205","480.0",83101,1003,"03",23,"CF33204","00.0",0,2,"0712019",20190701,20190930,42218.22,0]
[null,"CHIHUAHUA","08DPT0013H",120,"SAVS980512N44","SAVS980512MCHVLR08","SARAH INES SAAVEDRA VILLEGAS","20206","480.0",83101,1003,"03",23,"S01201","00.0",0,2,"0722019",20190701,20190930,21088.920000000002,0]
[null,"CHIHUAHUA","08DPT0013H",120,"SIER8905149W5","SIER890514MCHGSS03","ROSA SELENE SIGALA ESQUIVEL","20203","480.0",83101,1003,"03",23,"CF33204","00.0",0,2,"0732019",20190701,20190930,42218.22,0]
[null,"CHIHUAHUA","08DPT0013H",120,"TORE8012234Y9","TORE801223HNTPYD08","EDGAR TOPETE REYES","20207","480.0",83101,1003,"03",23,"S01202","00.0",0,2,"0742019",20190701,20190930,22979.519999999997,0]
[null,"CHIHUAHUA","08DPT0013H",120,"TORR840104UJ5","TORR840104MCHRMQ05","RAQUEL IVETTE TORRES RAMIREZ","20206","480.0",83101,1003,"03",23,"CF33204","00.0",0,2,"0752019",20190701,20190930,42218.22,0]
[null,"CHIHUAHUA","08DPT0013H",120,"UUMM850610TB5","UUMM850610HCHNNN02","MANUEL EDUARDO UNZUETA MORALES","20206","480.0",83101,1003,"03",23,"ED0280","00.0",0,2,"0762019",20190701,20190930,24895.5,0]
[null,"CHIHUAHUA","00XXX0000X",124,"LIAL810304JK3","LIAL810304MCHCRL00","LILIANA LICON ARAGONEZ",50301,480,83101,1003,"07","04","CF11102",0,10994,5,0,20190701,20190930,100611.18,0]
[null,"CHIHUAHUA","00XXX0000X",124,"BUAC8304198K9","BUAC830419MCHNGY03","CYNTHIA IRENE BUENO AGUIRRE",50703,240,83101,1003,"07","04","CF01601",0,10993,5,0,20190701,20190930,33229.949999999997,0]
[null,"CHIHUAHUA","00XXX0000X",124,"CATC7205274V8","CATC720527HCHNRR09","CARLOS CANO TORRES",20303,480,83101,1003,"07","04","CF33204",0,10990,2,0,20190701,20190930,108391.78,0]
[null,"CHIHUAHUA","00XXX0000X",124,"EATH590728P67","EATH590728HCHSRG00","HUGO ESNAYRA TRISTAN",50705,240,83101,1003,"07","04","CF01601",0,10992,5,0,20190701,20190815,33229.949999999997,0]
[null,"CHIHUAHUA","00XXX0000X",124,"GOMD671113QD6","GOMD671113HCHMRG03","DIEGO RAUL GOMEZ MARTINEZ",20303,480,83101,1003,"07","04","CF33204",0,11820,2,0,20190701,20190930,101599.6,0]
[null,"CHIHUAHUA","00XXX0000X",124,"MONL710121CT7","MONL710121MSLGVR08","LORENA INES MOGUEL NOVELO",50703,240,83101,1003,"07","04","CF01601",0,10993,5,0,20190701,20190815,33229.949999999997,0]
[null,"CHIHUAHUA","00XXX0000X",124,"MOHB751008LK5","MOHB751008MMNNRL03","BLANCA ESTELA MONTAÑEZ HERNANDEZ",20201,480,83101,1003,"07","04","CF33204",0,10999,2,0,20190701,20190930,86477.64,0]
[null,"CHIHUAHUA","00XXX0000X",124,"PALU750621U84","PAXL750621HCHLXS05","LUIS ENRIQUE PALACIOS",20303,480,83101,1003,"07","04","CF33204",0,10995,2,0,20190701,20190930,92830.7,0]
[null,"CHIHUAHUA","00XXX0000X",124,"QUEG630216GA8","QUEG630216MCHXSR02","GRACIELA QUIÑONEZ ESTRADA",50704,480,83101,1003,"07","04","CF01601",0,11822,5,0,20190701,20190930,66459.899999999994,0]
[null,"CHIHUAHUA","00XXX0000X",124,"SAWV80120227A","SAWV801202MCLNLV05","VIVIANA SANCHEZ WILLIAMS",50201,480,83101,1003,"07","04","CF01601",0,11000,5,0,20190701,20190930,66459.899999999994,0]
[null,"CHIHUAHUA","00XXX0000X",124,"VARM7910137D6","VARM791013MCHLMR03","MARISOL VALLES RAMOS",20206,480,83101,1003,"07","04","CF33204",0,11819,2,0,20190701,20190930,90857.65,0]
[null,"CHIHUAHUA","00XXX0000X",124,"AOCF590913PU5","AOCF590913HCHCNL08","FLAVIO FILOMENO ACOSTA CANO DE LOS RIOS","50201",480,83101,1003,"05","12","CF11100",0,10166,5,0,20190701,20190930,236416.25999999998,0]
[null,"CHIHUAHUA","00XXX0000X",124,"AAGE900717365","AAGE900717MCHZZL09","ELIZABETH AZAETA GUZMAN","20215",480,83101,1003,"05","12","CF34201",0,9729,2,0,20190701,20190930,40108.460000000006,0]
[null,"CHIHUAHUA","00XXX0000X",124,"CAMH8103197WA","CAMH810319HCHRRG06","HUGO ALBERTO CARMONA MORA","50608",480,83101,1003,"05","12","CF02100",0,12457,5,0,20190701,20190930,75764.28,0]
[null,"CHIHUAHUA","00XXX0000X",124,"DEMS680803PI5","DEMS680803MCHLXN06","SANDRA DELGADO MUÑOZ","20109",480,83101,1003,"05","12","CF33206",0,13183,2,0,20190701,20190930,99730.72,0]
[null,"CHIHUAHUA","00XXX0000X",124,"DUCD810810J24","DUCD810810MCHRRN06","DANISSA DURAN CARO","20201",480,83101,1003,"05","12","CF33204",0,13186,2,0,20190701,20190930,94315.55,0]
[null,"CHIHUAHUA","00XXX0000X",124,"FEPD840911LH2","FEPD840911MCHRZN04","DENISSE JANETT FERNANDEZ PAEZ",20203,240,83101,1003,"05","12","CF33204",0,"9714",2,0,20190701,20190930,69919.900000000009,0]
[null,"CHIHUAHUA","00XXX0000X",124,"GACS670112I53","GACS670112MCHRHN02","SANDRA MARGARITA GARCIA CHAVEZ","20109",480,83101,1003,"05","12","CF33206",0,14136,2,0,20190701,20190930,122292.33999999998,0]
[null,"CHIHUAHUA","00XXX0000X",124,"GARG760607HY8","GARG760607HCHSMS07","GUSTAVO ALONSO GASCA RAMIREZ ",50201,480,83101,1003,"05","12","CF02100",0,10166,5,0,20190701,20190930,75764.28,0]
[null,"CHIHUAHUA","00XXX0000X",124,"LAAC860420JE7","LAAC860420MCHBPL04","CLAUDIA PATRICIA LABRADO APARICIO","20201",480,83101,1003,"05","12","CF34205",0,10163,2,0,20190701,20190930,76219.010000000009,0]
[null,"CHIHUAHUA","00XXX0000X",124,"LORC551120FV3","LORC551120HCHYDR08","CARLOS JAVIER LOYA RODRIGUEZ",50609,240,83101,1003,"05","12","CF02100",0,"12456",5,0,20190816,20190930,37882.14,0]
[null,"CHIHUAHUA","00XXX0000X",124,"MOSF7009259L5","MOSF700925HCHRTR02","FERNANDO ALBERTO MORA SOTO","20109",480,83101,1003,"05","12","CF33206",0,10160,2,0,20190701,20190930,130389.70999999999,0]
[null,"CHIHUAHUA","00XXX0000X",124,"PAMA800623I22","PAMA800623MDGDRL02","PADILLA MARQUEZ ALICIA","20101",480,83101,1003,"05","12","CF33204",0,2413,2,0,20190701,20190930,74372.75,0]
[null,"CHIHUAHUA","00XXX0000X",124,"PEGC781114HZ3","PEGC781114HCHRRS06","CESAR VALENTE PEREA GARCIA ","20202",480,83101,1003,"05","12","S01202",0,9718,2,0,20190701,20190930,34414.82,0]
[null,"CHIHUAHUA","00XXX0000X",124,"RAMJ770419E96","RAMJ770419HSPMRS01","JESUS ALFONSO RAMIREZ MARRUFO","20201",480,83101,1003,"05","12","CF33204",0,8024,2,0,20190701,20190930,77394.789999999994,0]
[null,"CHIHUAHUA","00XXX0000X",124,"REVB701115KRA","REVB701115MCHGTH02","BHERDINA REGALADO VITELA",20207,480,83101,1003,"05","12","CF33204",0,9333,2,0,20190701,20190930,88124.959999999992,0]
[null,"CHIHUAHUA","00XXX0000X",124,"ROMF8411116Z4","ROMF841111MCHJXR01","FARINA ROJAS MUÑOZ","20201",480,83101,1003,"05","12","ED01201",0,11615,2,0,20190701,20190930,40827.009999999995,0]
[null,"CHIHUAHUA","00XXX0000X",124,"SACP740829IP4","SACP740829MCHLNL05","PILAR ALICIA SALAZAR CONTRERAS",20214,480,83101,1003,"05","12","T08201",0,11845,2,0,20190701,20190930,54201.37,0]
[null,"CHIHUAHUA","00XXX0000X",124,"SIRS640927FF8","SIRS640927MCHLDL09","SILVIA SILVA RODRIGUEZ ","20104",480,83101,1003,"05","12","CF33206",0,14135,2,0,20190701,20190930,138672.98000000001,0]
[null,"CHIHUAHUA","00XXX0000X",124,"VARS761230AZ5","VARS761230MCHLML03","VALENZUELA RAMIREZ SILVIA CAROLINA",20215,480,83101,1003,"05","12","ED01201",0,11615,2,0,20190701,20190930,50627.450000000004,0]
[null,"CHIHUAHUA","00XXX0000X",124,"VAGP6007013D4","VAGP600701MCHLNT09","PATRICIA RAQUEL VALVERDE GONZALEZ","20105",480,83101,1003,"05","12","CF33206",0,10165,2,0,20190701,20190930,122538.62,0]
[null,"CHIHUAHUA","00XXX0000X",124,"RAPE620309J41","RAPE620309HCHYRN08","ENRIQUE RAY PORTILLO",20201,480,83101,1003,"05","12","CF33206",0,10164,2,0,20190701,20190930,63925.2,0]
[null,"Total Personas : ",null,851,null,null,null,null,null,null,null,null,null,"Total Plazas : ",null,243,null,null,"Total Pto. Federal",null,{"$f":"SUM(Tabla12[Columna20])","v":34153907.429200888}]
[]
[null,null,null,null,null,null,null,null,null,null,null,null,null,null,null,null,null,null,"Total Ppto. Otras Fuentes:",null,null,{"$f":"SUM(V16:V868)","v":0}]
[]
[null,"*Total de Percepciones reportadas por la Entidad Federativa como pagadas al trabajador durante la comisión."]
[null,"Fuente : Información proporcionada por las Entidades Federativas"]

{"sheet":"II D) 2","index":7,"n_rows":76,"n_cols":19,"rows_kept":76,"cut":false,"hidden":false,"merged":[[11,16,12,16],[11,15,12,15],[11,17,12,17],[11,18,12,18],[11,6,11,12],[11,13,12,13],[11,14,12,14],[8,1,8,9],[11,0,12,0],[11,1,12,1],[11,5,12,5],[11,2,12,2],[11,3,12,3],[11,4,12,4]]}
[]
[]
[]
[]
[]
[]
[]
[null,"Formato: Movimientos de Plazas"]
[null,{"$f":"IF('1'!D22=\"Elige el Periodo…\",\"\",'1'!D22)","v":"Fondo de Aportaciones para la Educación Tecnológica y de Adultos/Colegio Nacional de Educación Profesional Técnica (FAETA/CONALEP)"},null,null,null,null,null,null,null,null,null,null,null,null,null,null,null,"3er. Trimestre 2019"]
[]
[]
[null,"Entidad Federativa","RFC","CURP","Nombre","Origen Presupuestal\n de la plazas","Clave Presupuestal",null,null,null,null,null,null,"Clave de nivel de puesto","Clave de nivel de sueldo","Zona Económica","Tipo de movimiento","Quincena Inicial","Quincena Final"]
[null,null,null,null,null,null,"Partida Presupuestal","Código de Pago","Clave de Unidad","Clave de Sub Unidad","Clave de Categoría","Horas Semana Mes ","Número de Plaza"]
[]
[null,"Entidad Federativa","RFC","CURP","Nombbre","Origen Presupuestal\n de la plazas","Partida Presupuestal","Código de Pago","Clave de Unidad","Clave de Sub Unidad","Clave de Categoría","Horas semana mes","Número de plaza","Clave de nivel de puesto","Clave de nivel de sueldo","Zona Económica","Tipo de movimiento","Quincena Inicial","Quincena Final"]
[null,"CHIHUAHUA","ROAA860101KQ4","ROAA860101HCHCNL04  ","JOSE ALBERTO ROCHA ANTUNA","8310110030219CF1820100.09720",83101,1003,"02","19","CF18201","00.0",9720,27,"N02","A",1,201907,999999]
[null,"CHIHUAHUA","ROGJ660820EP3","ROGJ660820HCHDNN02  ","JOSE JUAN RODRIGUEZ GONZALEZ","8310110030208S0120100.02431",83101,1003,"02","08","S01201","00.0",2431,27,"N02","C",1,201915,999999]
[null,"CHIHUAHUA","LORC551120FV3","LORC551120HCHYDR08  ","CARLOS JAVIER LOYA RODRIGUEZ","8310110030512CF0210000.012456",83101,1003,"05","12","CF02100","00.0",12456,27,"OC2","C",1,201916,999999]
[null,"CHIHUAHUA","MOMN850815I1A","MOMN850815HCLNRX07  ","NOE MONSIVAIS MARIN","8310110030026S0120100.02428",83101,1003,"00","26","S01201","00.0",2428,27,"N02","A",1,201916,999999]
[null,"CHIHUAHUA","HECG831206L74","HECG831209MCHRBB09  ","GABRIELA JUDITH HEREDIA  CABALLERO","8310110030156S0120100.07494",83101,1003,"01","56","S01201","00.0",7494,27,"N02","C",1,201916,999999]
[null,"CHIHUAHUA","BUAC8304198K9","BUAC830419MCHNGY03  ","CYNTHIA IRENE BUENO AGUIRRE","8310110030704CF0160100.010993",83101,1003,"07","04","CF01601","00.0",10993,27,"OC1","A",1,201916,999999]
[null,"CHIHUAHUA","SAOD961029SV8","SAOD961029MCHNRN08  ","DIANA GUADALUPE SANDATE ORTEGA","8310110030219S0120200.09740",83101,1003,"02","19","S01202","00.0",9740,27,"N04","C",1,201918,999999]
[null,"CHIHUAHUA","EATH590728P67","EATH590728HCHSRG00  ","HUGO ESNAYRA TRISTAN             ","8310110030704CF0160100.010992",83101,1003,"07","04","CF01601","00.0",10992,27,"OC1","A",1,199503,201915]
[null,"CHIHUAHUA","MACE880915VB1","MACE880915HCHRNR04  ","ERICK MARTELL  CONTRERAS","8310110030219CF3320400.09705",83101,1003,"02","19","CF33204","00.0",9705,27,"N13","C",1,201411,201917]
[null,"CHIHUAHUA","AAAJ9101208M3","AAAJ910120HCHLCS03","JESUS FABIAN ALVARADO ACOSTA","8310110030026S0120200.02430",83101,1003,"00","26","S01202","00.0",2430,27,"N04","A",3,201913,999999]
[null,"CHIHUAHUA","CARJ6012178GA","CARJ601217HCHRLS07","JOSE DE JESUS CARRILLO RUELAS","8310110030023CF1820300.02442",83101,1003,"00","23","CF18203","00.0",2442,27,"N09","A",3,201913,999999]
[null,"CHIHUAHUA","MOIR7306072Z5","MOIR730607HCHLBM08","RAMON HUMBERTO MOLINA IBARRA","8310110030156CF3420200.012098",83101,1003,"01","56","CF34202","00.0",12098,27,"N05","C",3,201916,999999]
[null,"CHIHUAHUA","MOHR810216267","MOHR810216HCHNLN06","RENE GUADALUPE MONTES HOLGUIN","8310110030156A0320200.07472",83101,1003,"01","56","A03202","00.0",7472,27,"N05","C",3,201916,999999]
[null,"CHIHUAHUA","MONL710121CT7","MONL710121MSLGVR08","LORENA INES MOGUEL NOVELO","8310110030207CF3320600.013431",83101,1003,"02","07","CF33206","00.0",13431,27,"N15","A",3,201916,999999]
[null,"CHIHUAHUA","LURY8009223V9","LURY800922MSPNBJ02","YAJAIRA ALEJANDRA LUNA ROBLEDO","8310110010026E371112.00",83101,1001,"00","26","E3711","12.0","0",27,0,"A",1,201916,999999]
[null,"CHIHUAHUA","DUMJ9006174T4","DUMJ900617MCHRRS06","MARIA JOSE DURAN MARQUEZ","8310110010208E371118.00",83101,1001,"02","08","E3711","18.0","0",27,0,"C",1,201917,999999]
[null,"CHIHUAHUA","LAGL840311LS1","LAGL840311MCHRMZ07","LIZBETH LARES GOMEZ","8310110010208E371120.00",83101,1001,"02","08","E3711","20.0","0",27,0,"C",1,201917,999999]
[null,"CHIHUAHUA","RATV881128H34","RATV881128HCHMRC05","VICTOR HUGO RAMIREZ TRISTAN","8310110010208E371115.00",83101,1001,"02","08","E3711","15.0","0",27,0,"C",1,201917,999999]
[null,"CHIHUAHUA","IAPJ9005168T2","IAPJ900516MCHBRS04","JESIKA EDITH IBARRA PEREZ","8310110010218E371118.00",83101,1001,"02","18","E3711","18.0","0",27,0,"C",1,201917,999999]
[null,"CHIHUAHUA","NUGA831209HF9","NUGA831209HCHVZR07","ARTURO GUADALUPE NUEVO GUZMAN","8310110010219E371110.00",83101,1001,"02","19","E3711","10.0","0",27,0,"C",1,201915,999999]
[null,"CHIHUAHUA","VIPT690222Q18","VIPT690222MCHLXR04","MARIA TERESA VILLARREAL PIÑON","8310110010219E372520.00",83101,1001,"02","19","E3725","20.0","0",27,0,"C",1,201915,999999]
[null,"CHIHUAHUA","DAGR770317JPA","DAGR770317HCLVNF02","RAFAEL DAVILA GONZALEZ","8310110010323E371112.00",83101,1001,"03","23","E3711","12.0","0",27,0,"A",1,201917,999999]
[null,"CHIHUAHUA","NARM960112JC1","NARM960112HCHVMB02","MOAB DANIEL NAVARRO RAMIREZ","8310110010323E371120.00",83101,1001,"03","23","E3711","20.0","0",27,0,"A",1,201917,999999]
[null,"CHIHUAHUA","CIFG921107419","CIFG921107HCHRLL01","GUILLERMO CRISPIN FLORES","8310110010323E371118.00",83101,1001,"03","23","E3711","18.0","0",27,0,"A",1,201918,999999]
[null,"CHIHUAHUA","MAMJ7909266H9","MAMJ790926HNLTDV08","JAVIER ISAIAS MATA MEDINA","8310110010026E371119.00",83101,1001,"00","26","E3711","19.0","0",27,0,"A",1,201915,999999]
[null,"CHIHUAHUA","EAML780807EM2","EAML780807MCHSRR05","LAURA LORENA ESTRADA MURILLO","8310110010026E372518.00",83101,1001,"00","26","E3725","18.0","0",27,0,"A",1,201915,999999]
[null,"CHIHUAHUA","NEVI930902L97","NEVI930902MVZRRM00","IMELDA NERI VARGAS","8310110010207E371113.00",83101,1001,"02","07","E3711","13.0","0",27,0,"A",1,201916,999999]
[null,"CHIHUAHUA","OOMB8207037W4","OOMB820703HCHRNL09","BLAS OROZCO MONTES","8310110010207E371118.00",83101,1001,"02","07","E3711","18.0","0",27,0,"A",1,201916,999999]
[null,"CHIHUAHUA","OIGC960301QQA","OIGC960301HCHRNR04","CARLOS ANDRES ORTIZ GONZALEZ","8310110010207E370118.00",83101,1001,"02","07","E3701","18.0","0",27,0,"A",1,201916,999999]
[null,"CHIHUAHUA","LOGM9410315T5","LOGM941031HVZRNL01","MELESIO LORENZO GONZALEZ","8310110010207E370118.00",83101,1001,"02","07","E3701","18.0","0",27,0,"A",1,201916,999999]
[null,"CHIHUAHUA","AEGL940102TD8","AEGL940102HCHRNS03","LUIS DANIEL ARMENDARIZ GONZALEZ","8310110010218E371112.00",83101,1001,"02","18","E3711","12.0","0",27,0,"C",1,201916,999999]
[null,"CHIHUAHUA","BALL820222AW6","BALL820222HCHYNR00","LORENZO ANTONIO BAYLON DE LEON","8310110010218E371115.00",83101,1001,"02","18","E3711","15.0","0",27,0,"C",1,201916,999999]
[null,"CHIHUAHUA","SORD901011B33","SORD901011MCHLSN01","SONIA YANIRA GARCIA RODRIGUEZ","8310110010323E371116.00",83101,1001,"03","23","E3711","16.0","0",27,0,"A",1,201916,999999]
[null,"CHIHUAHUA","SORD901011B33","SORD901011MCHLSN01","DIANA BELEN SOLIS RIOS","8310110010323E371120.00",83101,1001,"03","23","E3711","20.0","0",27,0,"A",1,201916,999999]
[null,"CHIHUAHUA","GOAR871220MV3","GOAR871220MCHMVB07","REBECA GOMEZ AVILA","8310110010025E371115.00",83101,1001,"00","25","E3711","15.0","0",27,0,"C",2,201910,201912]
[null,"CHIHUAHUA","OILR550330775","OILR550330HCHLPG01","ROGELIO ANASTACIO OLIVAS LOPEZ","8310110010025E372518.00",83101,1001,"00","25","E3725","18.0","0",27,0,"C",2,201904,201913]
[null,"CHIHUAHUA","HERM720618VE6","HERM720618MCHRMN07","MANUELA OLIVIA HERNANDEZ RAMIREZ","8310110010156E371112.00",83101,1001,"01","56","E3711","12.0","0",27,0,"C",2,201904,201913]
[null,"CHIHUAHUA","NASG7104118K1","NASG710411MDGJNR04","GRISELDA NAJERA SAENZ","8310110010156E371109.00",83101,1001,"01","56","E3711","09.0","0",27,0,"C",2,201904,201913]
[null,"CHIHUAHUA","RACC881116ER0","RACC881116HCHMBR01","CARLOS ADRIAN RAMIREZ CABRAL","8310110010207E371115.00",83101,1001,"02","07","E3711","15.0","0",27,0,"A",2,201909,201912]
[null,"CHIHUAHUA","RORA58083143A","RORA580831HOCSMD15","ADAN DE LA ROSA ROMERO","8310110010207E371119.00",83101,1001,"02","07","E3711","19.0","0",27,0,"A",2,201904,201913]
[null,"CHIHUAHUA","GAMB810605FZ2","GAMB810605HDGRCR04","BERNARDO ANTONIO GARCIA MACIAS","8310110010207E371113.00",83101,1001,"02","07","E3711","13.0","0",27,0,"A",2,201904,201913]
[null,"CHIHUAHUA","GUCH710602IC3","GUCH710602HCHTSC09","HECTOR GUTIERREZ CISNEROS","8310110010207E371116.00",83101,1001,"02","07","E3711","16.0","0",27,0,"A",2,201904,201913]
[null,"CHIHUAHUA","ROTC8606147U1","ROTC860614MCHDLY03","CYNTHIA RODRIGUEZ TALAMANTES","8310110010208E371110.00",83101,1001,"02","08","E3711","10.0","0",27,0,"C",2,201904,201913]
[null,"CHIHUAHUA","COMR940524BD4","COMR940524HCHNRD00","RODOLFO CONTRERAS MARTINEZ","8310110010208E371120.00",83101,1001,"02","08","E3711","20.0","0",27,0,"C",2,201904,201916]
[null,"CHIHUAHUA","PAVF6602076Y9","PAVF660207MCHLRL06","FLOR MARIA PALMA VARGAS","8310110010208E371118.00",83101,1001,"02","08","E3711","18.0","0",27,0,"C",2,201904,201916]
[null,"CHIHUAHUA","VAVS740521TK5","VAVS740521HCHLLL09","SAUL ARMANDO VALLES VALLE","8310110010208E372515.00",83101,1001,"02","08","E3725","15.0","0",27,0,"C",2,201904,201916]
[null,"CHIHUAHUA","VIMG940827G9A","VIMG940827MCHLNL05","GUILLE LIZBETH VILLALOBOS MONTA¥O","8310110010218E371118.00",83101,1001,"02","18","E3711","18.0","0",27,0,"C",2,201904,201916]
[null,"CHIHUAHUA","SAMR770614MQ5","SAMR770614MCHNRS09","ROSA SANCHEZ MORONES","8310110010219E371112.00",83101,1001,"02","19","E3711","12.0","0",27,0,"C",2,201904,201913]
[null,"CHIHUAHUA","BASZ650208NL8","BASZ650208MDFRTH15","ZHENIA PATRICIA BARRAZA STOELTING","8310110010219E372510.00",83101,1001,"02","19","E3725","10.0","0",27,0,"C",2,201904,201915]
[null,"CHIHUAHUA","JAMF9503242Q6","JAMF950324MCHYRT02","FATME JANETH JAYDAR MARQUEZ","8310110010219E370119.00",83101,1001,"02","19","E3701","19.0","0",27,0,"C",2,201907,201913]
[null,"CHIHUAHUA","LORJ800906MC9","LORJ800906HCHYDS03","JESUS ARTURO LOYA RODRIGUEZ","8310110010025E371315.00",83101,1001,"00","25","E3713","15.0","0",27,0,"C",2,201904,201915]
[null,"CHIHUAHUA","CAMA550415A18","CAMA550415HCHRLR08","ARISTEO CARRILLO MALDONADO","8310110010156E371110.00",83101,1001,"01","56","E3711","10.0","0",27,0,"C",2,201904,201914]
[null,"CHIHUAHUA","MESS970703G31","MESS970703MCHNGL02","SALMA YESENIA MENDOZA SEGOVIA","8310110010207E370112.00",83101,1001,"02","07","E3701","12.0","0",27,0,"A",2,201904,201916]
[null,"CHIHUAHUA","MEMO900505E38","MEMO900505HCHDJM04","OMAR ALONSO MEDINA MUJICA","8310110010323E371120.00",83101,1001,"03","23","E3711","20.0","0",27,0,"A",2,201904,201914]
[null,"CHIHUAHUA","PEKC800825AD4","PEKC800825HCHRLH02","CHRISTIAN PEREZ KLAPEZ","8310110010323E371120.00",83101,1001,"03","23","E3711","20.0","0",27,0,"A",2,201909,201914]
[null,"CHIHUAHUA","CUSI930610MP7","CUSI930610HTCPNS05","ISAAC ESTEBAN CUPIL SANTIAGO","8310110010323E371118.00",83101,1001,"03","23","E3711","18.0","0",27,0,"A",2,201904,201917]
[null,"Total Personas : ",56,null,null,null,null,null,null,null,"Total Plazas : ",null,14]
[]
[]
[]
[null,"Fuente : Información proporcionada por las Entidades Federativas"]

{"sheet":"II D) 4","index":8,"n_rows":30,"n_cols":17,"rows_kept":30,"cut":false,"hidden":false,"merged":[[12,16,13,16],[12,5,13,5],[12,4,13,4],[12,3,13,3],[9,1,9,9],[26,13,26,14],[12,0,13,0],[12,6,13,6],[12,7,12,13],[12,14,12,15],[12,2,13,2],[12,1,13,1]]}
[]
[]
[]
[]
[]
[]
[]
[]
[null,"Formato: Trabajadores Jubilados en el Periodo"]
[null,{"$f":"IF('1'!D22=\"Elige el Periodo…\",\"\",'1'!D22)","v":"Fondo de Aportaciones para la Educación Tecnológica y de Adultos/Colegio Nacional de Educación Profesional Técnica (FAETA/CONALEP)"},null,null,null,null,null,null,null,null,null,null,null,null,null,"3er. Trimestre 2019"]
[]
[]
[null,"Entidad Federativa","R.F.C.","CURP","NOMBRE","Clave CT","Última(s) ó Penultima(s) Plaza(s) Ocupada(s)\n(*)","Clave Presupuestal de la Jubilación",null,null,null,null,null,null,"Periodo ocupado",null,"Quincena de inicio de jubilación"]
[null,null,null,null,null,null,null,"Partida Presupuestal","Código de Pago","Clave de Unidad","Clave de Sub Unidad","Clave de Categoría","Horas Semana Mes ","Número de Plaza","Inicio","Conclusión"]
[]
[null,"Entidad Federativa","R.F.C.","CURP","NOMBRE","Clave Centro de Trabajo","Última(s) ó Penultima(s) Plaza(s) Ocupada(s)\n(*)","Partida Presupuestal","Código de Pago","Clave de Unidad","Clave de Sub Unidad","Clave de Categoría","Horas Semana Mes ","Número de Plaza","Periodo ocupado\nInicio","Periodo ocupado\nConclusión","Quincena de inicio de jubilación"]
[]
[]
[]
[]
[]
[]
[]
[]
[null,"Total Personas : ",2,null,null,null,null,null,null,null,null,"Total Plazas : ",null,2]
[]
[]
[]
[null,"Fuente : Información proporcionada por las Entidades Federativas"]
[null,"(*) Si  el trabajador se jubila con más de una clave presupuestal, por cada plaza se debe llenar un registro hasta que se haya informado acerca de todas las plazas del trabajador."]

{"sheet":"II D) 4 A","index":9,"n_rows":30,"n_cols":18,"rows_kept":30,"cut":false,"hidden":false,"merged":[[24,13,24,14],[9,1,9,7],[26,13,26,14],[12,17,13,17],[12,1,13,1],[12,2,13,2],[12,3,13,3],[12,4,13,4],[12,5,13,5],[12,6,12,12],[12,13,12,14],[12,15,13,15],[12,16,13,16]]}
[]
[]
[]
[]
[]
[]
[]
[]
[null,"Formato: Trabajadores que Tramitaron Licencia Prejubilatoria en el Periodo"]
[null,{"$f":"IF('1'!D22=\"Elige el Periodo…\",\"\",'1'!D22)","v":"Fondo de Aportaciones para la Educación Tecnológica y de Adultos/Colegio Nacional de Educación Profesional Técnica (FAETA/CONALEP)"},null,null,null,null,null,null,null,null,null,null,null,null,null,null,"3er. Trimestre 2019"]
[]
[]
[null,"Entidad Federativa","R.F.C.","CURP","NOMBRE","Clave integrada","Clave Presupuestal",null,null,null,null,null,null,"Periodo Licencia",null,"Percepciones pagadas con Presupuesto Federal en el  Periodo reportado*","Percepciones pagadas con Presupuesto de otra Fuente en el  Periodo reportado*","Clave CT Origen"]
[null,null,null,null,null,null,"Partida Presupuestal","Código de Pago","Clave de Unidad","Clave de Sub Unidad","Clave de Categoría","Horas Semana Mes ","Número de Plaza","Inicio","Conclusión"]
[]
[null,"Entidad Federativa","R.F.C.","CURP","NOMBRE","Clave integrada","Partida Presupuestal","Código de Pago","Clave de Unidad","Clave de Sub Unidad","Clave de Categoría","Horas Semana Mes ","Número de Plaza","Periodo Licencia\nInicio","Periodo Licencia\nConclusión","Percepciones pagadas con Presupuesto Federal en el  Periodo reportado*","Percepciones pagadas con Presupuesto de otra Fuente en el  Periodo reportado*","Clave CT Origen"]
[]
[]
[]
[]
[]
[]
[]
[]
[null,"Total Personas : ",0,null,null,null,null,null,null,null,"Total Plazas : ",null,0,"Total Pto. Federal",null,{"$f":"SUM(P17:P24)","v":0}]
[]
[null,null,null,null,null,null,null,null,null,null,null,null,null,"Total Ppto. Otras Fuentes",null,null,0]
[]
[null,"*Total de Percepciones reportadas por la Entidad Federativa como pagadas en el periodo "]
[null,"Fuente : Información proporcionada por las Entidades Federativas"]

{"sheet":"II D) 6","index":10,"n_rows":53,"n_cols":13,"rows_kept":53,"cut":false,"hidden":false,"merged":[[10,1,10,6],[13,12,14,12],[13,9,13,10],[13,11,14,11],[13,1,14,1],[13,2,14,2],[13,3,14,3],[13,4,14,4],[13,5,14,5],[13,6,14,6],[13,7,13,8]]}
[]
[]
[]
[]
[]
[]
[]
[]
[]
[null,"Formato: Trabajadores Contratados por Honorarios en el Periodo"]
[null,{"$f":"IF('1'!D22=\"Elige el Periodo…\",\"\",'1'!D22)","v":"Fondo de Aportaciones para la Educación Tecnológica y de Adultos/Colegio Nacional de Educación Profesional Técnica (FAETA/CONALEP)"},null,null,null,null,null,null,null,null,null,"3er. Trimestre 2019"]
[]
[]
[null,"Entidad Federativa","Clave Centro de Trabajo","R.F.C.","CURP","Nombre","Identificador del Contrato","Equivalencia",null,"Periodo de Contratación",null,"Función","Percepciones pagadas dentro del periodo reportado"]
[null,null,null,null,null,null,null,"Clave de Categoría","Horas Semana Mes ","Inicio","Conclusión"]
[]
[null,"Entidad Federativa","Clave Centro de Trabajo","R.F.C.","CURP","Nombre","Identificador del Contrato","Clave de Categoría","Horas Semana Mes ","Periodo de Contratación\nInicio","Periodo de Contratación\nConclusión","Función","Percepciones pagadas dentro del periodo reportado"]
[null,"CHIHUAHUA","00XXX0000X","RAPE620309J41","RAPE620309HCHYRN08","ENRIQUE RAY PORTILLO",1,"CF33206","00.0",20190701,20190930,"JEFE DE PROYECTO",63925.2]
[null,"CHIHUAHUA","08DPT0011J","BAGA570401CF3","BAGA570401HCHRNN09","ANDRES BARBA GÁNDARA",2,"E3725",20,20190701,20190930,"DOCENTE",32185.5]
[null,"CHIHUAHUA","08DPT0013H","AOVP680821N74","AOVP680821MCHLLT07","PATRICIA GUADALUPE ALONSO VALENZUELA","0512019","T05801","00.0",20190701,20190930,"TECNICO BIBLIOTECARIO",24895.5]
[null,"CHIHUAHUA","08DPT0013H","AIBS821008VBA","AIBS821008HVZRRR09","SERGIO ARIAS BRAVO","0522019","CF33206","00.0",20190701,20190930,"JEFE DE PROYECTO",75911.87999999999]
[null,"CHIHUAHUA","08DPT0013H","CURA8608053U4","CURA860805HCHRDB09","ABEL CRUZ RODRIGUEZ","0532019","ED0280","00.0",20190701,20190930,"TUTOR ESCOLAR",8298.5]
[null,"CHIHUAHUA","08DPT0013H","ROLF551203KHA","ROLF551203HCLSRR07","FRANCISCO JAVIER DE LA ROSA LIRA","0542019","S01201","00.0",20190701,20190930,"ASISTENTE DE SERVICIOS BASICOS",21088.920000000002]
[null,"CHIHUAHUA","08DPT0013H","DODK891025237","DODK891025MCHMMR03","KARLA KARINA DOMINGUEZ DOMINGUEZ","0552019","CF33204","00.0",20190701,20190930,"SUBJEFE TECNICO ESPECIALISTA",42218.22]
[null,"CHIHUAHUA","08DPT0013H","EECA8503081Q2","EECA850308HSLCRB06","ABRAHAM JACOBO ECHEVARRIA CORRALES","0562019","CF33204","00.0",20190701,20190930,"SUBJEFE TECNICO ESPECIALISTA",42218.22]
[null,"CHIHUAHUA","08DPT0013H","EAGJ991008R37","EAGJ991008MCHSZS02","JESSICA LIZBETH ESCAÑUELAS GUZMAN","0572019","CF33203","00.0",20190701,20190930,"TECNICO FINANCIERO",27835.620000000003]
[null,"CHIHUAHUA","08DPT0013H","EISC871230RT1","EISC871230MCHSNR08","CAROLINA ESPINOZA DE SANTIAGO","0772019","ED0280","00.0",20190801,20190930,"TUTOR ESCOLAR",24256.84]
[null,"CHIHUAHUA","08DPT0013H","GAEH930405EV6","GAEH930405HCHRSC05","HECTOR RICARDO GARCIA  ESPINOZA","0592019","S01202","00.0",20190701,20190930,"AUXILIAR DE SERVICIOS GENERALES",22979.519999999997]
[null,"CHIHUAHUA","08DPT0013H","GOHD860913N63","GOHD860913MCLNRL08","DALIA LIBERTAD GONZALEZ HERNANDEZ","0602019","CF33204","00.0",20190701,20190930,"SUBJEFE TECNICO ESPECIALISTA",42218.22]
[null,"CHIHUAHUA","08DPT0013H","HEAC5605024W8","HEAC560502HTCRRR19","JOSE CRUZ HERNANDEZ ARA","0612019","S01201","00.0",20190701,20190930,"ASISTENTE DE SERVICIOS BASICOS",21088.920000000002]
[null,"CHIHUAHUA","08DPT0013H","JUAS860801FD3","JUAS860801MCHRLL00","SILVIA ANGELICA JUAREZ ALVARADO","0622019","CF33204","00.0",20190701,20190730,"SUBJEFE TECNICO ESPECIALISTA",14072.74]
[null,"CHIHUAHUA","08DPT0013H","LOCS771008517","LOCS771008HCHPRR09","SERGIO LOPEZ  DE LA CRUZ","0632019","CF33206","00.0",20190701,20190930,"JEFE DE PROYECTO",75911.87999999999]
[null,"CHIHUAHUA","08DPT0013H","NEAA910928HC9","NEAA910928HCHGCN09","ANTONIO NEGRETE ACOSTA","0782019","S01201","00.0",20190801,20190930,"ASISTENTE DE SERVICIOS BASICOS",14059.28]
[null,"CHIHUAHUA","08DPT0013H","OIFM6211126H4","OIFM621112MDGLLR07","MARTHA ELENA OLIVAS FLORES","0792019","S01201","00.0",20190801,20190930,"ASISTENTE DE SERVICIOS BASICOS",14059.28]
[null,"CHIHUAHUA","08DPT0013H","OISM951129R68","OISM951129MCHRLC03","MICHELLE ALEJANDRA ORTIZ SILVA","0802019","S01202","00.0",20190801,20190930,"AUXILIAR DE SERVICIOS GENERALES",22349.519999999997]
[null,"CHIHUAHUA","08DPT0013H","PAVS900926C55","PAVS9009263MVZDZN02","SANDY YUNUEN PADILLA VAZQUEZ","0812019","CF33204","00.0",20190801,20190930,"SUBJEFE TECNICO ESPECIALISTA",35805.32]
[null,"CHIHUAHUA","08DPT0013H","PUYR780420I72","PUYR780420MMCLXC00","ROCIO PULIDO  YAÑEZ","0662019","CF33206","00.0",20190701,20190930,"JEFE DE PROYECTO",75911.87999999999]
[null,"CHIHUAHUA","08DPT0013H","RESJ851201GQ9","RESJ851201HCHVPV07","JAVIER EDUARDO REVELES  SAPIEN","0672019","CF33206","00.0",20190701,20190930,"JEFE DE PROYECTO",75911.87999999999]
[null,"CHIHUAHUA","08DPT0013H","RICJ981124TJ7","RICJ981124HCHSVS02","JESUS RAYMUNDO RIOS COVARRUBIAS","0682019","S01202","00.0",20190701,20190930,"AUXILIAR DE SERVICIOS GENERALES",22979.519999999997]
[null,"CHIHUAHUA","08DPT0013H","ROES970521Q99","ROES970521MCHDSN09","SINAI CAROLINA RODRIGUEZ ESTRADA","0822019","S01202","00.0",20190701,20190930,"AUXILIAR DE SERVICIOS GENERALES",22349.32]
[null,"CHIHUAHUA","08DPT0013H","RUMJ670308JU5","RUMJ670308HSPBRN01","JUAN RUBIO MARTINEZ","0702019","S01201","00.0",20190701,20190930,"ASISTENTE DE SERVICIOS BASICOS",21088.920000000002]
[null,"CHIHUAHUA","08DPT0013H","SARC911030SC8","SARC911030HCHLMR00","CARLOS SALGADO  ROMO","0712019","CF33204","00.0",20190701,20190930,"SUBJEFE TECNICO ESPECIALISTA",42218.22]
[null,"CHIHUAHUA","08DPT0013H","SAVS980512N44","SAVS98051412MCHVLR08","SARAH INES SAAVEDRA VILLEGAS","0722019","S01201","00.0",20190701,20190930,"ASISTENTE DE SERVICIOS BASICOS",21088.920000000002]
[null,"CHIHUAHUA","08DPT0013H","SIER8905149W5","SIER890514MCHGSS03","ROSA SELENE SIGALA ESQUIVEL","0732019","CF33204","00.0",20190701,20190930,"SUBJEFE TECNICO ESPECIALISTA",42218.22]
[null,"CHIHUAHUA","08DPT0013H","TORE8012234Y9","TORE801223HNTPYD08","EDGAR TOPETE REYES","0742019","S01202","00.0",20190701,20190930,"AUXILIAR DE SERVICIOS GENERALES",22979.519999999997]
[null,"CHIHUAHUA","08DPT0013H","TORR840104UJ5","TORR840104MCHRMQ05","RAQUEL IVETTE TORRES RAMIREZ","0752019","CF33204","00.0",20190701,20190930,"SUBJEFE TECNICO ESPECIALISTA",42218.22]
[null,"CHIHUAHUA","08DPT0013H","UUMM850610TB5","UUMM850610HCHNNN02","MANUEL EDUARDO UNZUETA MORALES","0762019","ED0280",0,20190701,20190930,"TUTOR ESCOLAR",24895.5]
[null,"Total Entidad Federativa Personas : ",null,30,null,null,null,null,null,null,null,"Subtotal Monto Pagado en el Periodo:",{"$f":"SUM(Tabla14[Percepciones pagadas dentro del periodo reportado])","v":1039239.2}]
[]
[]
[null,null,null,null,null,null,null,null,null,"Total   Percepciones :",null,{"$f":"M48","v":1039239.2}]
[]
[null,"Fuente : Información proporcionada por las Entidades Federativas"]

{"sheet":"II D) 7 1","index":11,"n_rows":169,"n_cols":19,"rows_kept":169,"cut":false,"hidden":false,"merged":[[8,17,8,18],[9,1,9,9],[12,6,13,6],[12,7,12,9],[12,10,13,10],[12,11,13,11],[12,12,13,12],[12,1,13,1],[12,2,13,2],[12,3,13,3],[12,4,13,4],[12,5,13,5],[12,17,13,17],[9,17,9,18],[162,16,162,17],[12,18,13,18],[12,13,13,13],[12,14,13,14],[12,15,13,15],[12,16,13,16]]}
[]
[]
[]
[]
[]
[]
[]
[]
[null,"Formato: Analítico de Categorías / Plazas Autorizadas con su Tabulador",null,null,null,null,null,null,null,null,null,null,null,null,null,null,"Entidad Federativa:",{"$f":"IF('1'!D21=\"Elige el Periodo…\",\"\",'1'!D21)","v":"CHIHUAHUA "}]
[null,{"$f":"IF('1'!D22=\"Elige el Periodo…\",\"\",'1'!D22)","v":"Fondo de Aportaciones para la Educación Tecnológica y de Adultos/Colegio Nacional de Educación Profesional Técnica (FAETA/CONALEP)"},null,null,null,null,null,null,null,null,null,null,null,null,null,null,null,"3er. Trimestre 2019"]
[]
[]
[null,"Clave Tipo educativo","Clave Nivel educativo","Clave Subnivel educativo","Descripción Nivel / Subnivel","Tipo Financiamiento","Partida Presupuestal","CATEGORIA",null,null,"Zona Económica","Nivel Puesto","Nivel Sueldo","Tipo Contratación","Monto mensual\npor plaza jornada","Monto mensual\nPor Plaza HSM","Número de Plazas Jornada","Número de Plazas HSM","Monto total autorizado"]
[null,null,null,null,null,null,null,"Tipo de Categoría"," Categoría","Descripción"]
[null,null,null,null,null,null,null,null,null,null,null,null,null,null,null,0]
[null,"Clave Tipo educativo","Clave Nivel educativo","Clave Subnivel educativo","Descripción Nivel / Subnivel","Tipo Financiamiento","Partida Presupestal","Tipo de Categoría"," Categoría","Descripción","Zona Económica","Nivel Puesto","Nivel Sueldo","Tipo Contratación","Monto mensual\npor plaza jornada","0","Número de Plazas Jornada","Número de Plazas HSM","Monto total autorizado"]
[null,2,21,"020","PERSONAL TECNICO",1,83101,2,"A03202","SECRETARIA C","A",27,"N05","P",9371.94,0,1,0,9371.94]
[null,2,21,"020","PERSONAL TECNICO",1,83101,2,"A03202","SECRETARIA C","A",27,"N05","P",37487.760000000002,0,4,0,37487.760000000002]
[null,2,21,"020","PERSONAL TECNICO",1,83101,5,"CF01601","JEFE DE UNIDAD","A",27,"OC1","P",20663.52,0,4,0,20663.52]
[null,2,21,"020","PERSONAL TECNICO",1,83101,5,"CF02103","DIRECTOR DEL PLANTEL B Y C","A",27,"NB2","P",5753.58,0,1,0,5753.58]
[null,2,21,"020","PERSONAL TECNICO",1,83101,5,"CF02103","DIRECTOR DEL PLANTEL B Y C","A",27,"NB2","P",5753.58,0,1,0,5753.58]
[null,2,21,"020","PERSONAL TECNICO",1,83101,5,"CF02105","COORDINADOR EJECUTIVO II","A",27,"N14","P",5165.88,0,1,0,5165.88]
[null,2,21,"020","PERSONAL TECNICO",1,83101,5,"CF02105","COORDINADOR EJECUTIVO II","A",27,"OB2","P",5165.88,0,1,0,5165.88]
[null,2,21,"020","PERSONAL TECNICO",1,83101,2,"CF04201","SECRETARIA B","A",27,"N07","P",9981.19,0,1,0,9981.19]
[null,2,21,"020","PERSONAL TECNICO",1,83101,2,"CF04201","SECRETARIA B","A",27,"N07","P",9981.2000000000007,0,1,0,9981.2000000000007]
[null,2,21,"020","PERSONAL TECNICO",1,83101,5,"CF11102","DIRECTOR DE CENTRO","A",27,"NB2","P",5753.58,0,1,0,5753.58]
[null,2,21,"020","PERSONAL TECNICO",1,83101,2,"CF18201","AUXILIAR DE SEGURIDAD","A",27,"N02","P",7676.53,0,1,0,7676.53]
[null,2,21,"020","PERSONAL TECNICO",1,83101,2,"CF18201","AUXILIAR DE SEGURIDAD","A",27,"N02","P",13597,0,1,0,13597]
[null,2,21,"020","PERSONAL TECNICO",1,83101,2,"CF18203","SUPERVISOR DE MANTENIMIENTO","A",27,"N09","P",32221.51,0,3,0,32221.51]
[null,2,21,"020","PERSONAL TECNICO",1,83101,1,"CF18203","SUPERVISOR DE MANTENIMIENTO","A",27,"N09","P",21481,0,2,0,21481]
[null,2,21,"020","PERSONAL TECNICO",1,83101,2,"CF19201","TUTOR ESCOLAR","A",27,"N06","P",9606.34,0,1,0,9606.34]
[null,2,21,"020","PERSONAL TECNICO",1,83101,2,"CF19201","TUTOR ESCOLAR","A",27,"N06","P",9062.64,0,1,0,9062.64]
[null,2,21,"020","PERSONAL TECNICO",1,83101,2,"CF19201","TUTOR ESCOLAR","A",27,"N06","P",9606.34,0,1,0,9606.34]
[null,2,21,"020","PERSONAL TECNICO",1,83101,2,"CF33203","TECNICO FINANCIERO","A",27,"N09","P",10740.5,0,1,0,10740.5]
[null,2,21,"020","PERSONAL TECNICO",1,83101,2,"CF33204","SUBJEFE TECNICO ESPECIALISTA","A",27,"N13","P",132965.70000000001,0,7,0,132965.70000000001]
[null,2,21,"020","PERSONAL TECNICO",1,83101,2,"CF33204","SUBJEFE TECNICO ESPECIALISTA","A",27,"N13","P",17919.82,0,1,0,17919.82]
[null,2,21,"020","PERSONAL TECNICO",1,83101,2,"CF33204","SUBJEFE TECNICO ESPECIALISTA","A",27,"N13","P",14072.75,0,1,0,14072.75]
[null,2,21,"020","PERSONAL TECNICO",1,83101,2,"CF33204","SUBJEFE TECNICO ESPECIALISTA","A",27,"N13","P",94975.5,0,5,0,94975.5]
[null,2,21,"020","PERSONAL TECNICO",1,83101,2,"CF33204","SUBJEFE TECNICO ESPECIALISTA","A",27,"N13","P",94975.5,0,5,0,94975.5]
[null,2,21,"020","PERSONAL TECNICO",1,83101,2,"CF33206","JEFE DE PROYECTO","A",27,"N15","P",80158.47,0,3,0,80158.47]
[null,2,21,"020","PERSONAL TECNICO",1,83101,2,"CF33206","JEFE DE PROYECTO","A",27,"N15","P",26343.08,0,1,0,26343.08]
[null,2,21,"020","PERSONAL TECNICO",1,83101,2,"CF33206","JEFE DE PROYECTO","A",27,"N15","P",52303.29,0,2,0,52303.29]
[null,2,21,"020","PERSONAL TECNICO",1,83101,2,"CF33206","JEFE DE PROYECTO","A",27,"N15","P",80158.44,0,3,0,80158.44]
[null,2,21,"020","PERSONAL TECNICO",1,83101,2,"CF33206","JEFE DE PROYECTO","A",27,"N15","P",78454.92,0,3,0,78454.92]
[null,2,21,"020","PERSONAL TECNICO",1,83101,2,"CF34201","TECNICO BIBLIOTECARIO","A",27,"N06","P",9606.34,0,1,0,9606.34]
[null,2,21,"020","PERSONAL TECNICO",1,83101,2,"CF34202","PROMOTOR CULTURAL Y DEPORTIVO","A",27,"N05","P",9371.94,0,1,0,9371.94]
[null,2,21,"020","PERSONAL TECNICO",1,83101,1,"CF34202","PROMOTOR CULTURAL Y DEPORTIVO","A",27,"N05","P",9371.94,0,1,0,9371.94]
[null,2,21,"020","PERSONAL TECNICO",1,83101,3,"E3701","DOCENTE","A",27,0,"H",0,326.3,0,171,59627.7]
[null,2,21,"020","PERSONAL TECNICO",1,83101,3,"E3711","DOCENTE","A",27,0,"H",0,439.7,0,676,317652.40000000002]
[null,2,21,"020","PERSONAL TECNICO",1,83101,3,"E3713","DOCENTE","A",27,0,"H",0,496.95,0,659,349961.95]
[null,2,21,"020","PERSONAL TECNICO",1,83101,3,"E3725","DOCENTE","A",27,0,"H",0,571.75,0,2274,1389414]
[null,2,21,"020","PERSONAL TECNICO",1,83101,2,"ED01201","TECNICO DE MATERIALES DIDACTICOS","A",27,"N06","P",19212.68,0,2,0,19212.68]
[null,2,21,"020","PERSONAL TECNICO",1,83101,2,"S01201","ASISTENTE DE SERVICIOS BASICOS","A",27,"N02","P",8137.16,0,1,0,8137.16]
[null,2,21,"020","PERSONAL TECNICO",1,83101,2,"S01201","ASISTENTE DE SERVICIOS BASICOS","A",27,"N02","P",15353.06,0,2,0,15353.06]
[null,2,21,"020","PERSONAL TECNICO",1,83101,2,"S01201","ASISTENTE DE SERVICIOS BASICOS","A",27,"N02","P",14530.31,0,2,0,14530.31]
[null,2,21,"020","PERSONAL TECNICO",1,83101,1,"S01201","ASISTENTE DE SERVICIOS BASICOS","A",27,"N02","P",15353.04,0,2,0,15353.04]
[null,2,21,"020","PERSONAL TECNICO",1,83101,2,"S01202","AUXILIAR DE SERVICIOS GENERALES","A",27,"N04","P",53202.1,0,6,0,53202.1]
[null,2,21,"020","PERSONAL TECNICO",1,83101,1,"S01202","AUXILIAR DE SERVICIOS GENERALES","A",27,"N04","P",17734.04,0,2,0,17734.04]
[null,2,21,"020","PERSONAL TECNICO",1,83101,1,"S01202","AUXILIAR DE SERVICIOS GENERALES","A",27,"N04","P",8364.84,0,1,0,8364.84]
[null,2,21,"020","PERSONAL TECNICO",1,83101,2,"A03202","SECRETARIA C","C",27,"N05","P",7776.84,0,2,0,7776.84]
[null,2,21,"020","PERSONAL TECNICO",1,83101,2,"A03202","SECRETARIA C","C",27,"N05","P",6943.96,0,1,0,6943.96]
[null,2,21,"020","PERSONAL TECNICO",1,83101,2,"A03202","SECRETARIA C","C",27,"N05","P",7776.84,0,1,0,7776.84]
[null,2,21,"020","PERSONAL TECNICO",1,83101,2,"A03202","SECRETARIA C","C",27,"N05","P",14673.43,0,2,0,14673.43]
[null,2,21,"020","PERSONAL TECNICO",1,83101,2,"A03202","SECRETARIA C","C",27,"N09","P",15049.52,0,2,0,15049.52]
[null,2,21,"020","PERSONAL TECNICO",1,83101,2,"A03202","SECRETARIA C","C",27,"N05","P",15553.68,0,2,0,15553.68]
[null,2,21,"020","PERSONAL TECNICO",1,83101,2,"A03202","SECRETARIA C","C",27,"N05","P",90297.12,0,4,0,90297.12]
[null,2,21,"020","PERSONAL TECNICO",1,83101,5,"CF02100","SUBCOORDINADOR","C",27,"OC2","P",15497.67,0,3,0,15497.67]
[null,2,21,"020","PERSONAL TECNICO",1,83101,5,"CF02103","DIRECTOR DEL PLANTEL B Y C","C",27,"NB1","P",5753.58,0,1,0,5753.58]
[null,2,21,"020","PERSONAL TECNICO",1,83101,5,"CF02103","DIRECTOR DEL PLANTEL B Y C","C",27,"NB1","P",5753.58,0,1,0,5753.58]
[null,2,21,"020","PERSONAL TECNICO",1,83101,5,"CF02103","DIRECTOR DEL PLANTEL B Y C","C",27,"NB1","P",5753.58,0,1,0,5753.58]
[null,2,21,"020","PERSONAL TECNICO",1,83101,5,"CF02103","DIRECTOR DEL PLANTEL B Y C","C",27,"NB1","P",17260.740000000002,0,1,0,17260.740000000002]
[null,2,21,"020","PERSONAL TECNICO",1,83101,5,"CF02104","DIRECTOR DE PLANTEL D Y E","C",27,"NA2","P",5165.88,0,1,0,5165.88]
[null,2,21,"020","PERSONAL TECNICO",1,83101,5,"CF02105","COORDINADOR EJECUTIVO II","C",27,"OB2","P",5165.88,0,1,0,5165.88]
[null,2,21,"020","PERSONAL TECNICO",1,83101,5,"CF02105","COORDINADOR EJECUTIVO II","C",27,"OB2","P",5165.8900000000003,0,1,0,5165.8900000000003]
[null,2,21,"020","PERSONAL TECNICO",1,83101,5,"CF02105","COORDINADOR EJECUTIVO II","C",27,"OB2","P",5165.8900000000003,0,1,0,5165.8900000000003]
[null,2,21,"020","PERSONAL TECNICO",1,83101,5,"CF02105","COORDINADOR EJECUTIVO II","C",27,"OB2","P",15497.64,0,1,0,15497.64]
[null,2,21,"020","PERSONAL TECNICO",1,83101,2,"CF04201","SECRETARIA B","C",27,"N07","P",8405.34,0,1,0,8405.34]
[null,2,21,"020","PERSONAL TECNICO",1,83101,2,"CF04201","SECRETARIA B","C",27,"N07","P",16810.7,0,2,0,16810.7]
[null,2,21,"020","PERSONAL TECNICO",1,83101,2,"CF04201","SECRETARIA B","C",27,"N07","P",8132.9,0,1,0,8132.9]
[null,2,21,"020","PERSONAL TECNICO",1,83101,2,"CF04201","SECRETARIA B","C",27,"N07","P",8405.34,0,1,0,8405.34]
[null,2,21,"020","PERSONAL TECNICO",1,83101,2,"CF04201","SECRETARIA B","C",27,"N07","P",24398.7,0,1,0,24398.7]
[null,2,21,"020","PERSONAL TECNICO",1,83101,5,"CF11100","DIRECTOR GENERAL ESTATAL","C",27,"MC2","P",11552.21,0,1,0,11552.21]
[null,2,21,"020","PERSONAL TECNICO",1,83101,2,"CF18201","AUXILIAR DE SEGURIDAD","C",27,"N02","P",6464.34,0,2,0,6464.34]
[null,2,21,"020","PERSONAL TECNICO",1,83101,2,"CF18201","AUXILIAR DE SEGURIDAD","C",27,"N02","P",6117.66,0,1,0,6117.66]
[null,2,21,"020","PERSONAL TECNICO",1,83101,2,"CF18201","AUXILIAR DE SEGURIDAD","C",27,"N02","P",13704.21,0,2,0,13704.21]
[null,2,21,"020","PERSONAL TECNICO",1,83101,2,"CF18201","AUXILIAR DE SEGURIDAD","C",27,"N02","P",6254.8,0,1,0,6254.8]
[null,2,21,"020","PERSONAL TECNICO",1,83101,2,"CF18201","AUXILIAR DE SEGURIDAD","C",27,"N02","P",6852.1,0,1,0,6852.1]
[null,2,21,"020","PERSONAL TECNICO",1,83101,2,"CF18201","AUXILIAR DE SEGURIDAD","C",27,"N02","P",18764.400000000001,0,1,0,18764.400000000001]
[null,2,21,"020","PERSONAL TECNICO",1,83101,2,"CF18201","AUXILIAR DE SEGURIDAD","C",27,"N02","P",19890,0,1,0,19890]
[null,2,21,"020","PERSONAL TECNICO",1,83101,2,"CF18203","SUPERVISOR DE MANTENIMIENTO","C",27,"N09","P",9044.7999999999993,0,1,0,9044.7999999999993]
[null,2,21,"020","PERSONAL TECNICO",1,83101,2,"CF18203","SUPERVISOR DE MANTENIMIENTO","C",27,"N02","P",17503.2,0,2,0,17503.2]
[null,2,21,"020","PERSONAL TECNICO",1,83101,2,"CF18203","SUPERVISOR DE MANTENIMIENTO","C",27,"N09","P",18089.599999999999,0,2,0,18089.599999999999]
[null,2,21,"020","PERSONAL TECNICO",1,83101,2,"CF18203","SUPERVISOR DE MANTENIMIENTO","C",27,"N09","P",52509.599999999999,0,2,0,52509.599999999999]
[null,2,21,"020","PERSONAL TECNICO",1,83101,2,"CF19201","TUTOR ESCOLAR","C",27,"N06","P",8089.36,0,1,0,8089.36]
[null,2,21,"020","PERSONAL TECNICO",1,83101,2,"CF19201","TUTOR ESCOLAR","C",27,"N06","P",8089.37,0,1,0,8089.37]
[null,2,21,"020","PERSONAL TECNICO",1,83101,2,"CF19201","TUTOR ESCOLAR","C",27,"N04","P",7827.16,0,1,0,7827.16]
[null,2,21,"020","PERSONAL TECNICO",1,83101,2,"CF19201","TUTOR ESCOLAR","C",27,"N06","P",7631.46,0,1,0,7631.46]
[null,2,21,"020","PERSONAL TECNICO",1,83101,2,"CF19201","TUTOR ESCOLAR","C",27,"N06","P",23481.48,0,1,0,23481.48]
[null,2,21,"020","PERSONAL TECNICO",1,83101,2,"CF21202","ASISTENTE ESCOLAR Y SOCIAL","C",27,"N07","P",8405.34,0,1,0,8405.34]
[null,2,21,"020","PERSONAL TECNICO",1,83101,2,"CF21202","ASISTENTE ESCOLAR Y SOCIAL","C",27,"N07","P",8405.35,0,1,0,8405.35]
[null,2,21,"020","PERSONAL TECNICO",1,83101,2,"CF21202","ASISTENTE ESCOLAR Y SOCIAL","C",27,"N07","P",8405.34,0,1,0,8405.34]
[null,2,21,"020","PERSONAL TECNICO",1,83101,2,"CF33202","ASISTENTE ESCOLAR Y SOCIAL","C",27,"N09","P",9044.7999999999993,0,1,0,9044.7999999999993]
[null,2,21,"020","PERSONAL TECNICO",1,83101,2,"CF33203","TECNICO FINANCIERO","C",27,"N09","P",9044.7800000000007,0,1,0,9044.7800000000007]
[null,2,21,"020","PERSONAL TECNICO",1,83101,2,"CF33203","TECNICO FINANCIERO","C",27,"N09","P",8751.6,0,1,0,8751.6]
[null,2,21,"020","PERSONAL TECNICO",1,83101,2,"CF33203","TECNICO FINANCIERO","C",27,"N09","P",9044.7999999999993,0,1,0,9044.7999999999993]
[null,2,21,"020","PERSONAL TECNICO",1,83101,2,"CF33204","SUBJEFE TECNICO ESPECIALISTA","C",27,"N13","P",14282.16,0,1,0,14282.16]
[null,2,21,"020","PERSONAL TECNICO",1,83101,2,"CF33204","SUBJEFE TECNICO ESPECIALISTA","C",27,"N13","P",15996.4,0,2,0,15996.4]
[null,2,21,"020","PERSONAL TECNICO",1,83101,2,"CF33204","SUBJEFE TECNICO ESPECIALISTA","C",27,"N13","P",31992.82,0,2,0,31992.82]
[null,2,21,"020","PERSONAL TECNICO",1,83101,2,"CF33204","SUBJEFE TECNICO ESPECIALISTA","C",27,"N13","P",15090.75,0,1,0,15090.75]
[null,2,21,"020","PERSONAL TECNICO",1,83101,2,"CF33204","SUBJEFE TECNICO ESPECIALISTA","C",27,"N13","P",14282.14,0,1,0,14282.14]
[null,2,21,"020","PERSONAL TECNICO",1,83101,2,"CF33204","SUBJEFE TECNICO ESPECIALISTA","C",27,"N13","P",15996.4,0,1,0,15996.4]
[null,2,21,"020","PERSONAL TECNICO",1,83101,2,"CF33204","SUBJEFE TECNICO ESPECIALISTA","C",27,"N13","P",278602.2,0,6,0,278602.2]
[null,2,21,"020","PERSONAL TECNICO",1,83101,2,"CF33204","SUBJEFE TECNICO ESPECIALISTA","C",27,"N13","P",82915.199999999997,0,2,0,82915.199999999997]
[null,2,21,"020","PERSONAL TECNICO",1,83101,2,"CF33204","SUBJEFE TECNICO ESPECIALISTA","C",27,"N13","P",79982,0,5,0,79982]
[null,2,21,"020","PERSONAL TECNICO",1,83101,2,"CF33206","JEFE DE PROYECTO","C",27,"N07","P",22022.26,0,1,0,22022.26]
[null,2,21,"020","PERSONAL TECNICO",1,83101,2,"CF33206","JEFE DE PROYECTO","C",27,"N15","P",23268.959999999999,0,1,0,23268.959999999999]
[null,2,21,"020","PERSONAL TECNICO",1,83101,2,"CF33206","JEFE DE PROYECTO","C",27,"N15","P",24646.6,0,4,0,24646.6]
[null,2,21,"020","PERSONAL TECNICO",1,83101,2,"CF33206","JEFE DE PROYECTO","C",27,"N15","P",49329.29,0,2,0,49329.29]
[null,2,21,"020","PERSONAL TECNICO",1,83101,2,"CF33206","JEFE DE PROYECTO","C",27,"N15","P",88088.93,0,4,0,88088.93]
[null,2,21,"020","PERSONAL TECNICO",1,83101,2,"CF33206","JEFE DE PROYECTO","C",27,"N15","P",71595.48,0,3,0,71595.48]
[null,2,21,"020","PERSONAL TECNICO",1,83101,2,"CF33206","JEFE DE PROYECTO","C",27,"N15","P",45029.4,0,2,0,45029.4]
[null,2,21,"020","PERSONAL TECNICO",1,83101,2,"CF33206","JEFE DE PROYECTO","C",27,"N15","P",73993.98,0,3,0,73993.98]
[null,2,21,"020","PERSONAL TECNICO",1,83101,2,"CF33206","JEFE DE PROYECTO","C",27,"N15","P",22022.26,0,1,0,22022.26]
[null,2,21,"020","PERSONAL TECNICO",1,83101,2,"CF33206","JEFE DE PROYECTO","C",27,"N15","P",286381.92,0,4,0,286381.92]
[null,2,21,"020","PERSONAL TECNICO",1,83101,2,"CF33206","JEFE DE PROYECTO","C",27,"N15","P",127850.4,0,2,0,127850.4]
[null,2,21,"020","PERSONAL TECNICO",1,83101,2,"CF33206","JEFE DE PROYECTO","C",27,"N15","P",123323.25,0,5,0,123323.25]
[null,2,21,"020","PERSONAL TECNICO",1,83101,2,"CF33206","JEFE DE PROYECTO","C",27,"N15","P",23268.95,0,1,0,23268.95]
[null,2,21,"020","PERSONAL TECNICO",1,83101,2,"CF33206","JEFE DE PROYECTO","C",27,"N15","P",21308.400000000001,0,1,0,21308.400000000001]
[null,2,21,"020","PERSONAL TECNICO",1,83101,2,"CF34201","TECNICO BIBLIOTECARIO","C",27,"N06","P",8089.36,0,1,0,8089.36]
[null,2,21,"020","PERSONAL TECNICO",1,83101,2,"CF34201","TECNICO BIBLIOTECARIO","C",27,"N06","P",8405.35,0,1,0,8405.35]
[null,2,21,"020","PERSONAL TECNICO",1,83101,2,"CF34201","TECNICO BIBLIOTECARIO","C",27,"N06","P",7384.1,0,1,0,7384.1]
[null,2,21,"020","PERSONAL TECNICO",1,83101,2,"CF34201","TECNICO BIBLIOTECARIO","C",27,"N06","P",8089.35,0,1,0,8089.35]
[null,2,21,"020","PERSONAL TECNICO",1,83101,2,"CF34202","PROMOTOR CULTURAL Y DEPORTIVO","C",27,"N05","P",7776.84,0,1,0,7776.84]
[null,2,21,"020","PERSONAL TECNICO",1,83101,2,"CF34202","PROMOTOR CULTURAL Y DEPORTIVO","C",27,"N05","P",7336.7,0,1,0,7336.7]
[null,2,21,"020","PERSONAL TECNICO",1,83101,2,"CF34202","PROMOTOR CULTURAL Y DEPORTIVO","C",27,"N05","P",7776.84,0,1,0,7776.84]
[null,2,21,"020","PERSONAL TECNICO",1,83101,2,"CF34205","ADMINISTRATIVO TECNICO ESPECIALISTA","C",27,"N02","P",9698.2999999999993,0,1,0,9698.2999999999993]
[null,2,21,"020","PERSONAL TECNICO",1,83101,3,"E3701","DOCENTE","C",27,0,"H",0,267.89999999999998,0,70,20041]
[null,2,21,"020","PERSONAL TECNICO",1,83101,3,"E3711","DOCENTE","C",27,0,"H",0,364.4,0,612,238312.8]
[null,2,21,"020","PERSONAL TECNICO",1,83101,3,"E3713","DOCENTE","C",27,0,"H",0,409.55,0,985,431085.25]
[null,2,21,"020","PERSONAL TECNICO",1,83101,3,"E3725","DOCENTE","C",27,0,"H",0,472.65,0,4438,2241411.9]
[null,2,21,"020","PERSONAL TECNICO",1,83101,2,"ED01201","TECNICO DE MATERIALES DIDACTICOS","C",27,"N06","P",8089.35,0,1,0,8089.35]
[null,2,21,"020","PERSONAL TECNICO",1,83101,2,"S01201","ASISTENTE DE SERVICIOS BASICOS","C",27,"N02","P",6464.34,0,4,0,6464.34]
[null,2,21,"020","PERSONAL TECNICO",1,83101,2,"S01201","ASISTENTE DE SERVICIOS BASICOS","C",27,"N02","P",6117.66,0,3,0,6117.66]
[null,2,21,"020","PERSONAL TECNICO",1,83101,2,"S01201","ASISTENTE DE SERVICIOS BASICOS","C",27,"N05","P",6852.1,0,1,0,6852.1]
[null,2,21,"020","PERSONAL TECNICO",1,83101,2,"S01201","ASISTENTE DE SERVICIOS BASICOS","C",27,"N02","P",13704.21,0,2,0,13704.21]
[null,2,21,"020","PERSONAL TECNICO",1,83101,2,"S01201","ASISTENTE DE SERVICIOS BASICOS","C",27,"N02","P",19393.009999999998,0,3,0,19393.009999999998]
[null,2,21,"020","PERSONAL TECNICO",1,83101,2,"S01201","ASISTENTE DE SERVICIOS BASICOS","C",27,"N02","P",6117.66,0,1,0,6117.66]
[null,2,21,"020","PERSONAL TECNICO",1,83101,2,"S01201","ASISTENTE DE SERVICIOS BASICOS","C",27,"N05","P",6254.8,0,1,0,6254.8]
[null,2,21,"020","PERSONAL TECNICO",1,83101,2,"S01201","ASISTENTE DE SERVICIOS BASICOS","C",27,"N02","P",5919.36,0,1,0,5919.36]
[null,2,21,"020","PERSONAL TECNICO",1,83101,2,"S01201","ASISTENTE DE SERVICIOS BASICOS","C",27,"N02","P",12928.68,0,2,0,12928.68]
[null,2,21,"020","PERSONAL TECNICO",1,83101,2,"S01201","ASISTENTE DE SERVICIOS BASICOS","C",27,"N02","P",56293.2,0,3,0,56293.2]
[null,2,21,"020","PERSONAL TECNICO",1,83101,2,"S01201","ASISTENTE DE SERVICIOS BASICOS","C",27,"N11","P",6852.1,0,1,0,6852.1]
[null,2,21,"020","PERSONAL TECNICO",1,83101,2,"S01202","AUXILIAR DE SERVICIOS GENERALES","C",27,"N04","P",7044.3,0,2,0,7044.3]
[null,2,21,"020","PERSONAL TECNICO",1,83101,2,"S01202","AUXILIAR DE SERVICIOS GENERALES","C",27,"N04","P",7467,0,1,0,7467]
[null,2,21,"020","PERSONAL TECNICO",1,83101,2,"S01202","AUXILIAR DE SERVICIOS GENERALES","C",27,"N04","P",14933.99,0,2,0,14933.99]
[null,2,21,"020","PERSONAL TECNICO",1,83101,2,"S01202","AUXILIAR DE SERVICIOS GENERALES","C",27,"N06","P",7224.96,0,1,0,7224.96]
[null,2,21,"020","PERSONAL TECNICO",1,83101,2,"S01202","AUXILIAR DE SERVICIOS GENERALES","C",27,"N04","P",7467,0,1,0,7467]
[null,2,21,"020","PERSONAL TECNICO",1,83101,2,"S01202","AUXILIAR DE SERVICIOS GENERALES","C",27,"N03","P",61343.46,0,3,0,61343.46]
[null,2,21,"020","PERSONAL TECNICO",1,83101,2,"S01202","AUXILIAR DE SERVICIOS GENERALES","C",27,"N03","P",43349.760000000002,0,2,0,43349.760000000002]
[null,2,21,"020","PERSONAL TECNICO",1,83101,2,"T08201","TECNICO EN GRAFICACION","C",27,"N08","P",8722.6,0,1,0,8722.6]
[null,2,21,"020","PERSONAL TECNICO",1,83101,2,"T08201","TECNICO EN GRAFICACION","C",27,"N08","P",8722.6,0,1,0,8722.6]
[null,2,21,"020","PERSONAL TECNICO",1,83101,2,"T08201","TECNICO EN GRAFICACION","C",27,"N08","P",8722.6,0,1,0,8722.6]
[null,null,null,null,null,null,null,null,null,null,null,null,null,"Total Jornada:",{"$f":"SUBTOTAL(109,Tabla15[Monto mensual\npor plaza jornada])","v":3640819.08},null,"Total Autorizado:",null,{"$f":"SUBTOTAL(109,Tabla15[Monto total autorizado])","v":8688326.0800000001}]
[null,null,null,null,null,null,null,null,null,null,null,null,null,"Total HSM",null,{"$f":"SUM(P17:P163)","v":3349.2000000000003}]
[]
[null,"Fuente : Información proporcionada por las Entidades Federativas"]
[]
[]
[null,null,null,null,null,null,null,null," "]

{"sheet":"II D) 7 2 ","index":12,"n_rows":174,"n_cols":18,"rows_kept":174,"cut":false,"hidden":false,"merged":[[14,8,15,8],[14,9,14,13],[14,14,14,16],[10,16,10,17],[11,1,11,9],[14,1,15,1],[14,2,15,2],[14,3,15,3],[14,17,15,17],[14,6,15,6],[14,7,15,7],[14,4,15,4],[14,5,15,5],[11,16,11,17]]}
[]
[]
[]
[]
[]
[]
[]
[]
[]
[]
[null,"Formato: Catálogo de Categorías y Tabuladores",null,null,null,null,null,null,null,null,null,null,null,null,null,"Entidad Federativa:",{"$f":"IF('1'!D21=\"Elige el Periodo…\",\"\",'1'!D21)","v":"CHIHUAHUA "}]
[null,{"$f":"IF('1'!D22=\"Elige el Periodo…\",\"\",'1'!D22)","v":"Fondo de Aportaciones para la Educación Tecnológica y de Adultos/Colegio Nacional de Educación Profesional Técnica (FAETA/CONALEP)"},null,null,null,null,null,null,null,null,null,null,null,null,null,null,"3er. Trimestre 2019"]
[]
[]
[null,"Identificador origen presupuestal de la plaza","Clave de categoría","Descripción de la categoría","Tipo de contratación","Tipo de categoría","Clave de concepto de pago","Clave de nivel de puesto","Clave de nivel de sueldo","Sueldo asignado por zona económica",null,null,null,null,"Datos adicionales de horas",null,null,"Fecha de actualización"]
[null,null,null,null,null,null,null,null,null,"Inicio de vigencia del sueldo","Fin de vigencia del sueldo","Monto Mensual Jornada ó de HSM\nZona A","Monto Mensual Jornada ó de HSM\nZona B","Monto Mensual Jornada ó de HSM\nZona C","Horas \nde compatibilidad","Horas de servicio (HSM)","Horas de docencia"]
[]
[null,"Identificador origen presupuestal de la plaza","Clave de categoría","Descripción de la categoría","Tipo de contratación","Tipo de categoría","Clave de concepto de pago","Clave de nivel de puesto","Clave de nivel de sueldo","Inicio de vigencia del sueldo","Fin de vigencia del sueldo","Monto Mensual Jornada ó de HSM\nZona A","Monto Mensual Jornada ó de HSM\nZona B","Monto Mensual Jornada ó de HSM\nZona C","Horas \nde compatibilidad","Horas de servicio (HSM)","Horas de docencia","Fecha de actualización"]
[null,1,"CF02103","DIRECTOR DEL PLANTEL B Y C","P",5,1003,27,"NB1",199918,999999,0,0,5753.58,0,"40.0","00.0","20190201"]
[null,1,"CF02105","COORDINADOR EJECUTIVO II","P",5,1003,27,"OB2",199918,999999,0,0,5165.88,0,"40.0","00.0","20190201"]
[null,1,"CF33206","JEFE DE PROYECTO","P",2,1003,27,"N15",199918,999999,0,0,24646.6,0,"40.0","00.0","20190201"]
[null,1,"CF33206","JEFE DE PROYECTO","P",2,1003,27,"N15",199918,999999,0,0,22022.26,0,"40.0","00.0","20190201"]
[null,1,"CF33206","JEFE DE PROYECTO","P",2,1003,27,"N15",199918,999999,0,0,23268.959999999999,0,"40.0","00.0","20190201"]
[null,1,"CF33204","SUBJEFE TECNICO ESPECIALISTA","P",2,1003,27,"N13",199918,999999,0,0,14282.16,0,"40.0","00.0","20190201"]
[null,1,"CF33204","SUBJEFE TECNICO ESPECIALISTA","P",2,1003,27,"N13",199918,999999,0,0,15996.4,0,"40.0","00.0","20190201"]
[null,1,"CF33202","TECNICO EN CONTABILIDAD","P",2,1003,27,"N09",199918,999999,0,0,9044.7999999999993,0,"40.0","00.0","20190201"]
[null,1,"CF04201","SECRETARIA B","P",2,1003,27,"N07",199918,999999,0,0,8405.34,0,"40.0","00.0","20190201"]
[null,1,"A03202","SECRETARIA C","P",2,1003,27,"N05",199918,999999,0,0,7776.84,0,"40.0","00.0","20190201"]
[null,1,"S01201","ASISTENTE DE SERVICIOS BASICOS","P",2,1003,27,"N02",199918,999999,0,0,6464.34,0,"40.0","00.0","20190201"]
[null,1,"S01201","ASISTENTE DE SERVICIOS BASICOS","P",2,1003,27,"N02",199918,999999,0,0,6852.1,0,"40.0","00.0","20190201"]
[null,1,"S01201","ASISTENTE DE SERVICIOS BASICOS","P",2,1003,27,"N02",199918,999999,0,0,6117.66,0,"40.0","00.0","20190201"]
[null,1,"S01202","AUXILIAR DE SERVICIOS GENERALES","P",2,1003,27,"N04",199918,999999,0,0,7044.3,0,"40.0","00.0","20190201"]
[null,1,"S01202","AUXILIAR DE SERVICIOS GENERALES","P",2,1003,27,"N04",199918,999999,0,0,7467,0,"40.0","00.0","20190201"]
[null,1,"CF18201","AUXILIAR DE SEGURIDAD","P",2,1003,27,"N02",199918,999999,0,0,6464.34,0,"40.0","00.0","20190201"]
[null,1,"CF34201","TECNICO BIBLIOTECARIO","P",2,1003,27,"N06",199918,999999,0,0,8089.36,0,"40.0","00.0","20190201"]
[null,1,"CF34202","PROMOTOR CULTURAL Y DEPORTIVO","P",2,1003,27,"N05",199918,999999,0,0,7776.84,0,"40.0","00.0","20190201"]
[null,1,"CF19201","TUTOR ESCOLAR","P",2,1003,27,"N06",199918,999999,0,0,8089.36,0,"40.0","00.0","20190201"]
[null,1,"CF18203","SUPERVISOR DE MANTENIMIENTO","P",2,1003,27,"N09",199918,999999,0,0,9044.7999999999993,0,"40.0","00.0","20190201"]
[null,1,"CF21202","ASISTENTE ESCOLAR Y SOCIAL","P",2,1003,27,"N07",199918,999999,0,0,8405.34,0,"40.0","00.0","20190201"]
[null,1,"T08201","TECNICO EN GRAFICACION","P",2,1003,27,"N08",199918,999999,0,0,8722.6,0,"40.0","00.0","20190201"]
[null,1,"A03202","SECRETARIA C","P",2,1003,27,"N05",199918,999999,0,0,6973.96,0,"40.0","00.0","20190201"]
[null,1,"CF34202","PROMOTOR CULTURAL Y DEPORTIVO","P",2,1003,27,"N05",199918,999999,0,0,7336.7,0,"40.0","00.0","20190201"]
[null,1,"CF18201","AUXILIAR DE SEGURIDAD","P",2,1003,27,"N02",199918,999999,0,0,6117.66,0,"40.0","00.0","20190201"]
[null,1,"CF02103","DIRECTOR DEL PLANTEL B Y C","P",5,1003,27,"NB2",199918,999999,5753.58,0,0,0,"40.0","00.0","20190201"]
[null,1,"CF02105","COORDINADOR EJECUTIVO II","P",5,1003,27,"N14",199918,999999,5165.88,0,0,0,"40.0","00.0","20190201"]
[null,1,"CF33206","JEFE DE PROYECTO ","P",2,1003,27,"N15",199918,999999,26719.49,0,0,0,"40.0","00.0","20190201"]
[null,1,"CF33206","JEFE DE PROYECTO ","P",2,1003,27,"N15",199918,999999,26343.08,0,0,0,"40.0","00.0","20190201"]
[null,1,"CF33206","JEFE DE PROYECTO ","P",2,1003,27,"N15",199918,999999,26151.64,0,0,0,"40.0","00.0","20190201"]
[null,1,"CF33204","SUBJEFE TECNICO ESPECIALISTA","P",2,1003,27,"N13",199918,999999,18995.099999999999,0,0,0,"40.0","00.0","20190201"]
[null,1,"CF33204","SUBJEFE TECNICO ESPECIALISTA","P",2,1003,27,"N13",199918,999999,17919.82,0,0,0,"40.0","00.0","20190201"]
[null,1,"CF33204","SUBJEFE TECNICO ESPECIALISTA","P",2,1003,27,"N13",199918,999999,14544.19,0,0,0,"40.0","00.0","20190201"]
[null,1,"CF18203","SUPERVISOR DE MANTENIMIENTO","P",2,1003,27,"N09",199918,999999,10740.5,0,0,0,"40.0","00.0","20190201"]
[null,1,"CF04201","SECRETARIA B","P",2,1003,27,"N07",199918,999999,9981.19,0,0,0,"40.0","00.0","20190201"]
[null,1,"CF19201","TUTOR ESCOLAR","P",2,1003,27,"N06",199918,999999,9606.34,0,0,0,"40.0","00.0","20190201"]
[null,1,"CF19201","TUTOR ESCOLAR","P",2,1003,27,"N06",199918,999999,9062.64,0,0,0,"40.0","00.0","20190201"]
[null,1,"CF34202","PROMOTOR CULTURAL Y DEPORTIVO","P",2,1003,27,"N05",199918,999999,9371.94,0,0,0,"40.0","00.0","20190201"]
[null,1,"A03202","SECRETARIA C","P",2,1003,27,"N05",199918,999999,9371.94,0,0,0,"40.0","00.0","20190201"]
[null,1,"S01202","AUXILIAR DE SERVICIOS GENERALES","P",2,1003,27,"N04",199918,999999,8867.02,0,0,0,"40.0","00.0","20190201"]
[null,1,"CF34201","TECNICO BIBLIOTECARIO","P",2,1003,27,"N06",199918,999999,9606.34,0,0,0,"40.0","00.0","20190201"]
[null,1,"S01201","ASISTENTE DE SERVICIOS BASICOS","P",2,1003,27,"N02",199918,999999,8137.16,0,0,0,"40.0","00.0","20190201"]
[null,1,"S01201","ASISTENTE DE SERVICIOS BASICOS","P",2,1003,27,"N02",199918,999999,7676.53,0,0,0,"40.0","00.0","20190201"]
[null,1,"S01201","ASISTENTE DE SERVICIOS BASICOS","P",2,1003,27,"N02",199918,999999,7265.15,0,0,0,"40.0","00.0","20190201"]
[null,1,"ED01201","TECNICO EN MATERIALES DIDACTICOS","P",2,1003,27,"N06",199918,999999,9606.34,0,0,0,"40.0","00.0","20190201"]
[null,1,"CF18201","AUXILIAR DE SEGURIDAD","P",2,1003,27,"N02",199918,999999,7676.53,0,0,0,"40.0","00.0","20190201"]
[null,1,"CF18201","AUXILIAR DE SEGURIDAD","P",2,1003,27,"N02",199918,999999,7265.15,0,0,0,"40.0","00.0","20190201"]
[null,1,"CF02103","DIRECTOR DEL PLANTEL B Y C","P",5,1003,27,"NB1",199918,999999,0,0,5753.58,0,"40.0","00.0","20190201"]
[null,1,"CF02105","COORDINADOR EJECUTIVO II","P",5,1003,27,"OB2",199918,999999,0,0,5165.8900000000003,0,"40.0","00.0","20190201"]
[null,1,"CF33206","JEFE DE PROYECTO","P",2,1003,27,"N15",199918,999999,0,0,24664.639999999999,0,"40.0","00.0","20190201"]
[null,1,"CF33206","JEFE DE PROYECTO","P",2,1003,27,"N15",199918,999999,0,0,22022.23,0,"40.0","00.0","20190201"]
[null,1,"CF33204","SUBJEFE TECNICO ESPECIALISTA","P",2,1003,27,"N13",199918,999999,0,0,15996.41,0,"40.0","00.0","20190201"]
[null,1,"CF33204","SUBJEFE TECNICO ESPECIALISTA","P",2,1003,27,"N13",199918,999999,0,0,15090.75,0,"40.0","00.0","20190201"]
[null,1,"CF33204","SUBJEFE TECNICO ESPECIALISTA","P",2,1003,27,"N13",199918,999999,0,0,14282.14,0,"40.0","00.0","20190201"]
[null,1,"CF33203","TECNICO FINANCIERO","P",2,1003,27,"N09",199918,999999,0,0,9044.7800000000007,0,"40.0","00.0","20190201"]
[null,1,"CF34202","PROMOTOR CULTURAL Y DEPORTIVO","P",2,1003,27,"N05",199918,999999,0,0,7776.84,0,"40.0","00.0","20190201"]
[null,1,"CF21202","ASISTENTE ESCOLAR Y SOCIAL","P",2,1003,27,"N07",199918,999999,0,0,8405.35,0,"40.0","00.0","20190201"]
[null,1,"CF19201","TUTOR ESCOLAR","P",2,1003,27,"N06",199918,999999,0,0,8089.37,0,"40.0","00.0","20190201"]
[null,1,"A03202","SECRETARIA C","P",2,1003,27,"N05",199918,999999,0,0,7776.84,0,"40.0","00.0","20190201"]
[null,1,"A03202","SECRETARIA C","P",2,1003,27,"N05",199918,999999,0,0,7336.71,0,"40.0","00.0","20190201"]
[null,1,"CF04201","SECRETARIA B","P",2,1003,27,"N05",199918,999999,0,0,8405.35,0,"40.0","00.0","20190201"]
[null,1,"CF34201","TECNICO BIBLIOTECARIO","P",2,1003,27,"N06",199918,999999,0,0,8089.37,0,"40.0","00.0","20190201"]
[null,1,"S01201","ASISTENTE DE SERVICIOS BASICOS","P",2,1003,27,"N02",199918,999999,0,0,6852.11,0,"40.0","00.0","20190201"]
[null,1,"S01201","ASISTENTE DE SERVICIOS BASICOS","P",2,1003,27,"N02",199918,999999,0,0,6464.34,0,"40.0","00.0","20190201"]
[null,1,"S01201","ASISTENTE DE SERVICIOS BASICOS","P",2,1003,27,"N02",199918,999999,0,0,6117.66,0,"40.0","00.0","20190201"]
[null,1,"S01202","AUXILIAR DE SERVICIOS GENERALES","P",2,1003,27,"N04",199918,999999,0,0,7467,0,"40.0","00.0","20190201"]
[null,1,"CF18201","AUXILIAR DE SEGURIDAD","P",2,1003,27,"N02",199918,999999,0,0,6852.11,0,"40.0","00.0","20190201"]
[null,1,"S01201","ASISTENTE DE SERVICIOS BASICOS","P",2,1003,27,"N02",199918,999999,7676.52,0,0,0,"40.0","00.0","20190201"]
[null,1,"S01201","ASISTENTE DE SERVICIOS BASICOS","P",2,1003,27,"N02",199918,999999,7676.52,0,0,0,"40.0","00.0","20190201"]
[null,1,"S01202","AUXILIAR DE SERVICIOS GENERALES","P",2,1003,27,"N04",199918,999999,8364.84,0,0,0,"40.0","00.0","20190201"]
[null,1,"S01202","AUXILIAR DE SERVICIOS GENERALES","P",2,1003,27,"N04",199918,999999,8867.02,0,0,0,"40.0","00.0","20190201"]
[null,1,"S01202","AUXILIAR DE SERVICIOS GENERALES","P",2,1003,27,"N04",199918,999999,8867.02,0,0,0,"40.0","00.0","20190201"]
[null,1,"CF34202","PROMOTOR CULTURAL Y DEPORTIVO","P",2,1003,27,"N05",199918,999999,9371.94,0,0,0,"40.0","00.0","20190201"]
[null,1,"A03202","SECRETARIA C","P",2,1003,27,"N05",199918,999999,9371.94,0,0,0,"40.0","00.0","20190201"]
[null,1,"A03202","SECRETARIA C","P",2,1003,27,"N05",199918,999999,9371.94,0,0,0,"40.0","00.0","20190201"]
[null,1,"A03202","SECRETARIA C","P",2,1003,27,"N05",199918,999999,9371.94,0,0,0,"40.0","00.0","20190201"]
[null,1,"A03202","SECRETARIA C","P",2,1003,27,"N05",199918,999999,9371.94,0,0,0,"40.0","00.0","20190201"]
[null,1,"CF19201","TUTOR ESCOLAR","P",2,1003,27,"N06",199918,999999,9606.34,0,0,0,"40.0","00.0","20190201"]
[null,1,"CF04201","SECRETARIA B","P",2,1003,27,"N07",199918,999999,9981.2000000000007,0,0,0,"40.0","00.0","20190201"]
[null,1,"CF18203","SUPERVISOR DE MANTENIMIENTO","P",2,1003,27,"N09",199918,999999,10740.5,0,0,0,"40.0","00.0","20190201"]
[null,1,"CF18203","SUPERVISOR DE MANTENIMIENTO","P",2,1003,27,"N09",199918,999999,10740.5,0,0,0,"40.0","00.0","20190201"]
[null,1,"CF33203","TECNICO FINANCIERO","P",2,1003,27,"N09",199918,999999,10740.5,0,0,0,"40.0","00.0","20190201"]
[null,1,"CF33204","SUBJEFE TECNICO ESPECIALISTA","P",2,1003,27,"N13",199918,999999,18995.5,0,0,0,"40.0","00.0","20190201"]
[null,1,"CF33204","SUBJEFE TECNICO ESPECIALISTA","P",2,1003,27,"N13",199918,999999,18995.5,0,0,0,"40.0","00.0","20190201"]
[null,1,"CF33204","SUBJEFE TECNICO ESPECIALISTA","P",2,1003,27,"N13",199918,999999,18995.5,0,0,0,"40.0","00.0","20190201"]
[null,1,"CF33204","SUBJEFE TECNICO ESPECIALISTA","P",2,1003,27,"N13",199918,999999,18995.5,0,0,0,"40.0","00.0","20190201"]
[null,1,"CF33204","SUBJEFE TECNICO ESPECIALISTA","P",2,1003,27,"N13",199918,999999,18995.5,0,0,0,"40.0","00.0","20190201"]
[null,1,"CF02105","COORDINADOR EJECUTIVO II","P",5,1003,27,"OB2",199918,999999,5165.88,0,0,0,"40.0","00.0","20190201"]
[null,1,"CF33206","JEFE DE PROYECTO","P",2,1003,27,"N15",199918,999999,26719.48,0,0,0,"40.0","00.0","20190201"]
[null,1,"CF33206","JEFE DE PROYECTO","P",2,1003,27,"N15",199918,201807,26719.48,0,0,0,"40.0","00.0","20190201"]
[null,1,"CF33206","JEFE DE PROYECTO","P",2,1003,27,"N15",199918,999999,26719.48,0,0,0,"40.0","00.0","20190201"]
[null,1,"CF33206","JEFE DE PROYECTO","P",2,1003,27,"N15",199918,999999,26151.64,0,0,0,"40.0","00.0","20190201"]
[null,1,"CF33206","JEFE DE PROYECTO","P",2,1003,27,"N15",199918,999999,26151.64,0,0,0,"40.0","00.0","20190201"]
[null,1,"CF33206","JEFE DE PROYECTO","P",2,1003,27,"N15",199918,999999,26151.64,0,0,0,"40.0","00.0","20190201"]
[null,1,"CF02103","DIRECTOR DEL PLANTEL B Y C","P",5,1003,27,"NB2",199918,999999,5753.58,0,0,0,"40.0","00.0","20190201"]
[null,1,"CF02103","DIRECTOR DEL PLANTEL B Y C","P",5,1003,27,"NB1",199918,999999,0,0,5753.58,0,"40.0","00.0","20190201"]
[null,1,"CF02105","COORDINADOR EJECUTIVO II","P",5,1003,27,"OB2",199918,999999,0,0,5165.88,0,"40.0","00.0","20190201"]
[null,1,"CF33206","JEFE DE PROYECTO ","P",2,1003,27,"N15",199918,999999,0,0,23865.16,0,"40.0","00.0","20190201"]
[null,1,"CF33206","JEFE DE PROYECTO ","P",2,1003,27,"N15",199918,999999,0,0,22514.7,0,"40.0","00.0","20190201"]
[null,1,"CF33203","TECNICO FINANCIERO","P",2,1003,27,"N09",199918,999999,0,0,8751.6,0,"40.0","00.0","20190201"]
[null,1,"CF04201","SECRETARIA B","P",2,1003,27,"N07",199918,999999,0,0,8132.9,0,"40.0","00.0","20190201"]
[null,1,"CF19201","TUTOR ESCOLAR","P",2,1003,27,"N04",199918,999999,0,0,7827.16,0,"40.0","00.0","20190201"]
[null,1,"A03202","SECRETARIA C","P",2,1003,27,"N09",199918,999999,0,0,7524.76,0,"40.0","00.0","20190201"]
[null,1,"S01202","AUXILIAR DE SERVICIOS GENERALES","P",2,1003,27,"N06",199918,999999,0,0,7224.96,0,"40.0","00.0","20190201"]
[null,1,"CF34201","TECNICO BIBLIOTECARIO","P",2,1003,27,"N06",199918,999999,0,0,7384.1,0,"40.0","00.0","20190201"]
[null,1,"S01201","ASISTENTE DE SERVICIOS BASICOS","P",2,1003,27,"N05",199918,999999,0,0,6254.8,0,"40.0","00.0","20190201"]
[null,1,"S01201","ASISTENTE DE SERVICIOS BASICOS","P",2,1003,27,"N02",199918,999999,0,0,5919.36,0,"40.0","00.0","20190201"]
[null,1,"CF18201","AUXILIAR DE SEGURIDAD","P",2,1003,27,"N02",199918,999999,0,0,6254.8,0,"40.0","00.0","20190201"]
[null,1,"CF18203","SUPERVISOR DE MANTENIMIENTO","P",2,1003,27,"N02",199918,999999,0,0,8751.6,0,"40.0","00.0","20190201"]
[null,1,"A03202","SECRETARIA C","P",2,1003,27,"N05",199918,999999,0,0,7776.84,0,"40.0","00.0","20190201"]
[null,1,"CF33206","JEFE DE PROYECTO","P",2,1003,27,"N15",199918,999999,0,0,24664.66,0,"40.0","00.0","20190201"]
[null,1,"CF33206","JEFE DE PROYECTO","P",2,1003,27,"N15",199918,999999,0,0,22022.26,0,"40.0","00.0","20190201"]
[null,1,"CF33203","TECNICO FINANCIERO","P",2,1003,27,"N09",199918,999999,0,0,9044.7999999999993,0,"40.0","00.0","20190201"]
[null,1,"S01201","ASISTENTE DE SERVICIOS BASICOS","P",2,1003,27,"N02",199918,999999,0,0,6464.34,0,"40.0","00.0","20190201"]
[null,1,"CF02104","DIRECTOR DE PLANTEL D Y E","P",5,1003,27,"NA2",199918,999999,0,0,5165.88,0,"40.0","00.0","20190201"]
[null,1,"CF33204","SUBJEFE TECNICO ESPECIALISTA","P",2,1003,27,"N13",199918,999999,0,0,15996.4,0,"40.0","00.0","20190201"]
[null,1,"CF18203","SUPERVISOR DE MANTENIMIENTO","P",2,1003,27,"N09",199918,999999,0,0,9044.7999999999993,0,"40.0","00.0","20190201"]
[null,1,"CF18201","AUXILIAR DE SEGURIDAD","P",2,1003,27,"N02",199918,999999,0,0,6852.1,0,"40.0","00.0","20190201"]
[null,1,"CF04201","SECRETARIA B","P",2,1003,27,"N07",199918,999999,0,0,8405.34,0,"40.0","00.0","20190201"]
[null,1,"T08201","TECNICO EN GRAFICACION","P",2,1003,27,"N08",199918,999999,0,0,8722.6,0,"40.0","00.0","20190201"]
[null,1,"S01202","AUXILIAR DE SERVICIOS GENERALES","P",2,1003,27,"N04",199918,999999,0,0,7467,0,"40.0","00.0","20190201"]
[null,1,"CF19201","TUTOR ESCOLAR","P",2,1003,27,"N06",199918,999999,0,0,7631.46,0,"40.0","00.0","20190201"]
[null,1,"CF21202","ASISTENTE ESCOLAR Y SOCIAL","P",2,1003,27,"N07",199918,999999,0,0,8405.34,0,"40.0","00.0","20190201"]
[null,1,"CF02103","DIRECTOR DEL PLANTEL B Y C","P",2,1003,27,"NB2",199918,999999,0,0,5753.58,0,"40.0","00.0","20190201"]
[null,1,"CF02105","COORDINADOR EJECUTIVO II","P",2,1003,27,"OB2",199918,999999,0,0,5165.88,0,"40.0","00.0","20190201"]
[null,1,"CF33206","JEFE DE PROYECTO","P",2,1003,27,"N15",199918,999999,0,0,23865.16,0,"40.0","00.0","20190201"]
[null,1,"CF33206","JEFE DE PROYECTO","P",2,1003,27,"N15",199918,999999,0,0,21308.400000000001,0,"40.0","00.0","20190201"]
[null,1,"CF33204","SUBJEFE TECNICO ESPECIALISTA","P",2,1003,27,"N13",199918,999999,0,0,15477.9,0,"40.0","00.0","20190201"]
[null,1,"CF33204","SUBJEFE TECNICO ESPECIALISTA","P",2,1003,27,"N13",199918,999999,0,0,13819.2,0,"40.0","00.0","20190201"]
[null,1,"CF18203","SUPERVISOR DE MANTENIMIENTO","P",2,1003,27,"N09",199918,999999,0,0,8751.6,0,"40.0","00.0","20190201"]
[null,1,"CF19201","TUTOR ESCOLAR","P",2,1003,27,"N06",199918,999999,0,0,7827.16,0,"40.0","00.0","20190201"]
[null,1,"CF04201","SECRETARIA B","P",2,1003,27,"N07",199918,999999,0,0,8132.9,0,"40.0","00.0","20190201"]
[null,1,"A03202","SECRETARIA C","P",2,1003,27,"N05",199918,999999,0,0,7524.76,0,"40.0","00.0","20190201"]
[null,1,"S01201","ASISTENTE DE SERVICIOS BASICOS","P",2,1003,27,"N02",199918,999999,0,0,6254.8,0,"40.0","00.0","20190201"]
[null,1,"S01202","AUXILIAR DE SERVICIOS GENERALES","P",2,1003,27,"N04",199918,999999,0,0,6815.94,0,"40.0","00.0","20190201"]
[null,1,"S01202","AUXILIAR DE SERVICIOS GENERALES","P",2,1003,27,"N04",199918,999999,0,0,7224.96,0,"40.0","00.0","20190201"]
[null,1,"CF18201","AUXILIAR DE SEGURIDAD","P",2,1003,27,"N02",199918,999999,0,0,6254.8,0,"40.0","00.0","20190201"]
[null,1,"CF18201","AUXILIAR DE SEGURIDAD","P",2,1003,27,"N02",199918,999999,0,0,6630,0,"40.0","00.0","20190201"]
[null,1,"CF02100","SUBCOORDINADOR","P",5,1003,27,"OC2",199918,999999,0,0,5165.8900000000003,0,"40.0","00.0","20190201"]
[null,1,"CF33206","JEFE DE PROYECTO","P",2,1003,27,"N15",199918,999999,0,0,24664.65,0,"40.0","00.0","20190201"]
[null,1,"CF33206","JEFE DE PROYECTO","P",2,1003,27,"N15",199918,999999,0,0,23268.95,0,"40.0","00.0","20190201"]
[null,1,"CF34201","TECNICO BIBLIOTECARIO","P",2,1003,27,"N06",199918,999999,0,0,8089.35,0,"40.0","00.0","20190201"]
[null,1,"CF33204","SUBJEFE TECNICO ESPECIALISTA","P",2,1003,27,"N13",199918,999999,0,0,15996.4,0,"40.0","00.0","20190201"]
[null,1,"CF11100","DIRECTOR GENERAL ESTATAL","P",5,1003,27,"MC2",199918,999999,0,0,11552.21,0,"40.0","00.0","20190201"]
[null,1,"S01201","ASISTENTE DE SERVICIOS BASICOS","P",2,1003,27,"N02",199918,999999,0,0,6852.1,0,"40.0","00.0","20190201"]
[null,1,"CF34205","ADMINISTRATIVO TECNICO ESPECIALISTA","P",2,1003,27,"N11",199918,999999,0,0,9698.2999999999993,0,"40.0","00.0","20190201"]
[null,1,"ED01201","TECNICO DE MATERIALES DIDACTICOS","P",2,1003,27,"N06",199918,999999,0,0,8089.35,0,"40.0","00.0","20190201"]
[null,1,"T08201","TECNICO EN GRAFICACION","P",2,1003,27,"N08",199918,999999,0,0,8722.6,0,"40.0","00.0","20190201"]
[null,1,"CF11102","DIRECTOR DEL CENTRO","P",5,1003,27,"NB2",199918,999999,5753.58,0,0,0,"40.0","00.0","20190201"]
[null,"1","CF01601","JEFE DE UNIDAD","P",5,1003,27,"OC1",199918,999999,5165.8900000000003,0,0,0,"40.0","00.0","20190201"]
[null,"1","CF33204","SUBJEFE TECNICO ESPECIALISTA","P",2,1003,27,"N13",199918,999999,18995.099999999999,0,0,0,"40.0","00.0","20190201"]
[null,null,null,null,null,null,null,null,null,null,"Total Zona A:",{"$f":"SUBTOTAL(109,Tabla16[Monto Mensual Jornada ó de HSM\nZona A])","v":700373.10000000009}]
[null,null,null,null,null,null,null,null,null,null,null,"Total Zona B:",{"$f":"SUM(M19:M170)","v":0}]
[null,null,null,null,null,null,null,null,null,null,null,null,"Total Zona C:",{"$f":"SUM(N19:N171)","v":1000878.6699999999}]
[]
[null,"Fuente : Información proporcionada por las Entidades Federativas"]

{"sheet":"II D) 7 3","index":13,"n_rows":95,"n_cols":11,"rows_kept":95,"cut":false,"hidden":false,"merged":[[9,1,9,7],[8,9,8,10],[9,9,9,10]]}
[]
[]
[]
[]
[]
[]
[]
[]
[null,"Formato: Catálogo de Percepciones y Deducciones",null,null,null,null,null,null,"Entidad Federativa:",{"$f":"IF('1'!D21=\"Elige el Periodo…\",\"\",'1'!D21)","v":"CHIHUAHUA "}]
[null,{"$f":"IF('1'!D22=\"Elige el Periodo…\",\"\",'1'!D22)","v":"Fondo de Aportaciones para la Educación Tecnológica y de Adultos/Colegio Nacional de Educación Profesional Técnica (FAETA/CONALEP)"},null,null,null,null,null,null,null,"3er. Trimestre 2019"]
[]
[]
[null,"Identificador origen presupuestal de la plaza","Tipo de concepto de pago ","Origen de financiamiento del concepto de percepciones.","Porcentaje de participación federal por fuente de recursos","Grupo al que pertenece concepto de pago (Percepción y/o Deducción)","Clave de concepto de pago","Descripción del concepto de pago ","Partida presupuestal","Fecha del","Fecha  al"]
[]
[null,"Identificador origen presupuestal de la plaza","Tipo de concepto de pago ","Origen de financiamiento del concepto de percepciones.","Porcentaje de participación federal por fuente de recursos","Grupo al que pertenece concepto de pago (Percepción y/o Deducción)","Clave de concepto de pago","Descripción del concepto de pago ","Partida presupuestal","Fecha del","Fecha  al"]
[null,1,"P","F",100,"P2",1003,"SALARIO BASE",83301,19990918,99999999]
[null,1,"P","F",100,"P3",2766,"PRIMA DE ANTIGÜEDAD",83301,19990918,99999999]
[null,1,"P","F",100,"P1",5050,"EXCESO DE CREDITO AL SALARIO",83301,19990918,99999999]
[null,1,"P","F",100,"P3",2627,"ESTIMULO 10 DE MAYO",83301,19990918,99999999]
[null,1,"P","F",100,"P1",2517,"ESTIMULO POR PRODUCTIVIDAD",83301,19990918,99999999]
[null,1,"P","F",100,"P1",2800,"DESPENSA",83301,19990918,99999999]
[null,1,"P","F",100,"P2",3623,"PRIMA VACACIONAL",83301,19990918,99999999]
[null,1,"P","F",100,"P3",2600,"PUNTUALIDAD Y ASISTENCIA",83301,19990918,99999999]
[null,1,"P","F",100,"P3",4468,"HORAS EXTRAS",83301,19990918,99999999]
[null,1,"P","F",100,"P1",1602,"DESARROLLO Y CAPACITACION",83301,19990918,99999999]
[null,1,"P","F",100,"P3",1624,"PRIMA DOMINICAL",83301,19990918,99999999]
[null,1,"P","F",100,"P3",2754,"GUARDERIA",83301,19990918,99999999]
[null,1,"P","F",100,"P1",2518,"COMPENSACION GARANTIZADA",83301,19990918,99999999]
[null,1,"P","F",100,"P3",2850,"LABORES EN CONDICIONES INSALUBRES",83301,19990918,99999999]
[null,1,"P","F",100,"P3",2680,"ANTEOJOS O LENTES DE CONTACTO",83301,19990918,99999999]
[null,1,"P","F",100,"P3",2655,"APARATOS ORTOPEDICOS",83301,19990918,99999999]
[null,1,"P","F",100,"P3",2810,"AYUDA PARA TITULACION",83301,19990918,99999999]
[null,1,"P","F",100,"P3",2615,"CANASTILLA MATERNAL",83301,19990918,99999999]
[null,1,"P","F",100,"P3",2553,"DIAS ECONOMICOS",83301,19990918,99999999]
[null,1,"P","F",100,"P3",2565,"AJUSTE SALARIAL",83301,19990918,99999999]
[null,1,"P","F",100,"P3",2573,"DIAS DE DESCANSO OBLIGATORIO",83301,19990918,99999999]
[null,1,"P","F",100,"P3",2625,"AYUDA UTILES ESCOLARES",83301,19990918,99999999]
[null,1,"P","F",100,"P2",3613,"AGUINALDO",83301,19990918,99999999]
[null,1,"P","F",100,"P3",2830,"BONIFICACION IMPUESTO",83301,19990918,99999999]
[null,1,"P","F",100,"P3",1601,"NUPCIAS",83301,19990918,99999999]
[null,1,"P","F",100,"P3",2955,"OTRAS PERCEPCIONES",83301,19990918,99999999]
[null,1,"P","F",100,"P1",2805,"PREVISION MULTIPLE",83301,20111116,99999999]
[null,1,"D",null,100,"D3",2950,"OTRAS DEDUCCIONES",null,19990918,99999999]
[null,1,"D",null,100,"D2",5045,"I.S.P.T. A RETENER",null,19990918,99999999]
[null,1,"D",null,100,"D2",2735,"SEGURO DE VIDA AHISA",null,19990918,99999999]
[null,1,"D",null,100,"D1",8523,"CUOTA SINDICAL",null,19990918,99999999]
[null,1,"D",null,100,"D2",2920,"SEGURO DE RETIRO",null,19990918,99999999]
[null,1,"D",null,100,"D3",8135,"PRESTAMO ISSSTE",null,19990918,99999999]
[null,1,"D",null,100,"D3",8095,"CREDITO HIPOTECARIO",null,19990918,99999999]
[null,1,"D",null,100,"D3",5710,"ANTICIPO DE SUELDO",null,19990918,99999999]
[null,1,"D",null,100,"D3",8580,"PENSION ALIMENTICIA",null,19990918,99999999]
[null,1,"D",null,100,"D3",6044,"IMPUESTO A RETENER",null,19990918,99999999]
[null,1,"D",null,100,"D3",1927,"SEGURO DE DAÑOS FOVISSSTE",null,19990918,99999999]
[null,1,"D",null,100,"D3",2910,"PRESTAMO KONDINERO",null,20180401,99999999]
[null,1,"D",null,100,"D3",2915,"SEGURO DE VIDA COMERCIAL AMERICA",null,19990918,99999999]
[null,1,"D",null,100,"D3",2929,"DEDUCCIONES EXTRAS",null,19990918,99999999]
[null,1,"D",null,100,"D2",6250,"ISSSTE SEG SALUD",null,19990918,99999999]
[null,1,"D",null,100,"D2",6251,"ISSSTE SEG SALUD PENSIONADO",null,19990918,99999999]
[null,1,"D",null,100,"D2",6252,"ISSSTE SEG INVALIDEZ Y VIDA",null,19990918,99999999]
[null,1,"D",null,100,"D2",6253,"ISSSTE SEG SOCIALES Y CULT",null,19990918,99999999]
[null,1,"D",null,100,"D2",6254,"ISSSTE SEG RET CESANTIA AVZDA",null,19990918,99999999]
[null,1,"D",null,100,"D3",2740,"PRESTAMO DIMEX",null,19990918,20150415]
[null,1,"D",null,100,"D3",2740,"OTRAS DEDUCCIONES",null,20150416,99999999]
[null,1,"D",null,100,"D3",2912,"AHORRO SOLIDARIO EMP",null,19990918,99999999]
[null,1,"D",null,100,"D3",2880,"CREDITO CREDIFIEL",null,20130601,99999999]
[null,1,"D",null,100,"D3",2717,"SEGURO GENERAL AUTO",null,20150416,99999999]
[null,1,"D",null,100,"D3",2748,"SEGURO GENERAL VIDA",null,20150416,99999999]
[null,1,"D",null,100,"D3",2965,"SEGURO GENERAL SALUD",null,20150416,99999999]
[null,4,"P","F",100,"P1",1001,"SALARIO BASE",83301,20111116,99999999]
[null,4,"P","F",100,"P2",1005,"ESTIMULO",83301,20111116,99999999]
[null,4,"P","F",100,"P2",1006,"HORAS RECUPERADAS",83301,20111116,99999999]
[null,4,"D",null,100,"D1",2001,"I.S.R.",null,20111116,99999999]
[null,4,"D",null,100,"D2",2002,"CUOTA SINDICAL LOCAL",null,20111116,99999999]
[null,4,"D",null,100,"D1",2003,"SEG. SALUD T. ACTIVO",null,20111116,99999999]
[null,4,"D",null,100,"D2",2005,"PENSION ALIMENTICIA",null,20111116,99999999]
[null,4,"D",null,100,"D2",2006,"HORAS NO IMPARTIDAS",null,20111116,99999999]
[null,4,"D",null,100,"D1",2007,"S. RET. CESANTIA AVANZADA",null,20111116,99999999]
[null,4,"D",null,100,"D2",2013,"PRESTAMO ISSSTE",null,20111116,99999999]
[null,4,"D",null,100,"D2",2014,"PRESTAMO ISSSTE CORTO PLAZO",null,20111116,99999999]
[null,4,"D",null,100,"D2",2015,"PRESTAMO HIPOTECARIO",null,20111116,99999999]
[null,4,"D",null,100,"D2",2016,"SEGURO DE DAÑOS FOVISSTE",null,20111116,99999999]
[null,4,"D",null,100,"D2",2019,"TELETON",null,20111116,99999999]
[null,4,"D",null,100,"D3",2020,"PRESTAMO PERSONAL",null,20111116,99999999]
[null,4,"D",null,100,"D3",2021,"PRESTAMO CREDIFIEL",null,20130601,99999999]
[null,4,"D",null,100,"D1",2023,"SEG. SALUD T. PENSIONADO",null,20111116,99999999]
[null,4,"D",null,100,"D2",2024,"APORT. VOL. CRUZ ROJA",null,20111116,99999999]
[null,4,"D",null,100,"D1",2025,"SEG. INV. Y VIDA",null,20111116,99999999]
[null,4,"D",null,100,"D1",2026,"S. SOCIEDAD Y CULT.",null,20111116,99999999]
[null,4,"D",null,100,"D2",2870,"PRESTAMO SALVADOR",null,20140916,99999999]
[null,4,"D",null,100,"D3",2004,"CREDITO SALVADOR",null,20140916,99999999]
[null,4,"P","F",100,"P1",1035,"RETROACTIVO DE AGUINALDO",83301,20141116,99999999]
[null,4,"D",null,100,"D3",2036,"KONDINERO",null,20180401,99999999]
[null,4,"D",null,100,"D3",2038,"SEGURO AUTO",null,20150416,99999999]
[null,4,"D",null,100,"D3",2039,"SEGURO VIDA",null,20150416,99999999]
[null,"Fuente : Información proporcionada por las Entidades Federativas"]

{"sheet":"E)","index":14,"n_rows":27,"n_cols":8,"rows_kept":27,"cut":false,"hidden":false,"merged":[[9,1,9,5],[12,1,14,1],[12,2,14,2],[13,7,14,7],[12,3,14,3],[12,4,14,4],[12,5,12,7],[13,5,14,5],[13,6,14,6],[9,6,9,7]]}
[]
[]
[]
[]
[]
[]
[]
[]
[null,"Formato: Trabajadores que Cobran con RFC / CURP con Formato Incorrecto"]
[null,{"$f":"IF('1'!D22=\"Elige el Periodo…\",\"\",'1'!D22)","v":"Fondo de Aportaciones para la Educación Tecnológica y de Adultos/Colegio Nacional de Educación Profesional Técnica (FAETA/CONALEP)"},null,null,null,null,"3er. Trimestre 2019"]
[]
[]
[null,"Entidad Federativa","RFC","CURP","NOMBRE TRABAJADOR","Motivo"]
[null,null,null,null,null,"Sin RFC o erroneo","RFC Sin Homoclave","Sin CURP o Erronea"]
[]
[]
[null,"Entidad Federativa","RFC","CURP","NOMBRE TRABAJADOR","Sin RFC o erroneo","RFC Sin Homoclave","Sin CURP o Erronea"]
[]
[]
[]
[]
[]
[]
[null,"Total Personas : ",null,null,"Total Sin RFC o Erroneo:"]
[null,null,null,null,null,"Total RFC Sin Homoclave:"]
[null,null,null,null,null,null,"Total Sin CURP o Erroneo:"]
[null,"Fuente : Información proporcionada por las Entidades Federativas"]

{"sheet":"F) 1","index":15,"n_rows":27,"n_cols":19,"rows_kept":27,"cut":false,"hidden":false,"merged":[[9,1,9,6],[12,15,13,15],[12,16,13,16],[12,17,12,18],[12,1,13,1],[12,2,13,2],[12,3,13,3],[12,4,13,4],[12,5,13,5],[12,6,13,6],[12,7,13,7],[12,8,12,14],[9,17,9,18]]}
[]
[]
[]
[]
[]
[]
[]
[]
[null,"Formato: Trabajadores con Doble Asignación Salarial en Municipios no Colindantes Geográficamente"]
[null,{"$f":"IF('1'!D22=\"Elige el Periodo…\",\"\",'1'!D22)","v":"Fondo de Aportaciones para la Educación Tecnológica y de Adultos/Colegio Nacional de Educación Profesional Técnica (FAETA/CONALEP)"},null,null,null,null,null,null,null,null,null,null,null,null,null,null,null,"3er. Trimestre 2019"]
[]
[]
[null,"Entidad Federativa","Municipio","Localidad","RFC","CURP","Nombre del Trabajador","Clave integrada","Clave Presupuestal",null,null,null,null,null,null,"Clave CT","Nombre CT","Periodo en el CT"]
[null,null,null,null,null,null,null,null,"Partida Presupuestal","Código de Pago","Clave de Unidad","Clave de Sub Unidad","Clave de Categoría","Horas Semana Mes ","Número de Plaza",null,null,"Desde","Hasta"]
[]
[null,"Entidad Federativa","Municipio","Localidad","RFC","CURP","Nombre del Trabajador","Clave integrada","Partida Presupuestal","Código de Pago","Clave de Unidad","Clave de Sub Unidad","Clave de Categoría","Horas semana mes","Número de Plaza","Clave CT","Nombre CT","Periodo en el CT\nDesde","Periodo en el CTH\nasta"]
[]
[]
[]
[]
[]
[]
[null,"Total Personas : ",null,null,null,null,null,null,null,null,null,null,"Total Plazas : "]
[]
[]
[null,"Fuente : Información proporcionada por las Entidades Federativas"]
[null,"Importante: Listar Sólo los Municipios no Colindantes"]

{"sheet":"F) 2","index":16,"n_rows":27,"n_cols":20,"rows_kept":27,"cut":false,"hidden":false,"merged":[[13,3,14,3],[13,4,14,4],[13,5,14,5],[10,1,10,9],[13,19,14,19],[13,18,14,18],[13,6,13,12],[13,13,14,13],[13,14,14,14],[13,15,14,15],[13,16,13,17],[13,1,14,1],[13,2,14,2]]}
[]
[]
[]
[]
[]
[]
[]
[]
[]
[null,"Formato: Trabajadores Ocupando Plazas que Superan el Número de Horas de Compatibilidad Autorizadas"]
[null,{"$f":"IF('1'!D22=\"Elige el Periodo…\",\"\",'1'!D22)","v":"Fondo de Aportaciones para la Educación Tecnológica y de Adultos/Colegio Nacional de Educación Profesional Técnica (FAETA/CONALEP)"},null,null,null,null,null,null,null,null,null,null,null,null,null,null,null,null,"3er. Trimestre 2019"]
[]
[]
[null,"Entidad Federativa","RFC","CURP","Nombre","Clave integrada","Clave Presupuestal",null,null,null,null,null,null,"CT","Nombre CT","Turno CT","Periodo",null,"Total de Horas en el CT","Horas de compatibilidad de la categoría"]
[null,null,null,null,null,null,"Partida Presupuestal","Código de Pago","Clave de Unidad","Clave de Sub Unidad","Clave de Categoría","Horas Semana Mes ","Número de Plaza",null,null,null,"Desde","Hasta"]
[]
[null,"Entidad Federativa","RFC","CURP","Nombre","Clave integrada","Partida Presupuestal","Código de Pago","Clave de Unidad","Clave de Sub Unidad","Clave de Categoría","Horas semana mes","Número de plaza","CT","Nombre CT","Turno CT","Periodo\nDesde","Periodo\nHasta","Total de Horas en el CT","Horas de compatibilidad de la categoría"]
[]
[]
[]
[]
[]
[]
[null,"Total Personas : ",null,null,null,null,null,null,null,null,"Total Plazas : "]
[]
[]
[null,"Fuente : Información proporcionada por las Entidades Federativas"]

{"sheet":"G)","index":17,"n_rows":28,"n_cols":20,"rows_kept":28,"cut":false,"hidden":false,"merged":[[10,1,10,8],[12,5,12,11],[13,1,14,1],[13,2,14,2],[13,3,14,3],[13,4,14,4],[13,5,14,5],[13,6,13,12],[10,18,10,19],[13,19,14,19],[13,13,14,13],[13,14,14,14],[13,15,13,16],[13,17,14,17],[13,18,14,18]]}
[]
[]
[]
[]
[]
[]
[]
[]
[]
[null,"Formato: Trabajadores Cuyo Salario Básico Supere los Ingresos Promedio de un Docente en la Categoría más Alta del Tabulador Salarial Correspondiente a Cada Entidad"]
[null,{"$f":"IF('1'!D22=\"Elige el Periodo…\",\"\",'1'!D22)","v":"Fondo de Aportaciones para la Educación Tecnológica y de Adultos/Colegio Nacional de Educación Profesional Técnica (FAETA/CONALEP)"},null,null,null,null,null,null,null,null,null,null,null,null,null,null,null,null,"3er. Trimestre 2019"]
[]
[]
[null,"Entidad Federativa","R.F.C.","CURP","Nombre","Clave integrada","Clave Presupuestal Integrada y Categoria aparte",null,null,null,null,null,null,"Clave CT Origen","Nombre CT","Periodo",null,"Monto de Remuneraciones Mensuales ","Monto de referencia","Diferencia\n(R-S)"]
[null,null,null,null,null,null,"Partida Presupuestal","Código de Pago","Clave de Unidad","Clave de Sub Unidad","Clave de Categoría","Horas Semana Mes ","Número de Plaza",null,null,"Desde","Hasta"]
[]
[null,"Entidad Federativa","R.F.C.","CURP","Nombre","Clave integrada","Partida Presupuestal","Código de Pago","Clave de Unidad","Clave de Sub Unidad","Clave de Categoría","Horas Semana Mes ","No. de plaza","CT","Nombre CT","Periodo\nDesde","Periodo\nHasta","Monto de Remuneraciones Mensuales ","Monto de referencia","Diferencia\n(R-S)"]
[]
[]
[]
[]
[]
[]
[null,"Total Personas : ",null,null,null,null,null,null,null,null,null,null,null,null,"Total Remuneraciones Mensuales:"]
[]
[null,null,null,null,null,null,null,null,null,null,null,null,null,null,null,null,null,"Total Diferencia:"]
[]
[null,"Fuente : Información proporcionada por las Entidades Federativas"]

{"sheet":"H)","index":18,"n_rows":13,"n_cols":8,"rows_kept":13,"cut":false,"hidden":false,"merged":[[0,1,0,2]]}
[null,"3er. Trimestre 2019"]
[null,"Movimientos de Personal por Centro de Trabajo"]
[null,"Personal Registrado en la Nómina Federalizada"]
[null,"Nómina","Plaza (Clave presupuestal)","Categoría de la plaza","RFC","CURP","Nombre","Movimientos"]
[]
[]
[]
[]
[]
[]
[null,"Información reportada por la Entidad Federativa, correspondiente al periodo"]
[null,"La Entidad Federativa pudo haber reportado pagos a más de una persona con la misma plaza por distintos motivos de carácter administrativo"]
[null,"Alta: Se refiere a la incorporación de la plaza a la Base de Datos en este sistema"]

{"sheet":"Listas","index":19,"n_rows":42,"n_cols":8,"rows_kept":42,"cut":false,"hidden":true,"merged":[]}
[]
[]
[]
[null,"Elige un Fondo…"]
[null,"Fondo de Aportaciones para la Educación Básica y Normal (FAEB)"]
[null,"Fondo de Aportaciones para la Educación Tecnológica y de Adultos/Colegio Nacional de Educación Profesional Técnica (FAETA/CONALEP)"]
[null,"Fondo de Aportaciones para la Educación Tecnológica y de Adultos/Instituto Nacional para la Educación de los Adultos (FAETA/INEA)"]
[]
[]
[null,null,null,null,null,null,null,"Elige la Entidad Federativa…"]
[null,"Elige el Periodo…",null,null,null,null,null,"AGUASCALIENTES"]
[null,"1er. Trimestre",null,null,null,null,null,"BAJA CALIFORNIA"]
[null,"2do. Trimestre",null,null,null,null,null,"BAJA CALIFORNIA SUR"]
[null,"3er. Trimestre",null,null,null,null,null,"CAMPECHE"]
[null,"4to. Trimestre",null,null,null,null,null,"COAHUILA "]
[null,null,null,"Elige el Año…",null,null,null,"COLIMA "]
[null,null,null,2013,null,null,null,"CHIAPAS "]
[null,null,null,2014,null,null,null,"CHIHUAHUA "]
[null,null,null,2015,null,null,null,"DISTRITO FEDERAL"]
[null,null,null,2016,null,null,null," DURANGO "]
[null,null,null,2017,null,null,null," GUANAJUATO "]
[null,null,null,2018,null,null,null," GUERRERO "]
[null,null,null,null,null,null,null," HIDALGO"]
[null,null,null,null,null,null,null," JALISCO "]
[null,null,null,null,null,null,null," MEXICO "]
[null,null,null,null,null,null,null," MICHOACAN "]
[null,null,null,null,null,null,null," MORELOS "]
[null,null,null,null,null,null,null," NAYARIT "]
[null,null,null,null,null,null,null," NUEVO LEON"]
[null,null,null,null,null,null,null," OAXACA "]
[null,null,null,null,null,null,null," PUEBLA "]
[null,null,null,null,null,null,null," QUERETARO "]
[null,null,null,null,null,null,null," QUINTANA ROO"]
[null,null,null,null,null,null,null," SAN LUIS"]
[null,null,null,null,null,null,null," SINALOA "]
[null,null,null,null,null,null,null," SONORA "]
[null,null,null,null,null,null,null," TABASCO "]
[null,null,null,null,null,null,null," TAMAULIPAS "]
[null,null,null,null,null,null,null," TLAXCALA "]
[null,null,null,null,null,null,null," VERACRUZ"]
[null,null,null,null,null,null,null," YUCATÁN "]
[null,null,null,null,null,null,null," ZACATECAS "]