{"text_format":"1","workbook":"xlsx","n_sheets":20,"sheets":["1","CARATULA RESUMEN","A Y  II D3","A Y II D4","B)","II B) Y 1","II C y 1_","II D) 2","II D) 4","II D) 4 A","II D) 6","II D) 7 1","II D) 7 2 ","II D) 7 3","E)","F) 1","F) 2","G)","H)","Listas"],"not_rendered":{"charts":0,"images":16,"macros":1,"external_links":0,"defined_names":18,"comments":16,"pivot_tables":0},"unopened":[],"bounds":{"document_bytes":16777216,"sheet_cells":100000,"rows_first":2000,"rows_last":500,"rows_between":2000,"halvings":0,"cell_chars":16384,"cell_head_chars":4096},"cells_cut":0,"cells_raw":0,"read":"whole","date_system":"1900"}

{"sheet":"1","index":0,"n_rows":73,"n_cols":18,"rows_kept":73,"cut":false,"hidden":false,"merged":[[69,2,69,5],[71,2,71,5],[72,2,72,5],[73,2,73,5],[20,3,20,14],[21,3,21,14],[22,3,22,14],[49,3,49,6],[62,2,62,5],[63,2,63,5],[65,2,65,5],[66,2,66,5],[68,2,68,5],[43,3,43,6],[44,3,44,6],[45,3,45,6],[46,3,46,6],[47,3,47,6],[48,3,48,6],[37,3,37,6],[38,3,38,6],[39,3,39,6],[40,3,40,6],[41,3,41,6],[42,3,42,6],[36,3,36,6],[10,3,10,18],[11,3,11,18],[12,3,12,18],[34,3,34,6],[35,3,35,6]]}
[]
[]
[]
[]
[]
[]
[]
[]
[]
[]
[]
[null,null,null,"FORMATOS ENTREGADOS PARA DAR CUMPLIMIENTO AL ARTICULO 73 DE \"LA LEY GENERAL DE CONTABILIDAD GUBERNAMENTAL\""]
[]
[]
[]
[]
[]
[]
[]
[]
[null,null,"Entidad Federativa :","CHIHUAHUA "]
[null,null,"Fondo :","Fondo de Aportaciones para la Educación Tecnológica y de Adultos/Colegio Nacional de Educación Profesional Técnica (FAETA/CONALEP)"]
[null,null,"Periodo :","2do. Trimestre"]
[]
[]
[]
[]
[]
[]
[]
[]
[null,null,null,null,null,null,null,"TOTAL REGISTROS ",null,"Num. de Paginas",null,"TOTAL PERSONAS",null,"TOTAL PLAZAS",null,"Total Pto. Federal",null,"Total Ppto. Otras Fuentes"]
[]
[]
[null,1,"A Y II D3","Personal Comisionado",null,null,null,null,null,null,null,null,null,null,null,null,null,0]
[null,2,"A Y II D4","Personal con Licencia",null,null,null,null,null,null,null,null,null,null,null,null,null,0]
[null,3,"B)   ","Registro Federal de Contribuyentes de Trabajadores con Pagos Retroactivos con un Periodo Mayor a 45 días",null,null,null,"N/A",null,"N/A",null,"N/A",null,"N/A",null,"N/A",null,"N/A"]
[null,4,"II B) Y 1","Plaza / Función",null,null,null,null,null,null,null,null,null,"N/A",null,"N/A",null,"N/A"]
[null,5,"II C y 1_","Personal Federalizado por Registro Federal de Contribuyentes",null,null,null,null,null,null,null,null,null,null,null,null,null,0]
[null,6,"II D) 2","Movimientos de Plazas",null,null,null,null,null,null,null,null,null,null,null,"N/A",null,"N/A"]
[null,7,"II D) 4","Trabajadores Jubilados en el Periodo",null,null,null,null,null,null,null,null,null,null,null,"N/A",null,"N/A"]
[null,8,"II D) 4 A","Trabajadores que Tramitaron Licencia Prejubilatoria en el Periodo",null,null,null,null,null,null,null,null,null,null,null,null,null,0]
[null,9,"II D) 6","Trabajadores Contratados por Honorarios en el Periodo",null,null,null,null,null,null,null,null,null,"N/A",null,"N/A",null,"N/A"]
[null,10,"II D) 7 1 ","Analítico de Categorías / Plazas Autorizadas con su Tabulador",null,null,null,null,null,null,null,"N/A",null,"N/A",null,"N/A",null,"N/A"]
[null,11,"II D) 7 2 ","Catálogo de Categorías y Tabuladores",null,null,null,null,null,null,null,"N/A",null,"N/A",null,"N/A",null,"N/A"]
[null,12,"II D) 7 3 ","Catálogo de Percepciones y Deducciones",null,null,null,null,null,null,null,"N/A",null,"N/A",null,"N/A",null,"N/A"]
[null,13,"E)","Trabajadores que Cobran con RFC / CURP con Formato Incorrecto",null,null,null,"N/A",null,"N/A",null,"N/A",null,"N/A",null,"N/A",null,"N/A"]
[null,14,"F) 1","Trabajadores con Doble Asignación Salarial en Municipios no Colindantes Geográficamente",null,null,null,"N/A",null,"N/A",null,"N/A",null,"N/A",null,"N/A",null,"N/A"]
[null,15,"F) 2","Trabajadores Ocupando Plazas que Superan el Número de Horas de Compatibilidad Autorizadas",null,null,null,"N/A",null,"N/A",null,"N/A",null,"N/A",null,"N/A",null,"N/A"]
[null,16,"G)","Trabajadores Cuyo Salario Básico Supere los Ingresos Promedio de un Docente en la Categoría más Alta del Tabulador Salarial Correspondiente a Cada Entidad",null,null,null,"N/A",null,"N/A",null,"N/A",null,"N/A",null,"N/A",null,"N/A"]
[]
[]
[]
[]
[]
[]
[]
[]
[]
[]
[]
[]
[null,null,"LIC. JESUS ALFONSO RAMIREZ MARRUFO"]
[null,null,"Nombre del  Responsable"]
[]
[null,null,"SUBJEFE TECNICO ESPECIALISTA DE RECURSOS HUMANOS"]
[null,null,"Cargo"]
[]
[]
[null,null,"Firma"]
[]
[null,null,"2016-04-13"]
[null,null,"Fecha"]

{"sheet":"CARATULA RESUMEN","index":1,"n_rows":73,"n_cols":18,"rows_kept":73,"cut":false,"hidden":false,"merged":[[73,2,73,5],[50,3,50,6],[65,2,65,5],[66,2,66,5],[68,2,68,5],[69,2,69,5],[71,2,71,5],[72,2,72,5],[63,2,63,5],[46,3,46,6],[47,3,47,6],[48,3,48,6],[49,3,49,6],[62,2,62,5],[45,3,45,6],[34,3,34,6],[35,3,35,6],[36,3,36,6],[37,3,37,6],[38,3,38,6],[39,3,39,6],[40,3,40,6],[41,3,41,6],[42,3,42,6],[43,3,43,6],[44,3,44,6],[22,3,22,14],[10,3,10,18],[11,3,11,18],[12,3,12,18],[20,3,20,14],[21,3,21,14]]}
[]
[]
[]
[]
[]
[]
[]
[]
[]
[]
[]
[null,null,null,"FORMATOS ENTREGADOS PARA DAR CUMPLIMIENTO AL ARTICULO 73 DE \"LA LEY GENERAL DE CONTABILIDAD GUBERNAMENTAL\""]
[]
[]
[]
[]
[]
[]
[]
[]
[null,null,"Entidad Federativa :","CHIHUAHUA "]
[null,null,"Fondo :","Fondo de Aportaciones para la Educación Tecnológica y de Adultos/Colegio Nacional de Educación Profesional Técnica (FAETA/CONALEP)"]
[null,null,"Periodo :","2do. Trimestre 2020"]
[]
[]
[]
[]
[]
[]
[]
[]
[null,null,null,null,null,null,null,"TOTAL REGISTROS ",null,"Num. de Paginas",null,"TOTAL PERSONAS",null,"TOTAL PLAZAS",null,"Total Pto. Federal",null,"Total Ppto. Otras Fuentes"]
[]
[]
[null,1,"A Y II D3","Personal Comisionado",null,null,null,9,null,1,null,9,null,9,null,738743.36,null,"N/A"]
[null,2,"A Y II D4","Personal con Licencia",null,null,null,8,null,1,null,8,null,3,null,220262.43,null,"N/A"]
[null,3,"B)   ","Registro Federal de Contribuyentes de Trabajadores con Pagos Retroactivos con un Periodo Mayor a 45 días",null,null,null,"N/A",null,"N/A",null,"N/A",null,"N/A",null,"N/A",null,"N/A"]
[null,4,"II B) Y 1","Plaza / Función",null,null,null,831,null,13,null,831,null,238,null,31374385.246999979,null,"N/A"]
[null,5,"II C y 1_","Personal Federalizado por Registro Federal de Contribuyentes",null,null,null,831,null,15,null,831,null,238,null,31374385.246999975,null,"N/A"]
[null,6,"II D) 2","Movimientos de Plazas",null,null,null,9,null,1,null,9,null,1,null,"N/A",null,"N/A"]
[null,7,"II D) 4","Trabajadores Jubilados en el Periodo",null,null,null,"N/A",null,"N/A",null,"N/A",null,"N/A",null,"N/A",null,"N/A"]
[null,8,"II D) 4 A","Trabajadores que Tramitaron Licencia Prejubilatoria en el Periodo",null,null,null,"N/A",null,"N/A",null,"N/A",null,"N/A",null,"N/A",null,"N/A"]
[null,9,"II D) 6","Trabajadores Contratados por Honorarios en el Periodo",null,null,null,29,null,1,null,29,null,"N/A",null,1145086.9200000002,null,"N/A"]
[null,10,"II D) 7 1 ","Analítico de Categorías / Plazas Autorizadas con su Tabulador",null,null,null,145,null,3,null,"N/A",null,"N/A",null,"N/A",null,"N/A"]
[null,11,"II D) 7 2 ","Catálogo de Categorías y Tabuladores",null,null,null,149,null,4,null,"N/A",null,"N/A",null,"N/A",null,"N/A"]
[null,12,"II D) 7 3 ","Catálogo de Percepciones y Deducciones",null,null,null,79,null,3,null,"N/A",null,"N/A",null,"N/A",null,"N/A"]
[null,13,"E)","Trabajadores que Cobran con RFC / CURP con Formato Incorrecto",null,null,null,"N/A",null,"N/A",null,"N/A",null,"N/A",null,"N/A",null,"N/A"]
[null,14,"F) 1","Trabajadores con Doble Asignación Salarial en Municipios no Colindantes Geográficamente",null,null,null,"N/A",null,"N/A",null,"N/A",null,"N/A",null,"N/A",null,"N/A"]
[null,15,"F) 2","Trabajadores Ocupando Plazas que Superan el Número de Horas de Compatibilidad Autorizadas",null,null,null,"N/A",null,"N/A",null,"N/A",null,"N/A",null,"N/A",null,"N/A"]
[null,16,"G)","Trabajadores Cuyo Salario Básico Supere los Ingresos Promedio de un Docente en la Categoría más Alta del Tabulador Salarial Correspondiente a Cada Entidad",null,null,null,"N/A",null,"N/A",null,"N/A",null,"N/A",null,"N/A",null,"N/A"]
[null,17,"H) ","Movimientos de Personal por Centro de Trabajo",null,null,null,"N/A",null,"N/A",null,"N/A",null,"N/A",null,"N/A",null,"N/A"]
[]
[]
[]
[]
[]
[]
[]
[]
[]
[]
[]
[null,null,"LIC. JESUS ALFONSO RAMIREZ MARRUFO"]
[null,null,"Nombre del  Responsable"]
[]
[null,null,"JEFE DE PROYECTO DE RECURSOS HUMANOS"]
[null,null,"Cargo"]
[]
[]
[null,null,"Firma"]
[]
[null,null,"2020-07-08"]
[null,null,"Fecha"]

{"sheet":"A Y  II D3","index":2,"n_rows":31,"n_cols":25,"rows_kept":31,"cut":false,"hidden":false,"merged":[[9,1,9,7],[12,6,12,12],[12,1,13,1],[12,2,13,2],[12,3,13,3],[12,4,13,4],[12,5,13,5],[27,12,27,14],[12,24,13,24],[12,13,12,14],[12,15,13,15],[12,16,13,16],[12,17,13,17],[12,18,12,19],[12,20,13,20],[25,13,25,14],[12,21,13,21],[12,22,13,22],[12,23,13,23]]}
[]
[]
[]
[]
[]
[]
[]
[]
[null,"Formato: Personal Comisionado"]
[null,{"$f":"IF('1'!D22=\"Elige el Periodo…\",\"\",'1'!D22)","v":"Fondo de Aportaciones para la Educación Tecnológica y de Adultos/Colegio Nacional de Educación Profesional Técnica (FAETA/CONALEP)"},null,null,null,null,null,null,null,null,null,null,null,null,null,null,null,null,null,null,null,null,null,"2do. Trimestre 2020"]
[]
[]
[null,"Entidad Federativa","R.F.C.","CURP","Nombre","Clave integrada","Clave Presupuestal",null,null,null,null,null,null,"Fecha Comisión",null,"Percepciones pagadas en el Periodo de Comisión con Presupuesto Federal*","Percepciones pagadas en el Periodo de Comisión con Presupuesto de otra fuente*","Clave CT Origen","CT Destino dentro del sector",null,"Lugar de la comisión fuera del sector educativo","Tipo de Comisión","Función Específica","Objeto de la comision","No. Oficio"]
[null,null,null,null,null,null,"Partida Presupuestal","Código de Pago","Clave de Unidad","Clave de Sub Unidad","Clave de Categoría","Horas Semana Mes ","Número de Plaza","Inicio","Conclusión",null,null,null,"Clave","Turno"]
[]
[null,"Entidad Federativa","R.F.C.","CURP","Nombre","Clave integrada","Partida Presupuestal","Código de Pago","Clave de Unidad","Clave de Sub Unidad","Clave de Categoría","Horas Semana Mes ","Número de Plaza","Fecha Comisión\nInicio","Fecha Comisión\nConclusión","Percepciones pagadas en el Periodo de Comisión con Presupuesto Federal*","Percepciones pagadas en el Periodo de Comisión con Presupuesto de otra fuente*","Clave CT Origen","Clave","Turno","Lugar de la comisión fuera del sector educativo","Tipo de Comisión","Función Específica","Objeto de la comision","No. Oficio"]
[null,"CHIHUAHUA","AUPC720823T59","AUPC720823MZSGLL09","CLARA AGUERO PALACIOS",{"$f":"CONCATENATE(G17,H17,I17,J17,K17,L17,M17)","v":"8310110030026CF3420200.02457"},83101,1003,"00","26","CF34202","00.0",2457,20120216,99999999,38140,0,"08DPT0002B","08DPT0007X",200,"/","h","PROMOTOR DEP. Y CULTURAL","APOYO PARA EL DEPARTAMENTO","DGE/159-A/2012"]
[null,"CHIHUAHUA","CIBA710920FVA","CIBA710920MDGTRL04","ALMA ROSA CITAL BERTAHUD",{"$f":"CONCATENATE(G18,H18,I18,J18,K18,L18,M18)","v":"8310110030026CF3320600.014304"},83101,1003,"00","26","CF33206","00.0",14304,20100716,99999999,130807.73,0,"08DPT0002B","08DPT0013H",124,"/","h","DIRECCION DEL PLANTEL ","APOYO PARA EL PLANTEL","DGE/515/2010"]
[null,"CHIHUAHUA","LOCJ681030V96","LOCJ681030HCHZLS07","JESUS EDUARDO LOZOYA CALDERON","8310110030026A0320200.02419",83101,1003,"00","26","A03202","00.0",2419,20130216,99999999,50052.95,0,"08DPT0002B","08DPT0007X",200,"/","h","AUXILIAR DE SERVICIOS GENERALES","APOYO PARA EL DEPARTAMENTO","RH/087/2013"]
[null,"CHIHUAHUA","VASC8109266G6","VASC810926MCHLLL08","CLAUDIA VALVERDE SALAZAR","8310110030026ED0120100.02445",83101,1003,"00","26","ED01201","00.0",2445,20160701,99999999,52066.01,0,"08DPT0002B","08DPT0007X",700,"/","a","DELEGADA SINDICAL ESTATAL","APOYO PARA EL PERSONAL SINDICAL","SA/423/2019"]
[null,"CHIHUAHUA","LOCJ6307091T8","LOCJ630709HCHPRS08","JESUS MARTIN LOPEZ CARO","8310110030026CF3320600.013757",83101,1003,"00","26","CF33206","00.0",13757,20170316,99999999,130053.49,0,"08DPT0002B","00XXX0000X",123,"CAST - CONALEP","f","JEFE DE PROYECTO","APOYO PARA EL DEPARTAMENTO","DGE/109/2017"]
[null,"CHIHUAHUA","HEGJ620729F26","HEGJ620729HCHRNV07","JOSE JAVIER HERNANDEZ GONZALEZ","8310110030207CF3320600.014112",83101,1003,"02","07","CF33206","00.0","14112",20170201,99999999,87992.84,0,"08DPT0007X","08DPT0002B",100,"/","h","JEFE DE PROYECTO","APOYO PARA EL DEPARTAMENTO","AJ/OFC/03/2017"]
[null,"CHIHUAHUA","CATC7205274V8","CATC720527HCHNRR09","CARLOS CANO TORRES","8310110030704CF3320400.010990",83101,1003,"07","04","CF33204","00.0",10990,20110104,99999999,94462.98,0,"00XXX0000X","08DPT0013H",124,"/","h","SUBJEFE TECNICO ESPECIALISTA","APOYO PARA EL DEPARTAMENTO","DGE/001-B/2011"]
[null,"CHIHUAHUA","PALU750621U84","PAXL750621HCHLXS05","LUIS ENRIQUE PALACIOS","8310110030704CF3320400.010995",83101,1003,"07","04","CF33204","00.0",10995,20170201,99999999,88707.46,0,"00XXX0000X","08DPT0002B",124,"/","h","SUBJEFE TECNICO ESPECIALISTA","APOYO PARA EL DEPARTAMENTO","DGE/104/2017"]
[null,"CHIHUAHUA","QUEG630216GA8","QUEG630216MCHXSR02","QUINONEZ ESTRADA GRACIELA","8310110030704CF0160100.011822",83101,1003,"07","04","CF01601","00.0",11822,20171016,99999999,66459.899999999994,0,"00XXX0000X","00XXX0000X",124,"DIRECCION GENERA ESTATAL DE CONALEP","f","JEFE DE UNIDAD","APOYO PARA EL DEPARTAMENTO","RH/105/2017"]
[null,"Total Personas : ",9,null,null,null,null,null,null,null,"Total Plazas : ",null,9,"Total Pto. Federal",null,{"$f":"SUBTOTAL(109,Tabla1[Percepciones pagadas en el Periodo de Comisión con Presupuesto Federal*])","v":738743.36}]
[]
[null,null,null,null,null,null,null,null,null,null,null,null,"Total Ppto. Otras Fuentes",null,null,null,0]
[]
[null,"*Total de Percepciones reportadas por la Entidad Federativa como pagadas al trabajador durante la comisión."]
[null,"Fuente : Información proporcionada por las Entidades Federativas."]

{"sheet":"A Y II D4","index":3,"n_rows":30,"n_cols":21,"rows_kept":30,"cut":false,"hidden":false,"merged":[[9,1,9,6],[24,13,24,14],[12,16,13,16],[12,17,13,17],[12,20,13,20],[12,1,13,1],[12,3,13,3],[12,4,13,4],[12,5,13,5],[12,6,12,12],[12,13,12,14],[12,2,13,2],[12,18,12,19],[12,15,13,15]]}
[]
[]
[]
[]
[]
[]
[]
[]
[null,"Formato: Personal con Licencia"]
[null,{"$f":"IF('1'!D22=\"Elige el Periodo…\",\"\",'1'!D22)","v":"Fondo de Aportaciones para la Educación Tecnológica y de Adultos/Colegio Nacional de Educación Profesional Técnica (FAETA/CONALEP)"},null,null,null,null,null,null,null,null,null,null,null,null,null,null,null,null,null,null,"2do. Trimestre 2020"]
[]
[]
[null,"Entidad Federativa","R.F.C.","CURP","NOMBRE","Clave integrada","Clave Presupuestal",null,null,null,null,null,null,"Periodo Licencia",null,"Percepciones pagadas en el Periodo de la Licencia con Presupuesto Federal*","Percepciones pagadas en el Periodo de la Licencia con Presupuesto de otra fuente*","Clave CT Origen","Licencia",null,"Descripción de la Licencia"]
[null,null,null,null,null,null,"Partida Presupuestal","Código de Pago","Clave de Unidad","Clave de Sub Unidad","Clave de Categoría","Horas Semana Mes ","Número de Plaza","Inicio","Conclusión",null,null,null,"Clave","Tipo"]
[]
[null,"Entidad Federativa","R.F.C.","CURP","NOMBRE","Clave integrada","Partida Presupuestal","Código de Pago","Clave de Unidad","Clave de Sub Unidad","Clave de Categoría","Horas Semana Mes ","Número de Plaza","Periodo Licencia\nInicio","Periodo Licencia\nConclusión","Percepciones pagadas en el Periodo de la Licencia con Presupuesto Federal*","Percepciones pagadas en el Periodo de la Licencia con Presupuesto de otra fuente*","Clave CT Origen","Licencia\nClave","Licencia\nTipo","Descripción de la Licencia"]
[null,"CHIHUAHUA","MOAP870129UT9","MOAP870129MCHLCT09","PATRICIA ARALI MOLINA ACOSTA","8310110030025CF3320400.02392",83101,1003,"00","25","CF33204","00.0","2392",20200522,20200819,30989.61,0,"08DPT0001C",25,"GOCE","POR GRAVIDEZ"]
[null,"CHIHUAHUA","AUPC720823662 ","AUPC720823MZSGLL09","AGUERO PALACIOS CLARA","8310110030026CF3420100.00",83101,1003,"00","26","CF34201","00.0","0",20200401,20200623,38140,0,"08DPT0002B",22,"GOCE","POR INCAPACIDAD MEDICA"]
[null,"CHIHUAHUA","JUEM870729SW2","JUEM870729MCHRSR04","MARINA JUAREZ ESPARZA","8310110010156E371108.00",83101,1001,"01","56","E3711","08.0",0,20200108,20200504,3115.2,0,"08DPT0003A",25,"GOCE","POR GRAVIDEZ"]
[null,"CHIHUAHUA","AOGA850323MS8","AOOC791125HCHLRR17","ADRIANA ARZOLA GARIBAY","8310110030156CF3320300.07484",83101,1003,"01","56","CF33203","00.0","7484",20200327,20200624,46289.37,0,"08DPT0003A",25,"GOCE","POR GRAVIDEZ"]
[null,"CHIHUAHUA","CEBC880121MJ0","CEBC880121MCHBCL06","CLAUDIA INES CEBALLOS BACA","8310110010156E372520.00",83101,1001,"01","56","E3725","20.0",0,20200518,20200820,10101,0,"08DPT0003A",25,"GOCE","POR GRAVIDEZ"]
[null,"CHIHUAHUA","EACL8412183L3","EACL841218MCHSRR08","LAURA VERONICA ESTRADA CARRILLO","8310110010207E372519.00",83101,1001,"02","07","E3725","19.0","0",20200423,20200721,63849.5,0,"08DPT0007X",25,"GOCE","POR GRAVIDEZ"]
[null,"CHIHUAHUA","OINS5902223YA","OINS590222HMNLXL02","JOSE SALVADOR OLIVO NUÑEZ","8310110010208E372520.00",83101,1001,"02","08","E3725","20.0",0,20200420,20200630,27777.75,0,"08DPT0008W",22,"GOCE","POR INCAPACIDAD MEDICA"]
[null,"CHIHUAHUA","EUGM7504107E2","EUGM750410HCHSRR05","ESQUIVEL GUERRERO MAURO EZEQUIEL","8310110030219S0120200.02414",83101,1003,"02","19","S01202","00.0","2414",20200401,20200615,0,0,"08DPT0011J",16,"SIN GOCE","SIN GOCE DE SUELDO"]
[null,"Total Personas : ",8,null,null,null,null,null,null,null,"Total Plazas : ",null,3,"Total Pto. Federal",null,{"$f":"SUBTOTAL(109,Tabla3[Percepciones pagadas en el Periodo de la Licencia con Presupuesto Federal*])","v":220262.43}]
[]
[null,null,null,null,null,null,null,null,null,null,null,null,null,"Total Ppto. Otras Fuentes",null,null,{"$f":"SUM(Q17:Q26)","v":0}]
[]
[null,"*Total de Percepciones reportadas por la Entidad Federativa como pagadas al trabajador durante la Licencia."]
[null,"Fuente : Información proporcionada por las Entidades Federativas."]

{"sheet":"B)","index":4,"n_rows":26,"n_cols":19,"rows_kept":26,"cut":false,"hidden":false,"merged":[[9,1,9,10],[12,1,13,1],[12,2,13,2],[12,3,13,3],[12,4,13,4],[12,5,12,11],[12,18,13,18],[12,12,13,12],[12,13,13,13],[12,14,13,14],[12,15,12,16],[12,17,13,17]]}
[]
[]
[]
[]
[]
[]
[]
[]
[null,"Formato: Registro Federal de Contribuyentes de Trabajadores con Pagos Retroactivos con un Periodo Mayor a 45 días"]
[null,{"$f":"IF('1'!D22=\"Elige el Periodo…\",\"\",'1'!D22)","v":"Fondo de Aportaciones para la Educación Tecnológica y de Adultos/Colegio Nacional de Educación Profesional Técnica (FAETA/CONALEP)"},null,null,null,null,null,null,null,null,null,null,null,null,null,null,null,"2do. Trimestre 2020"]
[]
[]
[null,"Entidad Federativa","RFC","CURP","Nombre","Clave Presupuestal",null,null,null,null,null,null,"Clave de Centro de Trabajo","Fecha de emisión de pago","Motivo del Pago Retroactivo","Periodo pagado",null,"Días transcurridos para el pago","Percepciones pagadas en el periodo reportado *"]
[null,null,null,null,null,"Partida Presupuestal","Código de Pago","Clave de Unidad","Clave de Sub Unidad","Clave de Categoría","Horas Semana Mes ","Número de Plaza",null,null,null,"Desde","Hasta"]
[]
[null,"Entidad Federativa","RFC","CURP","Nombre","Partida Presupuestal","Código de Pago","Clave de Unidad","Clave de Sub Unidad","Clave de Categoría","Horas semana mes","Número de plaza","Clave de Centro de Trabajo","Fecha de emisión de pago","Motivo del Pago Retroactivo","Periodo pagado\nDesde","Periodo pagado\nHasta","Días transcurridos para el pago","Percepciones pagadas en el periodo reportado *"]
[]
[]
[]
[]
[null,"Total Personas : ",null,null,null,null,null,null,null,null,"Total Plazas : ",null,null,null,null,"Total Percepciones Pagadas:"]
[]
[]
[]
[null,"*Total de Percepciones reportadas por la Entidad Federativa como pagadas en el periodo "]
[null,"Fuente : Información proporcionada por las Entidades Federativas"]

{"sheet":"II B) Y 1","index":5,"n_rows":849,"n_cols":25,"rows_kept":849,"cut":false,"hidden":false,"merged":[[12,24,14,24],[13,6,13,8],[13,9,13,11],[13,12,13,14],[13,15,13,17],[13,18,13,20],[12,6,12,20],[12,21,14,21],[12,22,14,22],[12,23,14,23],[12,4,14,4],[12,3,14,3],[12,2,14,2],[9,1,9,9],[848,21,848,23],[12,1,14,1],[12,5,14,5]]}
[]
[]
[]
[]
[]
[]
[]
[]
[null,"Formato: Plaza / Función"]
[null,{"$f":"IF('1'!D22=\"Elige el Periodo…\",\"\",'1'!D22)","v":"Fondo de Aportaciones para la Educación Tecnológica y de Adultos/Colegio Nacional de Educación Profesional Técnica (FAETA/CONALEP)"},null,null,null,null,null,null,null,null,null,null,null,null,null,null,null,null,null,null,null,null,null,"2do. Trimestre 2020"]
[]
[]
[null,"Entidad Federativa","RFC","CURP","Nombre","Centros de Trabajo","Plazas por tipo de función",null,null,null,null,null,null,null,null,null,null,null,null,null,null,"Total plazas Jornada","Total \nHSM","Total de Honorarios","Total de recursos presupuestales ejercidos en servicios personales en el periodo\n(2)"]
[null,null,null,null,null,null,"Apoyo a la labor educativa",null,null,"Administrativo y de servicio",null,null,"Docente y Apoyo Técnico Pedagógico",null,null,"Directivos y Supervisión",null,null,"Mandos medios y superiores"]
[null,null,null,null,null,null,"Jornada","HSM","Honorarios","Jornada","HSM","Honorarios","Jornada","HSM","Honorarios","Jornada","HSM","Honorarios","Jornada","HSM","Honorarios"]
[]
[null,"Columna1","Columna2","Columna3","Columna4","Columna5","Columna6","Columna7","Columna8","Columna9","Columna10","Columna11","Columna12","Columna13","Columna14","Columna15","Columna16","Columna17","Columna18","Columna19","Columna20","Columna21","Columna22","Columna23","Columna24"]
[null,"CHIHUAHUA","AEEF700614J96","AEEF700614HCHLNR00","JOSE FRANCISCO ALDERETE ENRIQUEZ","08DPT0001C",null,null,null,1,0,0,null,null,null,null,null,null,null,null,null,1,0,0,124952.32000000002]
[null,"CHIHUAHUA","CACM660522B70","CACM660522HCHNHR08","MARIO RUBEN CANO CHEW","08DPT0001C",null,null,null,1,0,0,null,null,null,null,null,null,null,null,null,1,0,0,79779.760000000009]
[null,"CHIHUAHUA","DEMS680803PI5","DEMS680803MCHLXN06","SANDRA DELGADO MUÑOZ","08DPT0001C",null,null,null,1,0,0,null,null,null,null,null,null,null,null,null,1,0,0,91391.940000000017]
[null,"CHIHUAHUA","DIAM641007CI5","DIAM641007HCHZCN00","MANUEL DIAZ ACOSTA","08DPT0001C",null,null,null,1,0,0,null,null,null,null,null,null,null,null,null,1,0,0,40550.6]
[null,"CHIHUAHUA","FEPH590719P2A","FEPH590719MCHRRR08","HORTENSIA FERNANDEZ PARGA","08DPT0001C",null,null,null,1,0,0,null,null,null,null,null,null,null,null,null,1,0,0,38103.11]
[null,"CHIHUAHUA","GADE730513AY2","GADE730513HCHRZL06","ELIAS GARCIA DIAZ","08DPT0001C",null,null,null,1,0,0,null,null,null,null,null,null,null,null,null,1,0,0,46435.890000000007]
[null,"CHIHUAHUA","GAVL610223PN1","GAVL610223MGTRLN08","LEONOR GARZON VALDEZ","08DPT0001C",null,null,null,null,null,null,null,null,null,null,null,null,1,0,0,1,0,0,85992.48000000001]
[null,"CHIHUAHUA","GOBS630720GU7","GOBS630720MCHNLL02","SILVIA CECILIA GONZALEZ BALDERRAMA","08DPT0001C",null,null,null,1,0,0,null,null,null,null,null,null,null,null,null,1,0,0,36201.17]
[null,"CHIHUAHUA","GUSL800307M72","GUSL800307MCHTNL01","LILIANA GUTIERREZ SANDOVAL","08DPT0001C",null,null,null,1,0,0,null,null,null,null,null,null,null,null,null,1,0,0,35249.61]
[null,"CHIHUAHUA","HEMM670602FX4","HEMM670602HCHRRL08","MELCHOR HERNANDEZ MORALES","08DPT0001C",null,null,null,1,0,0,null,null,null,null,null,null,null,null,null,1,0,0,33928.83]
[null,"CHIHUAHUA","IAAM650713G14","IAAM650713HCLBRR06","MARTIN GENARO IBARRA ARREDONDO","08DPT0001C",null,null,null,1,0,0,null,null,null,null,null,null,null,null,null,1,0,0,130057.9]
[null,"CHIHUAHUA","JUVD951202BR4","JUVD951202HCHRLN06","DANIEL FRANCISCO JUAREZ VILLALOBOS","08DPT0001C",null,null,null,1,0,0,null,null,null,null,null,null,null,null,null,1,0,0,30847.510000000002]
[null,"CHIHUAHUA","JUGA720809R10","JUGA720809MCHRRL05","ALMA VERONICA JURADO GARCIA","08DPT0001C",null,null,null,1,0,0,null,null,null,null,null,null,null,null,null,1,0,0,32895.710000000006]
[null,"CHIHUAHUA","LOCS740722BY1","LOCS740722MCHYSN03","SANDRA LOYA CASTAÑEDA","08DPT0001C",null,null,null,1,0,0,null,null,null,null,null,null,null,null,null,1,0,0,29956.31]
[null,"CHIHUAHUA","LOLG6105041C1","LOLG610504HCHZPR03","GERARDO LOZANO LOPEZ","08DPT0001C",null,null,null,1,0,0,null,null,null,null,null,null,null,null,null,1,0,0,52371.45]
[null,"CHIHUAHUA","MASS920625T67","MASS920625MCHNTT05","STEPHANIE MANCHA SOTO","08DPT0001C",null,null,null,1,0,0,null,null,null,null,null,null,null,null,null,1,0,0,46883.05000000001]
[null,"CHIHUAHUA","MACN5607036J8","MACN560703MCHRHR01","NORMA MARGARITA MARRUFO CHAPARRO","08DPT0001C",null,null,null,1,0,0,null,null,null,null,null,null,null,null,null,1,0,0,35310.89]
[null,"CHIHUAHUA","MERA640505HY3","MERA640505HCHNYR01","ARMANDO MENDEZ REYES","08DPT0001C",null,null,null,1,0,0,null,null,null,null,null,null,null,null,null,1,0,0,110745.45999999999]
[null,"CHIHUAHUA","MOAP870129UT9","MOAP870129MCHLCT09","PATRICIA ARALI MOLINA ACOSTA","08DPT0001C",null,null,null,1,0,0,null,null,null,null,null,null,null,null,null,1,0,0,30772.310000000005]
[null,"CHIHUAHUA","MOTJ521007RU5","MOTJ521007HCHRRS02","JESUS ALBERTO MORENO TORRES","08DPT0001C",null,null,null,1,0,0,null,null,null,null,null,null,null,null,null,1,0,0,65539.83]
[null,"CHIHUAHUA","NAOG680625QA5","NAOG680625HCHRRL00","GUILLERMO NICOLAS NARVAEZ ORDAZ","08DPT0001C",null,null,null,1,0,0,null,null,null,null,null,null,null,null,null,1,0,0,45362.670000000006]
[null,"CHIHUAHUA","NAWA860622JI6","NAWA860622HCHVGL05","ALEJANDRO MAURICIO NAVARRO WAGNER","08DPT0001C",null,null,null,null,null,null,null,null,null,null,null,null,1,0,0,1,0,0,50541.409999999996]
[null,"CHIHUAHUA","PIRE860510KC2","PIRE860510HCHZBS00","PIZANO RUBIO ESTALI","08DPT0001C",null,null,null,1,0,0,null,null,null,null,null,null,null,null,null,1,0,0,66459.899999999994]
[null,"CHIHUAHUA","PODM630929V60","PODM630929HCHRZG02","MIGUEL PORTILLO DIAZ","08DPT0001C",null,null,null,1,0,0,null,null,null,null,null,null,null,null,null,1,0,0,30665.337000000003]
[null,"CHIHUAHUA","QUHM750313QX2","QUHM750313HZSNZN02","MANUEL QUINTERO HUIZAR","08DPT0001C",null,null,null,1,0,0,null,null,null,null,null,null,null,null,null,1,0,0,42125.010000000009]
[null,"CHIHUAHUA","RAGN6608306N3","RAGN660830MCHMMR01","NORMA RAMIREZ GOMEZ","08DPT0001C",null,null,null,1,0,0,null,null,null,null,null,null,null,null,null,1,0,0,29680.270000000004]
[null,"CHIHUAHUA","REMV840531384","REMV840531HCHYRC03","VICTOR MANUEL REYES MURILLO","08DPT0001C",null,null,null,1,0,0,null,null,null,null,null,null,null,null,null,1,0,0,51144.709999999992]
[null,"CHIHUAHUA","REOS610731NK2","REOS610731MCHZLL01","SILVIA PATRICIA REZA OLIVAS","08DPT0001C",null,null,null,1,0,0,null,null,null,null,null,null,null,null,null,1,0,0,67708.739999999991]
[null,"CHIHUAHUA","ROCG710423BI2","ROCG710423MCHDNL05","GILDA ALEJANDRINA RODRIGUEZ CANO","08DPT0001C",null,null,null,1,0,0,null,null,null,null,null,null,null,null,null,1,0,0,46860.259999999987]
[null,"CHIHUAHUA","ROVB9202105WA","ROVB920210HCHDLR05","BRYAN ARMANDO RODRIGUEZ VALVERDE","08DPT0001C",null,null,null,1,0,0,null,null,null,null,null,null,null,null,null,1,0,0,30363.820000000003]
[null,"CHIHUAHUA","RUDA711227IH4","RUDA711227HCHLLR08","ARTURO RUELAS DELGADO","08DPT0001C",null,null,null,1,0,0,null,null,null,null,null,null,null,null,null,1,0,0,83706.86]
[null,"CHIHUAHUA","SOPF600927M49","SOPF600927MCHTRR08","FERNANDA SOTELO PEREZ","08DPT0001C",null,null,null,1,0,0,null,null,null,null,null,null,null,null,null,1,0,0,39631.74]
[null,"CHIHUAHUA","TOEB620314DK2","TOEB620314HCHRNR09","BERNARDO TORRES ENRIQUEZ","08DPT0001C",null,null,null,1,0,0,null,null,null,null,null,null,null,null,null,1,0,0,41591.850000000006]
[null,"CHIHUAHUA","TOLF901203UG1","TOLF901203HCHRZR07","FRANCISCO JAVIER TORRES LOZOYA","08DPT0001C",null,null,null,1,0,0,null,null,null,null,null,null,null,null,null,1,0,0,29680.270000000004]
[null,"CHIHUAHUA","VAAH770519CJ9","VAAH770519HCHZRC04","HECTOR MANUEL VAZQUEZ ARMENDARIZ","08DPT0001C",null,null,null,1,0,0,null,null,null,null,null,null,null,null,null,1,0,0,32634.06]
[null,"CHIHUAHUA","VIRC720302LS1","VIRC720302MCHLVR06","MARIA CRISTINA VILLAGRAN RIVERA","08DPT0001C",null,null,null,1,0,0,null,null,null,null,null,null,null,null,null,1,0,0,51144.709999999992]
[null,"CHIHUAHUA","VIJD921113BZ7","VIJD921113HCHLRG00","DIEGO EMMANUEL VILLALBA JUAREZ","08DPT0001C",null,null,null,1,0,0,null,null,null,null,null,null,null,null,null,1,0,0,66247.720000000016]
[null,"CHIHUAHUA","AOZL821127LL7","AOZL821127HCHCVS03","ACOSTA ZAVALA LUIS ALBERTO","08DPT0001C",null,null,null,null,null,null,0,120,0,null,null,null,null,null,null,0,120,0,15151.5]
[null,"CHIHUAHUA","AUAJ750122A5A","AUAJ750122HCHGGS03","JESUS AGUILAR AGUILAR","08DPT0001C",null,null,null,null,null,null,0,120,0,null,null,null,null,null,null,0,120,0,15151.5]
[null,"CHIHUAHUA","AULE8612293K4","AULE861229MCHGRL05","ELDA EUNICE AGUIRRE LOERA","08DPT0001C",null,null,null,null,null,null,0,216,0,null,null,null,null,null,null,0,216,0,21027.599999999999]
[null,"CHIHUAHUA","AAMF560125R89","AAMF560125HCHLNL07","FLAVIO RAUL ALVAREZ MONTOYA","08DPT0001C",null,null,null,null,null,null,0,240,0,null,null,null,null,null,null,0,240,0,30303]
[null,"CHIHUAHUA","AATL801210PB4","AATL801210MCHLNR06","LOURDES ALVAREZ TINTORI","08DPT0001C",null,null,null,null,null,null,0,180,0,null,null,null,null,null,null,0,180,0,22727.280000000002]
[null,"CHIHUAHUA","AIOM820517TC5","AIOM820517MCHVLR08","MARIANA AVILA OLIVAS","08DPT0001C",null,null,null,null,null,null,0,240,0,null,null,null,null,null,null,0,240,0,30303]
[null,"CHIHUAHUA","AAGJ821023VC5","AAGJ821023MCHZZS17","JESSICA CORAL AZAETA GUZMAN","08DPT0001C",null,null,null,null,null,null,0,216,0,null,null,null,null,null,null,0,216,0,23633.1]
[null,"CHIHUAHUA","BAFR630210M78","BAFR630210HCHQRC02","RICARDO BAQUERA FRESCAS","08DPT0001C",null,null,null,null,null,null,0,240,0,null,null,null,null,null,null,0,240,0,26259]
[null,"CHIHUAHUA","BAAA801202930","BAAA801202HCHRLL09","ALBERTO GUERRERO BARRAZA ALVAREZ","08DPT0001C",null,null,null,null,null,null,0,240,0,null,null,null,null,null,null,0,240,0,30303]
[null,"CHIHUAHUA","BURS661015RT6","BURS661015HCHSSL07","SALVADOR BUSTILLOS RASCON","08DPT0001C",null,null,null,null,null,null,0,144,0,null,null,null,null,null,null,0,144,0,18181.8]
[null,"CHIHUAHUA","CAAM640422S63","CAAM640422MSRMRR03","MARTHA LETICIA CAMPOS ARISMEDI","08DPT0001C",null,null,null,null,null,null,0,216,0,null,null,null,null,null,null,0,216,0,27272.7]
[null,"CHIHUAHUA","CARG7105218G9","CARG710521HCHMMR07","GERARDO CAMPOS RAMIREZ","08DPT0001C",null,null,null,null,null,null,0,180,0,null,null,null,null,null,null,0,180,0,22727.280000000002]
[null,"CHIHUAHUA","CASR730827BZ2","CASR730827HCHNTM09","RAMON ARMANDO CANO SOTO","08DPT0001C",null,null,null,null,null,null,0,180,0,null,null,null,null,null,null,0,180,0,19694.280000000002]
[null,"CHIHUAHUA","CABA600225IW2","CABA600225MCHRRR09","ARACELI CARRASCO BARRAZA","08DPT0001C",null,null,null,null,null,null,0,180,0,null,null,null,null,null,null,0,180,0,22727.280000000002]
[null,"CHIHUAHUA","CAON860317HL0","CAON860317MCHRCL00","NALLELY YESENIACARRASCO OCHOA","08DPT0001C",null,null,null,null,null,null,0,108,0,null,null,null,null,null,null,0,108,0,13636.38]
[null,"CHIHUAHUA","CAJM671130A58","CAJM671130HCHRRR04","CARRILLO JUAREZ MAURO GERARDO","08DPT0001C",null,null,null,null,null,null,0,228,0,null,null,null,null,null,null,0,228,0,24946.080000000002]
[null,"CHIHUAHUA","CAAI5611206JA","CAAI561120MCHSRD05","IDELIA CASTRO ARMENDARIZ","08DPT0001C",null,null,null,null,null,null,0,240,0,null,null,null,null,null,null,0,240,0,30303]
[null,"CHIHUAHUA","CAFL660707EI1","CAFL660707MCHZLY06","LYDIA CAZARES FLORES","08DPT0001C",null,null,null,null,null,null,0,180,0,null,null,null,null,null,null,0,180,0,19694.280000000002]
[null,"CHIHUAHUA","CEBE680921RL5","CEBE680921HCHNCL06","ELEAZAR MATEO CENICEROS BECERRA","08DPT0001C",null,null,null,null,null,null,0,228,0,null,null,null,null,null,null,0,228,0,28787.879999999997]
[null,"CHIHUAHUA","CEMC581222Q78","CEMC581222MCHRLL09","CLARA CERVANTES MELENDEZ","08DPT0001C",null,null,null,null,null,null,0,156,0,null,null,null,null,null,null,0,156,0,19696.980000000003]
[null,"CHIHUAHUA","CAJF670208887","CAJF670208HCHHRR03","FERNANDO CHACON JURADO","08DPT0001C",null,null,null,null,null,null,0,216,0,null,null,null,null,null,null,0,216,0,27272.7]
[null,"CHIHUAHUA","CAGL640918UT9","CAGL640918MCHHMR07","MARIA DE LOURDES CHAVIRA GOMEZ","08DPT0001C",null,null,null,null,null,null,0,180,0,null,null,null,null,null,null,0,180,0,22727.280000000002]
[null,"CHIHUAHUA","CULT860821MM2","CULT860821MDFDGN17","TANIA CUADROS LUGO","08DPT0001C",null,null,null,null,null,null,0,180,0,null,null,null,null,null,null,0,180,0,14602.5]
[null,"CHIHUAHUA","DOTM5605051B1","DOTM560505MCHMRR05","MARGARITA DOMINGUEZ TREVIZO","08DPT0001C",null,null,null,null,null,null,0,144,0,null,null,null,null,null,null,0,144,0,18181.8]
[null,"CHIHUAHUA","EARE580710MW7","EARE580710MDFRQL19","ELSA AMALIA ERRAQUIN ROQUE","08DPT0001C",null,null,null,null,null,null,0,180,0,null,null,null,null,null,null,0,180,0,18181.8]
[null,"CHIHUAHUA","EOOC700117F69","EOOC700117HCHSRR08","CARLOS ESCOBEDO ORTEGA","08DPT0001C",null,null,null,null,null,null,0,228,0,null,null,null,null,null,null,0,228,0,28787.879999999997]
[null,"CHIHUAHUA","EACM621211KN0","EACM621211HCHSHR04","JOSE MARTIN ESPARZA CHAVEZ","08DPT0001C",null,null,null,null,null,null,0,216,0,null,null,null,null,null,null,0,216,0,27272.7]
[null,"CHIHUAHUA","EADR661019BU9","EADR661019HCHSZM08","ESPARZA DIAZ RAMON","08DPT0001C",null,null,null,null,null,null,0,132,0,null,null,null,null,null,null,0,132,0,14442.48]
[null,"CHIHUAHUA","EILJ680419MG0","EILJ680419HCHSNR05","JORGE ALBERTO ESPINOZA LUNA","08DPT0001C",null,null,null,null,null,null,0,192,0,null,null,null,null,null,null,0,192,0,24242.400000000001]
[null,"CHIHUAHUA","FECA6103137A4","FECA610313HDFRLB09","ABELARDO FERNANDEZ CALDERON","08DPT0001C",null,null,null,null,null,null,0,216,0,null,null,null,null,null,null,0,216,0,23633.1]
[null,"CHIHUAHUA","FOFL641113DP1","FOFL641113HCHLLS06","LUIS FLORES FLORES","08DPT0001C",null,null,null,null,null,null,0,240,0,null,null,null,null,null,null,0,240,0,30303]
[null,"CHIHUAHUA","GAMR760920E78","GAMR760920MCHLNT06","RUTH GALLEGOS MONARCA","08DPT0001C",null,null,null,null,null,null,0,192,0,null,null,null,null,null,null,0,192,0,24242.400000000001]
[null,"CHIHUAHUA","GAVF750826318","GAVF750826HCHLLR05","FRANCISCO AGUSTIN GALLEGOS VILLASEÑOR","08DPT0001C",null,null,null,null,null,null,0,120,0,null,null,null,null,null,null,0,120,0,15151.5]
[null,"CHIHUAHUA","GALR830327972","GALR830327MCHRYS00","ROSA HERLINDA GARCIA LOYA","08DPT0001C",null,null,null,null,null,null,0,180,0,null,null,null,null,null,null,0,180,0,22727.280000000002]
[null,"CHIHUAHUA","GALJ810323DN3","GALJ810323HCHRZS03","JESUS SAUL GARCIA LOZANO","08DPT0001C",null,null,null,null,null,null,0,216,0,null,null,null,null,null,null,0,216,0,27272.7]
[null,"CHIHUAHUA","GAMG821026JM8","GAMG821026HDGRRB08","GABINO GARCIA MARRUFO","08DPT0001C",null,null,null,null,null,null,0,240,0,null,null,null,null,null,null,0,240,0,30303]
[null,"CHIHUAHUA","GAOM870316CN9","GAOM870316HCHRRG00","JOSE MIGUEL GARCIA ORTIZ","08DPT0001C",null,null,null,null,null,null,0,240,0,null,null,null,null,null,null,0,240,0,30303]
[null,"CHIHUAHUA","GAVV7810103W7","GAVV781010MCHRSR04","VERONICA GARDEA VASQUEZ","08DPT0001C",null,null,null,null,null,null,0,240,0,null,null,null,null,null,null,0,240,0,30303]
[null,"CHIHUAHUA","GOAC860518J59","GOAC860518HCHMVR06","CARLOS JOEL GOMEZ AVILA","08DPT0001C",null,null,null,null,null,null,0,228,0,null,null,null,null,null,null,0,228,0,28787.879999999997]
[null,"CHIHUAHUA","GOHS731228LU7","GOHS731228HCHNLM00","SIMON GONZALEZ HOLGUIN","08DPT0001C",null,null,null,null,null,null,0,204,0,null,null,null,null,null,null,0,204,0,25757.58]
[null,"CHIHUAHUA","HEAM7409112X6","HEAM740911MCHRRR00","MARCELA HERNANDEZ ARMENDARIZ","08DPT0001C",null,null,null,null,null,null,0,180,0,null,null,null,null,null,null,0,240,0,22727.280000000002]
[null,"CHIHUAHUA","HERA781214D5A","HERA781214HCHRMR02","AARON TERCERO HERNANDEZ ROMO","08DPT0001C",null,null,null,null,null,null,0,216,0,null,null,null,null,null,null,0,216,0,27272.7]
[null,"CHIHUAHUA","HESM4812063X7","HESM481206HDFRGR09","MARIO HERNANDEZ SEGURA","08DPT0001C",null,null,null,null,null,null,0,240,0,null,null,null,null,null,null,0,240,0,30303]
[null,"CHIHUAHUA","HEMB811018BN2","HEMB811018MCHRNT06","BEATRIZ ELENA HERRERA MENDOZA","08DPT0001C",null,null,null,null,null,null,0,216,0,null,null,null,null,null,null,0,216,0,27272.7]
[null,"CHIHUAHUA","JIVG670122BN0","JIVG670122HVZMLD07","GAUDENCIO JIMENEZ VALENTIN","08DPT0001C",null,null,null,null,null,null,0,240,0,null,null,null,null,null,null,0,240,0,30303]
[null,"CHIHUAHUA","LESO760401T71","LESO760401HCHLXM07","OMAR LEAL SEAÑEZ","08DPT0001C",null,null,null,null,null,null,0,108,0,null,null,null,null,null,null,0,108,0,13636.38]
[null,"CHIHUAHUA","LOGM811218IW7","LOGM811218MCHRNY01","MYRNA GUADALUPE LOERA GONZALEZ","08DPT0001C",null,null,null,null,null,null,0,240,0,null,null,null,null,null,null,0,240,0,30303]
[null,"CHIHUAHUA","LOMM630709QH3","LOMM630709MCHPRR06","MIRIAM CAROLINA LOPEZ MARQUEZ","08DPT0001C",null,null,null,null,null,null,0,192,0,null,null,null,null,null,null,0,192,0,24242.400000000001]
[null,"CHIHUAHUA","LOCJ610711AFA","LOCJ610711HCHYHV06","JAVIER BENJAMIN LOYA CHAVIRA","08DPT0001C",null,null,null,null,null,null,0,216,0,null,null,null,null,null,null,0,216,0,27272.7]
[null,"CHIHUAHUA","LOHL711219AQ3","LOHL711219MCHYRL02","LILIANA IVONNE LOYA HERNANDEZ","08DPT0001C",null,null,null,null,null,null,0,180,0,null,null,null,null,null,null,0,180,0,22727.280000000002]
[null,"CHIHUAHUA","MAGP631129C83","MAGP631129HCHRNR03","PERFECTO MARQUEZ GONZALEZ","08DPT0001C",null,null,null,null,null,null,0,216,0,null,null,null,null,null,null,0,216,0,23633.1]
[null,"CHIHUAHUA","MACC861013NB9","MACC861013HCHRLR03","CARLOS ISAAC MARRUFO CALDERON","08DPT0001C",null,null,null,null,null,null,0,180,0,null,null,null,null,null,null,0,180,0,22727.280000000002]
[null,"CHIHUAHUA","MEPP891226PB1","MEPP891226MCHNZT02","PATSY MENDEZ PAZ","08DPT0001C",null,null,null,null,null,null,0,156,0,null,null,null,null,null,null,0,156,0,15186.6]
[null,"CHIHUAHUA","MEMM770410518","MEMM770410HCHRNN08","MANUEL MERAZ MENDEZ","08DPT0001C",null,null,null,null,null,null,0,192,0,null,null,null,null,null,null,0,192,0,24242.400000000001]
[null,"CHIHUAHUA","MURE810806BI4","MURE810806HCHXJM08","EMMANUEL MUÑOZ ROJAS","08DPT0001C",null,null,null,null,null,null,0,240,0,null,null,null,null,null,null,0,240,0,30303]
[null,"CHIHUAHUA","NAME521010PW5","NAME521010HCHVNN03","ENRIQUE NAVARRO MENDOZA","08DPT0001C",null,null,null,null,null,null,0,240,0,null,null,null,null,null,null,0,240,0,30303]
[null,"CHIHUAHUA","OIAO791026IM2","OIAO791026HCHLPS00","OSCAR ERNESTO OLIVAS APONTE","08DPT0001C",null,null,null,null,null,null,0,120,0,null,null,null,null,null,null,0,120,0,15151.5]
[null,"CHIHUAHUA","OEZH720627D54","OEZH720627HCHRBG04","HUGO SOCORRO ORTEGA ZUBIATE","08DPT0001C",null,null,null,null,null,null,0,180,0,null,null,null,null,null,null,0,180,0,22727.280000000002]
[null,"CHIHUAHUA","PARM520707MY1","PARM520707HPLLCG03","MIGUEL ANGEL PALMA ROCHA","08DPT0001C",null,null,null,null,null,null,0,96,0,null,null,null,null,null,null,0,96,0,9345.6]
[null,"CHIHUAHUA","PAGM7008098P1","PAGM700809HCHRRR01","MAURO RUBEN PARADA GRANADOS","08DPT0001C",null,null,null,null,null,null,0,96,0,null,null,null,null,null,null,0,96,0,12121.2]
[null,"CHIHUAHUA","PARF590815ED3","PARF590815MVZVSL20","FELICITAS PAVON ROSAS","08DPT0001C",null,null,null,null,null,null,0,180,0,null,null,null,null,null,null,0,180,0,19694.280000000002]
[null,"CHIHUAHUA","PAVE830228SH0","PAVE830228HCHZLN00","ENRIQUE PAZOS VALLES","08DPT0001C",null,null,null,null,null,null,0,240,0,null,null,null,null,null,null,0,240,0,26259]
[null,"CHIHUAHUA","PECA750727I8A","PECA750727HJCRRL03","JOSE ALEJANDRO PEREZ CORTES","08DPT0001C",null,null,null,null,null,null,0,180,0,null,null,null,null,null,null,0,180,0,22727.280000000002]
[null,"CHIHUAHUA","PICN620328PA0","PICN620328HVZNRR07","JOSE NORBERTO PINEDA CRUZ","08DPT0001C",null,null,null,null,null,null,0,144,0,null,null,null,null,null,null,0,144,0,18181.8]
[null,"CHIHUAHUA","PIRL7804262E7","PIRL780426MCHXZZ09","MARIA LIZETH PIÑON RUIZ","08DPT0001C",null,null,null,null,null,null,0,240,0,null,null,null,null,null,null,0,240,0,30303]
[null,"CHIHUAHUA","QURM640822CE7","QURM640822MCHNZR02","MARTINA LILIA QUINTANA RUIZ","08DPT0001C",null,null,null,null,null,null,0,240,0,null,null,null,null,null,null,0,240,0,30303]
[null,"CHIHUAHUA","RAGG600206G85","RAGG600206MCHMTR04","GRACIELA IMELDA RAMIREZ GUTIERREZ","08DPT0001C",null,null,null,null,null,null,0,168,0,null,null,null,null,null,null,0,168,0,21212.1]
[null,"CHIHUAHUA","RAMA741011N9A","RAMA741011MCHMRN00","ANABEL RAMOS MORALES","08DPT0001C",null,null,null,null,null,null,0,180,0,null,null,null,null,null,null,0,180,0,22727.280000000002]
[null,"CHIHUAHUA","RARN711008BK5","RARN711008MCHSMR09","NORMA PATRICIA RASCON RAMIREZ","08DPT0001C",null,null,null,null,null,null,0,204,0,null,null,null,null,null,null,0,204,0,25757.58]
[null,"CHIHUAHUA","RECN560808KM6","RECN560808MCHYRR00","MARIA NORMA REYES CARREON","08DPT0001C",null,null,null,null,null,null,0,192,0,null,null,null,null,null,null,0,192,0,24242.400000000001]
[null,"CHIHUAHUA","REOL730620M72","REOL730620MCHYRC05","LUCIA REYES ORTIZ","08DPT0001C",null,null,null,null,null,null,0,240,0,null,null,null,null,null,null,0,240,0,30303]
[null,"CHIHUAHUA","RIMI820220GQ7","RIMI820220HCHVCV02","IVAN JOEL RIVERA MACIAS","08DPT0001C",null,null,null,null,null,null,0,180,0,null,null,null,null,null,null,0,180,0,22727.280000000002]
[null,"CHIHUAHUA","ROSL660422DP2","ROSL660422HCHDLZ09","MARIA DE LA LUZ RODARTE SOLIS","08DPT0001C",null,null,null,null,null,null,0,180,0,null,null,null,null,null,null,0,180,0,22727.280000000002]
[null,"CHIHUAHUA","ROAA871025FU9","ROAA871025HCHDGL07","ALBERTO RODRIGUEZ AGUIRRE","08DPT0001C",null,null,null,null,null,null,0,240,0,null,null,null,null,null,null,0,240,0,26259]
[null,"CHIHUAHUA","ROGJ6301201E0","ROGJ630120MCHDZS08","MA DE JESUS RODRIGUEZ GUZMAN","08DPT0001C",null,null,null,null,null,null,0,240,0,null,null,null,null,null,null,0,240,0,30303]
[null,"CHIHUAHUA","ROAL730412EQ6","ROAL730412HCHJRS01","LUIS JAVIER ROJAS ARAGONEZ","08DPT0001C",null,null,null,null,null,null,0,240,0,null,null,null,null,null,null,0,240,0,30303]
[null,"CHIHUAHUA","ROPV750812QL5","ROPV750812HCHMCC00","VICTOR MANUEL ROMERO PACHECO","08DPT0001C",null,null,null,null,null,null,0,144,0,null,null,null,null,null,null,0,144,0,15755.4]
[null,"CHIHUAHUA","ROTO850629550","ROTO850629HCHNRS06","OSCAR ARMANDO RONQUILLO TERAN ","08DPT0001C",null,null,null,null,null,null,0,180,0,null,null,null,null,null,null,0,180,0,19694.280000000002]
[null,"CHIHUAHUA","ROVI820310797","ROVI820310HCLNLV07","IVAN RAMON RONQUILLO VILLALBA","08DPT0001C",null,null,null,null,null,null,0,240,0,null,null,null,null,null,null,0,240,0,30303]
[null,"CHIHUAHUA","RUNH860818SE6","RUNH860818HCHBJM07","HUMERTO ALONSO RUBIO NAJERA","08DPT0001C",null,null,null,null,null,null,0,120,0,null,null,null,null,null,null,0,120,0,11682]
[null,"CHIHUAHUA","RUMS740226UR4","RUMS740226MCHZRL09","MARIA SOLEDAD RUIZ MARQUEZ","08DPT0001C",null,null,null,null,null,null,0,180,0,null,null,null,null,null,null,0,180,0,22727.280000000002]
[null,"CHIHUAHUA","SAQG720512BW2","SAQG720512MCHNXD07","MARIA GUADALUPE SAENZ QUIÑONEZ","08DPT0001C",null,null,null,null,null,null,0,240,0,null,null,null,null,null,null,0,240,0,30303]
[null,"CHIHUAHUA","SIML5803182A8","SIML580318HCHLJS14","JOSE LUIS CARLOS SILVEYRA MEJIA","08DPT0001C",null,null,null,null,null,null,0,240,0,null,null,null,null,null,null,0,240,0,30303]
[null,"CHIHUAHUA","TAAD800122GU1","TAAD800122HCHRRL07","DELFINO TARIN ARMENDARIZ","08DPT0001C",null,null,null,null,null,null,0,144,0,null,null,null,null,null,null,0,144,0,18181.8]
[null,"CHIHUAHUA","UIOM910617AH6","UIOM910617MCHRRR00","MARIBEL URIZA ORTIZ","08DPT0001C",null,null,null,null,null,null,0,204,0,null,null,null,null,null,null,0,204,0,25757.58]
[null,"CHIHUAHUA","VACA610212RT2","VXCA610212HCHLHD03","ADOLFO VALLES CHAVEZ","08DPT0001C",null,null,null,null,null,null,0,180,0,null,null,null,null,null,null,0,180,0,22727.280000000002]
[null,"CHIHUAHUA","VADS631230CN3","VADS631230MCHLVL06","SILVIA LETICIA VALVERDE DAVILA","08DPT0001C",null,null,null,null,null,null,0,240,0,null,null,null,null,null,null,0,240,0,30303]
[null,"CHIHUAHUA","VIRR710926945","VIRR710926HCHLDB12","RUBEN VILLALOBOS RODRIGUEZ","08DPT0001C",null,null,null,null,null,null,0,240,0,null,null,null,null,null,null,0,240,0,30303]
[null,"CHIHUAHUA","VIPR570927K44","VIPR570927HCHLYF07","RAFAEL JESUS VILLEGAS PAYAN","08DPT0001C",null,null,null,null,null,null,0,240,0,null,null,null,null,null,null,0,240,0,30303]
[null,"CHIHUAHUA","AUPC720823662","AUPC720823MZSGLL09","CLARA AGÜERO PALACIOS","08DPT0002B",null,null,null,1,0,0,null,null,null,null,null,null,null,null,null,1,0,0,38140]
[null,"CHIHUAHUA","AUSL630319SG0","AUSL630319HZSGFC09","JOSE LUCIANO AGUILERA SIFUENTES","08DPT0002B",null,null,null,1,0,0,null,null,null,null,null,null,null,null,null,1,0,0,138182.27000000002]
[null,"CHIHUAHUA","AAAJ9101208M3","AAAJ910120HCHLCS03","JESUS FABIAN ALVARADO  ACOSTA","08DPT0002B",null,null,null,1,0,0,null,null,null,null,null,null,null,null,null,1,0,0,46116.47]
[null,"CHIHUAHUA","AAAN671110TZ0","AAAN671110MCHLCC06","NICOLASA ALVARADO  ACOSTA","08DPT0002B",null,null,null,1,0,0,null,null,null,null,null,null,null,null,null,1,0,0,123493.81]
[null,"CHIHUAHUA","AAEM620508I55","AAEM620508HCLLSG04","MIGUEL ANGEL ALVARADO  ESPARZA","08DPT0002B",null,null,null,1,0,0,null,null,null,null,null,null,null,null,null,1,0,0,46894.61]
[null,"CHIHUAHUA","AISJ790419494","AISJ790419HCHRTN04","JUAN MANUEL ARIAS  SOTELO","08DPT0002B",null,null,null,1,0,0,null,null,null,null,null,null,null,null,null,1,0,0,89334.290000000008]
[null,"CHIHUAHUA","AIBC800120C20","AIBC800120HCHVLS02","CESAR NOE AVILA BOLIVAR","08DPT0002B",null,null,null,1,0,0,null,null,null,null,null,null,null,null,null,1,0,0,33672.89]
[null,"CHIHUAHUA","BAML650601B92","BAML650601HDFRLS03","JOSE LUIS  BARRIENTOS MILAN","08DPT0002B",null,null,null,1,0,0,null,null,null,null,null,null,null,null,null,1,0,0,41202.19000000001]
[null,"CHIHUAHUA","BOMA6710214E1","BOMA671021HDFLXR07","ARMANDO BOLAÑOS MUÑOZ","08DPT0002B",null,null,null,1,0,0,null,null,null,null,null,null,null,null,null,1,0,0,110652.32]
[null,"CHIHUAHUA","CAPL820818LQ5","CAPL820818HCHMRS04","LUIS ROBERTO CAMPOS PORTILLO}","08DPT0002B",null,null,null,1,0,0,null,null,null,null,null,null,null,null,null,1,0,0,45044.13]
[null,"CHIHUAHUA","CACL731031A17","CACL731031MCHRNR01","LORENA CARRILLO CANO","08DPT0002B",null,null,null,1,0,0,null,null,null,null,null,null,null,null,null,1,0,0,41111.42]
[null,"CHIHUAHUA","CARJ6012178GA","CARJ601217HCHRLS07","JOSE DE JESUS CARRILLO RUELAS","08DPT0002B",null,null,null,1,0,0,null,null,null,null,null,null,null,null,null,1,0,0,60784.680000000008]
[null,"CHIHUAHUA","CARP8408274S7","CARP840827MCHHCR02","PERLA CHAVEZ ROCHA","08DPT0002B",null,null,null,1,0,0,null,null,null,null,null,null,null,null,null,1,0,0,91240.15]
[null,"CHIHUAHUA","CIBA710920FVA","CIBA710920MDGTRL04","ALMA ROSA CITAL BERTAHUD","08DPT0002B",null,null,null,1,0,0,null,null,null,null,null,null,null,null,null,1,0,0,130807.73000000001]
[null,"CHIHUAHUA","COMA6908143J5","COXM690814HCHNXR11","MARIO CONTRERAS ","08DPT0002B",null,null,null,1,0,0,null,null,null,null,null,null,null,null,null,1,0,0,62851.939999999995]
[null,"CHIHUAHUA","COCR830702UW4","COCR830702HVZRDB00","RUBEN OMAR CORTEZ CADENA","08DPT0002B",null,null,null,1,0,0,null,null,null,null,null,null,null,null,null,1,0,0,33023.659999999996]
[null,"CHIHUAHUA","DEMA661118M56","DEMA661118HCHLRB07","JOSE ABELARDO DELGADO  MORALES","08DPT0002B",null,null,null,1,0,0,null,null,null,null,null,null,null,null,null,1,0,0,103865.51000000001]
[null,"CHIHUAHUA","EAGK7806257R9","EAGK780625MCHSBR04","KARLA ESPARZA GABALDON","08DPT0002B",null,null,null,1,0,0,null,null,null,null,null,null,null,null,null,1,0,0,109093.01000000001]
[null,"CHIHUAHUA","FACF8611101I7","FACF861110HCHVNR02","FERNANDO FAVELA  CONTRERAS","08DPT0002B",null,null,null,1,0,0,null,null,null,null,null,null,null,null,null,1,0,0,45056.87]
[null,"CHIHUAHUA","FIGS610608SA8","FIGS610608MJCGNL02","SILVIA FIGUEROA GONZALEZ","08DPT0002B",null,null,null,1,0,0,null,null,null,null,null,null,null,null,null,1,0,0,99616.939999999973]
[null,"CHIHUAHUA","FOLC990507BF2","FOLC990507HCHLRS02","CESAR ARTURO FLORES LARES","08DPT0002B",null,null,null,1,0,0,null,null,null,null,null,null,null,null,null,1,0,0,26575.62]
[null,"CHIHUAHUA","GACA790108U50","GACA790108MCLLRN00","ANA LILIANA GALLARDO DE LA CRUZ","08DPT0002B",null,null,null,1,0,0,null,null,null,null,null,null,null,null,null,1,0,0,26575.62]
[null,"CHIHUAHUA","GAAD780823AVA","GAAD780823MCHRLL01","DULCE AURORA DEL CONSUELO GARCIA ALEMAN","08DPT0002B",null,null,null,1,0,0,null,null,null,null,null,null,null,null,null,1,0,0,69246.319999999992]
[null,"CHIHUAHUA","GALE580105G5A","GALE580105HCHRNN03","ENRIQUE GARCIA DE LUNA","08DPT0002B",null,null,null,1,0,0,null,null,null,null,null,null,null,null,null,1,0,0,47438.25]
[null,"CHIHUAHUA","LIHJ9107073M0","LIHJ910707HCHRRS09","JASSON RAYMUNDO LIRA HERRERA","08DPT0002B",null,null,null,1,0,0,null,null,null,null,null,null,null,null,null,1,0,0,44992.130000000005]
[null,"CHIHUAHUA","LOCJ6307091T8","LOCJ630709HCHPRS08","JESUS MARTIN LOPEZ CARO","08DPT0002B",null,null,null,1,0,0,null,null,null,null,null,null,null,null,null,1,0,0,130053.49000000002]
[null,"CHIHUAHUA","LORE9304089K5","LORE930408HCHYSR01","EARVIN MANUEL LOYA  RIOS","08DPT0002B",null,null,null,1,0,0,null,null,null,null,null,null,null,null,null,1,0,0,36341.040000000001]
[null,"CHIHUAHUA","LOCJ681030V96","LOCJ681030HCHZLS07","JESUS EDUARDO LOZOYA  CALDERON","08DPT0002B",null,null,null,1,0,0,null,null,null,null,null,null,null,null,null,1,0,0,50052.950000000004]
[null,"CHIHUAHUA","MOMN850815I1A","MOMN850815HCLNRX07","NOE MONSIVAIS MARIN","08DPT0002B",null,null,null,1,0,0,null,null,null,null,null,null,null,null,null,1,0,0,26575.62]
[null,"CHIHUAHUA","MODC711228F67","MODC711228HCLNRR07","CARLOS EDUARDO MONTANO DURAN","08DPT0002B",null,null,null,null,null,null,null,null,null,null,null,null,1,0,0,1,0,0,100611.18]
[null,"CHIHUAHUA","MOSG761016858","MOSG761016HCLNNR06","GERARDO MONTOYA SANCHEZ","08DPT0002B",null,null,null,1,0,0,null,null,null,null,null,null,null,null,null,1,0,0,44293.100000000006]
[null,"CHIHUAHUA","OOGL660522NA4","OOGL660522HCHCRS08","LUIS FELIX OCHOA GARCIA","08DPT0002B",null,null,null,null,null,null,null,null,null,null,null,null,1,0,0,1,0,0,66459.899999999994]
[null,"CHIHUAHUA","OORE7405071DA","OORE740507MCHRYS00","MARIA ESTHER OROZCO REYES","08DPT0002B",null,null,null,1,0,0,null,null,null,null,null,null,null,null,null,1,0,0,52325.360000000008]
[null,"CHIHUAHUA","RARF8407015TA","RARF840701MCHMML00","FLOR MINERVA RAMIREZ RAMIREZ","08DPT0002B",null,null,null,1,0,0,null,null,null,null,null,null,null,null,null,1,0,0,55824.070000000007]
[null,"CHIHUAHUA","ROGM631230AD4","ROGM631230MCHMRR18","MARCIA IMELDA ROMERO GARCIA","08DPT0002B",null,null,null,1,0,0,null,null,null,null,null,null,null,null,null,1,0,0,48768.29]
[null,"CHIHUAHUA","SAPP7109042V0","SAPP710904HCHLLD06","PEDRO SALAS PALOMINO","08DPT0002B",null,null,null,1,0,0,null,null,null,null,null,null,null,null,null,1,0,0,103865.51000000001]
[null,"CHIHUAHUA","TULO5510064A6","TULO551006MCHDYL01","OLGA ESPERANZA TUDA LEYVA","08DPT0002B",null,null,null,1,0,0,null,null,null,null,null,null,null,null,null,1,0,0,92351.510000000009]
[null,"CHIHUAHUA","VASC8109266G6","VASC810926MCHLLL08","CLAUDIA VALVERDE SALAZAR","08DPT0002B",null,null,null,1,0,0,null,null,null,null,null,null,null,null,null,1,0,0,52066.010000000009]
[null,"CHIHUAHUA","VAFM681203S84","VAFM681203MCHZGR05","MARICRUZ VAZQUEZ FIGUEROA","08DPT0002B",null,null,null,1,0,0,null,null,null,null,null,null,null,null,null,1,0,0,91240.15]
[null,"CHIHUAHUA","AARL701222GC6","AARL701222MCHRVB04","LIBIA GABRIELA ARAGON RIVERA","08DPT0002B",null,null,null,null,null,null,0,240,0,null,null,null,null,null,null,0,240,0,36660]
[null,"CHIHUAHUA","BAGR640911VB4","BAGR640911HCHRND09","RODOLFO ELI BARONA GONZALEZ","08DPT0002B",null,null,null,null,null,null,0,120,0,null,null,null,null,null,null,0,120,0,15931.5]
[null,"CHIHUAHUA","BOAI840527A86","BOAI840527MCHRGN00","MARIA INES BORUNDA AGUILAR","08DPT0002B",null,null,null,null,null,null,0,240,0,null,null,null,null,null,null,0,240,0,36660]
[null,"CHIHUAHUA","CACS480226NE5","CACS480226HGTMPL06","SALVADOR CAMPOS CAPETILLO","08DPT0002B",null,null,null,null,null,null,0,216,0,null,null,null,null,null,null,0,216,0,32994]
[null,"CHIHUAHUA","CAPH630209KZ0","CAPH630209MCHRSL06","HILDA MARGARITA CARRASCO POSADA","08DPT0002B",null,null,null,null,null,null,0,120,0,null,null,null,null,null,null,0,120,0,18330]
[null,"CHIHUAHUA","COCD901004DB8","COCD901004MCHRHN09","DAINA ROCIO CORTES CHAVEZ","08DPT0002B",null,null,null,null,null,null,0,216,0,null,null,null,null,null,null,0,216,0,32994]
[null,"CHIHUAHUA","EABM680229EQ9","EABM680229MCHSDR08","MARTHA GUADALUPE ESCALANTE BADILLO","08DPT0002B",null,null,null,null,null,null,0,216,0,null,null,null,null,null,null,0,216,0,32994]
[null,"CHIHUAHUA","EOHA790831RH0","EOHA790831MZSSRN01","MARIA DE LOS ANGELES ESCOBAR DE HARO","08DPT0002B",null,null,null,null,null,null,0,240,0,null,null,null,null,null,null,0,240,0,36660]
[null,"CHIHUAHUA","FAMA641105R5A","FAMA641105MCHVRL07","ALMA ISABEL FAVELA MARTINEZ","08DPT0002B",null,null,null,null,null,null,0,240,0,null,null,null,null,null,null,0,240,0,36660]
[null,"CHIHUAHUA","FOLS800726I38","FOLS800726MCHLCN07","SANDYANA FLORES LUCERO","08DPT0002B",null,null,null,null,null,null,0,240,0,null,null,null,null,null,null,0,240,0,36660]
[null,"CHIHUAHUA","FONE671109ME3","FONE671109MCHLVS06","ESPERANZA FLORES NAVARRO","08DPT0002B",null,null,null,null,null,null,0,216,0,null,null,null,null,null,null,0,216,0,32994]
[null,"CHIHUAHUA","GAGC810607AX3","GAGC810607MCHRRH07","CHRISTIAN BELEN GARCIA GARCIA","08DPT0002B",null,null,null,null,null,null,0,240,0,null,null,null,null,null,null,0,240,0,36660]
[null,"CHIHUAHUA","GOLC890608AQ0","GOLC890608MCHMRY05","CYNTHIA LILIANA GOMEZ LARA","08DPT0002B",null,null,null,null,null,null,0,240,0,null,null,null,null,null,null,0,240,0,31863]
[null,"CHIHUAHUA","GOAJ891103DFA","GOAJ891103HCHNLR08","JORGE OMAR GONZALEZ ALVIDREZ","08DPT0002B",null,null,null,null,null,null,0,216,0,null,null,null,null,null,null,0,216,0,25374.6]
[null,"CHIHUAHUA","GOCY840110NQ4","GOCY840110MCHNLS07","YSELA GONZALEZ CALDERA","08DPT0002B",null,null,null,null,null,null,0,216,0,null,null,null,null,null,null,0,216,0,32994]
[null,"CHIHUAHUA","GOMA851115JC8","GOMA851115HCHNRR07","AARON ROBERTO GONZALEZ MORAN","08DPT0002B",null,null,null,null,null,null,0,204,0,null,null,null,null,null,null,0,204,0,31161]
[null,"CHIHUAHUA","GOPS780818LH4","GOPS780818HCHNRR01","SERGIO GONZALEZ PEREZ","08DPT0002B",null,null,null,null,null,null,0,240,0,null,null,null,null,null,null,0,240,0,36660]
[null,"CHIHUAHUA","GOCE790701I32","GOXC790701MCHNXL06","CELIA BRISA GONZALEZ ","08DPT0002B",null,null,null,null,null,null,0,192,0,null,null,null,null,null,null,0,192,0,29328]
[null,"CHIHUAHUA","GUFD63111111A","GUFD631111MSLVRN17","DINA YESENIA GUEVARA FIERRO","08DPT0002B",null,null,null,null,null,null,0,240,0,null,null,null,null,null,null,0,240,0,36660]
[null,"CHIHUAHUA","HEDC640302NR2","HEDC640302HZSRZR01","CARLOS HERNANDEZ DIAZ","08DPT0002B",null,null,null,null,null,null,0,240,0,null,null,null,null,null,null,0,240,0,36660]
[null,"CHIHUAHUA","IARL8304031L7","IARL830403HZSBMS09","LUIS ROMAN IBARRA  RAMOS","08DPT0002B",null,null,null,null,null,null,0,240,0,null,null,null,null,null,null,0,240,0,36660]
[null,"CHIHUAHUA","JAAZ890626IJ1","JAAZ890626MCHSVM08","ZIMRI DANIEL JASSO AVILA","08DPT0002B",null,null,null,null,null,null,0,228,0,null,null,null,null,null,null,0,228,0,30269.879999999997]
[null,"CHIHUAHUA","LAOE880302RW2","LAOE880302MCHZRL08","ELIZA ARELY LAZALDE ORTIZ","08DPT0002B",null,null,null,null,null,null,0,228,0,null,null,null,null,null,null,0,228,0,34827]
[null,"CHIHUAHUA","LEGF590530LW9","LEGF590530HCHNTR00","FERNANDO LEON GUTIERREZ","08DPT0002B",null,null,null,null,null,null,0,240,0,null,null,null,null,null,null,0,240,0,36660]
[null,"CHIHUAHUA","LOCA790201FP3","LXCA790201HCHRSD09","ADRIAN FRANCISCO LOERA  CASTRO","08DPT0002B",null,null,null,null,null,null,0,240,0,null,null,null,null,null,null,0,240,0,36660]
[null,"CHIHUAHUA","LORF830406762","LORF830406HCHPML02","FELIPE LOPEZ RAMIREZ","08DPT0002B",null,null,null,null,null,null,0,216,0,null,null,null,null,null,null,0,216,0,28676.7]
[null,"CHIHUAHUA","LURG880415UKA","LURG880415MCHNVB04","GABRIELA ALEJANDRA LUNA  RIVAS","08DPT0002B",null,null,null,null,null,null,0,216,0,null,null,null,null,null,null,0,216,0,32994]
[null,"CHIHUAHUA","LURY8009223V9","LURY800922MSPNBJ02","YAJAIRA ALEJANDRA LUNA ROBLEDO","08DPT0002B",null,null,null,null,null,null,0,168,0,null,null,null,null,null,null,0,168,0,13157.2]
[null,"CHIHUAHUA","MARJ6706253G1","MARJ670625HCHRSN08","JUAN FRANCISCO MARQUEZ DE LA ROSA","08DPT0002B",null,null,null,null,null,null,0,240,0,null,null,null,null,null,null,0,240,0,31863]
[null,"CHIHUAHUA","MAHR7303052U1","MAHR730305HCHRRG05","RIGOBERTO MARTINEZ HERNANDEZ","08DPT0002B",null,null,null,null,null,null,0,240,0,null,null,null,null,null,null,0,240,0,36660]
[null,"CHIHUAHUA","MARE920423KX8","MARE920423MCHRNR05","ERIKA ELIZABETH MARTINEZ RANGEL","08DPT0002B",null,null,null,null,null,null,0,216,0,null,null,null,null,null,null,0,216,0,32994]
[null,"CHIHUAHUA","MAER7001128F3","MAER700112MCHTSQ04","RAQUEL  MATA ESPARZA","08DPT0002B",null,null,null,null,null,null,0,216,0,null,null,null,null,null,null,0,216,0,32994]
[null,"CHIHUAHUA","MEMA740518TM8","MEMA740518HCHLLL03","ALFONSO NATANAEL MELENDEZ MELENDEZ","08DPT0002B",null,null,null,null,null,null,0,228,0,null,null,null,null,null,null,0,228,0,34827]
[null,"CHIHUAHUA","MEPF691219UT3","MEPF691219HCHLRR06","FRANCISCO JAVIER MELENDEZ PEREYRA","08DPT0002B",null,null,null,null,null,null,0,216,0,null,null,null,null,null,null,0,216,0,32994]
[null,"CHIHUAHUA","MERE811126DU3","MERE811126MCHLMD02","EDNA MELINA MELERO RAMIREZ","08DPT0002B",null,null,null,null,null,null,0,216,0,null,null,null,null,null,null,0,216,0,32994]
[null,"CHIHUAHUA","MEMN800616CH0","MEMN800616MZSNRR04","NORA DE LOURDES MENDEZ MARRUFO","08DPT0002B",null,null,null,null,null,null,0,240,0,null,null,null,null,null,null,0,240,0,36660]
[null,"CHIHUAHUA","MEPM521007BW0","MEPM521007MSPNTR05","MARINA MENDOZA PATIÑO","08DPT0002B",null,null,null,null,null,null,0,240,0,null,null,null,null,null,null,0,240,0,36660]
[null,"CHIHUAHUA","MEHE771226AK0","MEHE771226MCHZRM07","EMMA MARINA MEZA HERNANDEZ","08DPT0002B",null,null,null,null,null,null,0,228,0,null,null,null,null,null,null,0,228,0,34827]
[null,"CHIHUAHUA","MONJ730522LH4","MONJ730522HCHLXN04","JUAN BENJAMIN MOLINA NUÑEZ","08DPT0002B",null,null,null,null,null,null,0,216,0,null,null,null,null,null,null,0,216,0,25374.6]
[null,"CHIHUAHUA","MOAI970902SU8","MOAI970902HCHNRS09","ISAAC MONREAL ARVIZU","08DPT0002B",null,null,null,null,null,null,0,144,0,null,null,null,null,null,null,0,144,0,8368.7999999999993]
[null,"CHIHUAHUA","MOMC840319BC9","MOMC840319MCHRRR01","CARMINA SARA MORENO MORALES","08DPT0002B",null,null,null,null,null,null,0,180,0,null,null,null,null,null,null,0,180,0,23897.280000000002]
[null,"CHIHUAHUA","NARE6212101N2","NARE621210HCHVDL15","ELISEO MANUEL NAVA RODRIGUEZ","08DPT0002B",null,null,null,null,null,null,0,192,0,null,null,null,null,null,null,0,192,0,29328]
[null,"CHIHUAHUA","NAMR911217QR2","NAMR911217MCHVRY09","REYNA GUADALUPE NAVARRETE MARROQUIN","08DPT0002B",null,null,null,null,null,null,0,228,0,null,null,null,null,null,null,0,228,0,30269.879999999997]
[null,"CHIHUAHUA","OICT750827I13","OICT750827MCHLRR05","MARIA TERESA OLIVAS  CORONADO","08DPT0002B",null,null,null,null,null,null,0,168,0,null,null,null,null,null,null,0,168,0,25662]
[null,"CHIHUAHUA","OEZA770117EH9","OEZA770117HCHRPL04","ALFREDO LORENZO ORTEGA ZEPEDA","08DPT0002B",null,null,null,null,null,null,0,228,0,null,null,null,null,null,null,0,228,0,34827]
[null,"CHIHUAHUA","PAVM750409GD9","PAVM750409HCLLRR05","JOSE MARIA PALACIOS VARELA","08DPT0002B",null,null,null,null,null,null,0,144,0,null,null,null,null,null,null,0,144,0,16916.400000000001]
[null,"CHIHUAHUA","PACJ951020J55","PACJ951020HCHZRN09","JUAN ANTONIO PAZ CERON","08DPT0002B",null,null,null,null,null,null,0,156,0,null,null,null,null,null,null,0,156,0,12217.4]
[null,"CHIHUAHUA","PEGF4912049U3","PEGF491204HCHRRR02","FRANCISCO PEREZ GUERRERO","08DPT0002B",null,null,null,null,null,null,0,228,0,null,null,null,null,null,null,0,228,0,34827]
[null,"CHIHUAHUA","PIMR770113LW6","PIMR770113MCLNXC04","ROCIO PINTO MUÑOZ","08DPT0002B",null,null,null,null,null,null,0,240,0,null,null,null,null,null,null,0,240,0,36660]
[null,"CHIHUAHUA","POGH680928E46","POGH680928HCHRTC09","HECTOR MIGUEL PORRAS GUTIERREZ","08DPT0002B",null,null,null,null,null,null,0,240,0,null,null,null,null,null,null,0,240,0,36660]
[null,"CHIHUAHUA","RABM8107186R9","RABM810718MCHMRR16","MIRIAM SUSANA RAMIREZ BARRERA","08DPT0002B",null,null,null,null,null,null,0,240,0,null,null,null,null,null,null,0,240,0,36660]
[null,"CHIHUAHUA","RACJ670625F74","RACJ670625HCHMRN00","JUAN RAMON RAMIREZ CORRAL","08DPT0002B",null,null,null,null,null,null,0,180,0,null,null,null,null,null,null,0,180,0,27495]
[null,"CHIHUAHUA","RAVJ750924S61","RAVJ750924HCHMLN06","JUAN GABRIEL RAMIREZ VELA","08DPT0002B",null,null,null,null,null,null,0,240,0,null,null,null,null,null,null,0,240,0,31863]
[null,"CHIHUAHUA","REFG8206303T2","REFG820630MCLYLR05","GRISELDA REYES FLORES","08DPT0002B",null,null,null,null,null,null,0,180,0,null,null,null,null,null,null,0,180,0,21145.5]
[null,"CHIHUAHUA","RIOH600504T14","RIOH600504HCHVLC08","HECTOR RAMON RIVERA OLIVAS","08DPT0002B",null,null,null,null,null,null,0,192,0,null,null,null,null,null,null,0,192,0,29328]
[null,"CHIHUAHUA","ROAL7201241P5","ROAL720124MCHDVD01","LIDIA ANGELICA RODRIGUEZ AVILA","08DPT0002B",null,null,null,null,null,null,0,228,0,null,null,null,null,null,null,0,228,0,34827]
[null,"CHIHUAHUA","ROMM8706134U5","ROMM870613HCHDNN05","MANUEL ANTONIO RODRIGUEZ MONREAL","08DPT0002B",null,null,null,null,null,null,0,108,0,null,null,null,null,null,null,0,108,0,10572.75]
[null,"CHIHUAHUA","ROPE5908038V9","ROPE590803HCHDRL01","ELIGIO RODRIGUEZ PRIETO","08DPT0002B",null,null,null,null,null,null,0,240,0,null,null,null,null,null,null,0,240,0,31863]
[null,"CHIHUAHUA","ROVM860804PC7","ROVM898044HCHDLN05","JOSE MANUEL RODRIGUEZ VILLA","08DPT0002B",null,null,null,null,null,null,0,240,0,null,null,null,null,null,null,0,240,0,31863]
[null,"CHIHUAHUA","SAGR890912TX9","SAGR890912HCHVTC08","RICARDO SAAVEDRA GUTIERREZ","08DPT0002B",null,null,null,null,null,null,0,240,0,null,null,null,null,null,null,0,240,0,18796]
[null,"CHIHUAHUA","SAVY820923BCA","SAVY820923MCHLLM00","YAMET VERENICE SALAZAR VELAZQUEZ","08DPT0002B",null,null,null,null,null,null,0,240,0,null,null,null,null,null,null,0,240,0,36660]
[null,"CHIHUAHUA","SELV800114DJ4","SELV800114HCHGZC03","VICTOR ANDRES SEGOVIA LOZOYA","08DPT0002B",null,null,null,null,null,null,0,240,0,null,null,null,null,null,null,0,240,0,36660]
[null,"CHIHUAHUA","SOOA7210299X8","SOOA721029MCHLLN06","ANA LUISA SOLIS OLIVAS","08DPT0002B",null,null,null,null,null,null,0,120,0,null,null,null,null,null,null,0,120,0,18330]
[null,"CHIHUAHUA","SORA920618QC4","SORA920618HVZTYL06","JOSE ALBERTO SOTO REYES","08DPT0002B",null,null,null,null,null,null,0,192,0,null,null,null,null,null,null,0,192,0,11158.4]
[null,"CHIHUAHUA","TERG520428J43","TERG520428HDFLVL09","GUILLERMO TELLEZ REVILLA","08DPT0002B",null,null,null,null,null,null,0,120,0,null,null,null,null,null,null,0,120,0,18330]
[null,"CHIHUAHUA","VAOA630813IE8","VAOA630813MDGLRN07","ANGELA MARIA VALTIERRA  ORTEGA","08DPT0002B",null,null,null,null,null,null,0,192,0,null,null,null,null,null,null,0,192,0,29328]
[null,"CHIHUAHUA","VEGD970725699","VEGD970725HCHNNN08","DANIEL ARTURO VENZOR GONZALEZ","08DPT0002B",null,null,null,null,null,null,0,120,0,null,null,null,null,null,null,0,120,0,10461]
[null,"CHIHUAHUA","YAGC851128SX6","YAGC851128MCHXNY03","CYNTHIA AURORA YAÑEZ GONZALEZ","08DPT0002B",null,null,null,null,null,null,0,216,0,null,null,null,null,null,null,0,216,0,32994]
[null,"CHIHUAHUA","AUVJ9103083J2","AUVJ910308HCHGLN15","JUAN DE DIOS AGUIRRE VILLARREAL ","08DPT0003A",null,null,null,1,0,0,null,null,null,null,null,null,null,null,null,1,0,0,30058.27]
[null,"CHIHUAHUA","AAIV730701KH6","AAIV730701MCHLTR08","VERONICA ALARCON ITURRALDE","08DPT0003A",null,null,null,null,null,null,null,null,null,null,null,null,1,0,0,1,0,0,66459.899999999994]
[null,"CHIHUAHUA","AOOC791125GF8","AOOC791125HCHLRR17","CRISTHIAN OMAR ALOR ORTEGA ","08DPT0003A",null,null,null,1,0,0,null,null,null,null,null,null,null,null,null,1,0,0,85990.02]
[null,"CHIHUAHUA","AEHL721013358","AEHL721013MCHRRR04","LAURA ELENA ARMENDARIZ HUERTA ","08DPT0003A",null,null,null,1,0,0,null,null,null,null,null,null,null,null,null,1,0,0,45496.92]
[null,"CHIHUAHUA","AOGA850323MS8","AOGA850323MCHRRD09","ADRIANA ARZOLA GARIBAY ","08DPT0003A",null,null,null,1,0,0,null,null,null,null,null,null,null,null,null,1,0,0,46289.37]
[null,"CHIHUAHUA","BALJ741015QJ5","BALJ741015HNTCPR09","JORGE GERARDO BACA LOPEZ ","08DPT0003A",null,null,null,null,null,null,null,null,null,null,null,null,1,0,0,1,0,0,85992.48]
[null,"CHIHUAHUA","CALS630411D26","CALS630411HCHNSL01","SALVADOR CANO LEOS","08DPT0003A",null,null,null,1,0,0,null,null,null,null,null,null,null,null,null,1,0,0,103563.82]
[null,"CHIHUAHUA","COSC761202AU8","COSC761202MCHRNL00","CLAUDIA CORONADO SAENZ ","08DPT0003A",null,null,null,1,0,0,null,null,null,null,null,null,null,null,null,1,0,0,47084.93]
[null,"CHIHUAHUA","CORE740806FH5","CORE740806HCHRYN08","ENCARNACION CORRAL REYES ","08DPT0003A",null,null,null,1,0,0,null,null,null,null,null,null,null,null,null,1,0,0,36811.93]
[null,"CHIHUAHUA","EABJ810502G45","EABJ810502HCHSYR08","JORGE HUMBERTO ESPARZA BAYLON ","08DPT0003A",null,null,null,1,0,0,null,null,null,null,null,null,null,null,null,1,0,0,35897.33]
[null,"CHIHUAHUA","EIHE740513ST9","EIHE740513MCHSRV03","EVA CELINA ESPINOSA HERNANDEZ ","08DPT0003A",null,null,null,1,0,0,null,null,null,null,null,null,null,null,null,1,0,0,81893.89]
[null,"CHIHUAHUA","GAFS650908R84","GAFS650908HCHRLR07","SERGIO MARTIN GARCIA FLORES ","08DPT0003A",null,null,null,1,0,0,null,null,null,null,null,null,null,null,null,1,0,0,59450.8]
[null,"CHIHUAHUA","GAAV670716S40","GAAV670716HCHRRC06","VICTOR MANUEL GARDEA ARREDONDO ","08DPT0003A",null,null,null,1,0,0,null,null,null,null,null,null,null,null,null,1,0,0,78074.399999999994]
[null,"CHIHUAHUA","GAHA8701284V2","GAHA870128HCHRRL07","ALVARO GARDEA HEREDIA","08DPT0003A",null,null,null,1,0,0,null,null,null,null,null,null,null,null,null,1,0,0,33593.81]
[null,"CHIHUAHUA","GOSM730702M55","GOSM730702HCHMNS00","MOISES OCTAVIO GOMEZ SAENZ","08DPT0003A",null,null,null,1,0,0,null,null,null,null,null,null,null,null,null,1,0,0,22755.119999999999]
[null,"CHIHUAHUA","GOVJ720801R43","GOVJ720801MCHNLD09","JUDITH GONZALEZ VALLES ","08DPT0003A",null,null,null,1,0,0,null,null,null,null,null,null,null,null,null,1,0,0,132211.92000000001]
[null,"CHIHUAHUA","HECG831209L74","HECG831209MCHRBB09","GABRIELA JUDITH HEREDIA CABALLERO ","08DPT0003A",null,null,null,1,0,0,null,null,null,null,null,null,null,null,null,1,0,0,30037.13]
[null,"CHIHUAHUA","HESH611022NF3","HESH611022HCHRNL03","HILADRIO HEREDIA SAENZ ","08DPT0003A",null,null,null,1,0,0,null,null,null,null,null,null,null,null,null,1,0,0,43554.37]
[null,"CHIHUAHUA","HEGM7510295L3","HEGM751029MCHRTY07","MAYRA VERONICA HERNANDEZ GUTIERREZ ","08DPT0003A",null,null,null,1,0,0,null,null,null,null,null,null,null,null,null,1,0,0,50564.75]
[null,"CHIHUAHUA","MEHP811017GD5","MEHP811017HCHNRL02","PAUL ALONSO MENDEZ HERRERA ","08DPT0003A",null,null,null,1,0,0,null,null,null,null,null,null,null,null,null,1,0,0,37173.910000000003]
[null,"CHIHUAHUA","MEMD550401S32","MEMD550401HCHNTL01","JOSE DOLORES MENDEZ MOTA","08DPT0003A",null,null,null,1,0,0,null,null,null,null,null,null,null,null,null,1,0,0,37913.949999999997]
[null,"CHIHUAHUA","MOIR7306072Z5","MOIR730607HCHLBM08","RAMON HUMBERTO MOLINA IBARRA ","08DPT0003A",null,null,null,1,0,0,null,null,null,null,null,null,null,null,null,1,0,0,34840.85]
[null,"CHIHUAHUA","MOME900109M68","MOHR810216HCHNLN06","RENE GUADALUPE MONTES HOLGUIN ","08DPT0003A",null,null,null,1,0,0,null,null,null,null,null,null,null,null,null,1,0,0,33898.25]
[null,"CHIHUAHUA","MOHR810216267","MOME900109MCHNNS03","ESMERALDA JANETH MONTES MONTES ","08DPT0003A",null,null,null,1,0,0,null,null,null,null,null,null,null,null,null,1,0,0,37255.949999999997]
[null,"CHIHUAHUA","MOCY820701FR6","MOCY820701MCHRHS01","MARTHA ELVIRA ORTIZ CHAVEZ ","08DPT0003A",null,null,null,1,0,0,null,null,null,null,null,null,null,null,null,1,0,0,61930.17]
[null,"CHIHUAHUA","PESB570420393","PESB570420HCHRSN03","BENJAMIN PEREZ SOSA ","08DPT0003A",null,null,null,1,0,0,null,null,null,null,null,null,null,null,null,1,0,0,45711.45]
[null,"CHIHUAHUA","QURM641112699","QURM641112HCHXMR08","MARTIN RENE QUIÑONEZ RAMIREZ ","08DPT0003A",null,null,null,1,0,0,null,null,null,null,null,null,null,null,null,1,0,0,39106.21]
[null,"CHIHUAHUA","QUYA890925Q52","QUYA890925MCHXXN07","ANABEL QUIÑONEZ YAÑEZ ","08DPT0003A",null,null,null,1,0,0,null,null,null,null,null,null,null,null,null,1,0,0,50075.31]
[null,"CHIHUAHUA","SUCM720601QH7","SUCM720601MCHRRY01","MYRNA MANUELA SUAREZ CORRAL ","08DPT0003A",null,null,null,1,0,0,null,null,null,null,null,null,null,null,null,1,0,0,90141.03]
[null,"CHIHUAHUA","UIRL701220D40","UIRL701220MCHRMR07","MARIA DE LOURDES URBINA RAMIREZ","08DPT0003A",null,null,null,1,0,0,null,null,null,null,null,null,null,null,null,1,0,0,70468.92]
[null,"CHIHUAHUA","VATA751225F38","VATA751225HCHLRL00","ALFREDO VALLES TORRES ","08DPT0003A",null,null,null,1,0,0,null,null,null,null,null,null,null,null,null,1,0,0,79779.16]
[null,"CHIHUAHUA","YADR7710046J3","YADR771004MCHXZS02","ROSA IVONNE YAÑEZ DIAZ ","08DPT0003A",null,null,null,1,0,0,null,null,null,null,null,null,null,null,null,1,0,0,68101.73]
[null,"CHIHUAHUA","AOCF7610047IA","AOCF761204HCHCBR06","FRANCISCO ACOSTA CONTRERAS","08DPT0003A",null,null,null,null,null,null,0,240,0,null,null,null,null,null,null,0,240,0,30303]
[null,"CHIHUAHUA","AOMM7702115QA","AOMM770211MCHCRD18","MIDIAM LOURDES ACOSTA MERAZ","08DPT0003A",null,null,null,null,null,null,0,192,0,null,null,null,null,null,null,0,192,0,21007.200000000001]
[null,"CHIHUAHUA","AUQN701229G72","AUQN701229MCHGNR05","NORMA AGUIRRE QUINTANA ","08DPT0003A",null,null,null,null,null,null,0,240,0,null,null,null,null,null,null,0,240,0,26259]
[null,"CHIHUAHUA","AAHE730629HA8","AAHE730629HDGLRD05","EDGAR JESUS ALBA HERNANDEZ","08DPT0003A",null,null,null,null,null,null,0,192,0,null,null,null,null,null,null,0,192,0,24242.400000000001]
[null,"CHIHUAHUA","AEOP850816BU5","AEOP850816HCHRLD08","PEDRO RAFAEL ARMENDARIZ OLIVAS","08DPT0003A",null,null,null,null,null,null,0,192,0,null,null,null,null,null,null,0,192,0,24242.400000000001]
[null,"CHIHUAHUA","AERG670801H43","AERG670801HCHRVB09","GABRIEL ARMENDARIZ RIVAS","08DPT0003A",null,null,null,null,null,null,0,216,0,null,null,null,null,null,null,0,216,0,27272.7]
[null,"CHIHUAHUA","AERH6411189A9","AERH641118HCHRNG06","HUGO FRANCISCO ARMENDARIZ RONQUILLO","08DPT0003A",null,null,null,null,null,null,0,120,0,null,null,null,null,null,null,0,120,0,11682]
[null,"CHIHUAHUA","BASJ720920637","BASJ720920HCHCMV04","JAVIER BACA SAMPER","08DPT0003A",null,null,null,null,null,null,0,216,0,null,null,null,null,null,null,0,216,0,27272.7]
[null,"CHIHUAHUA","BAMF820909BC1","BAMF820909MCHLRT08","FATIMA DEL CARMEN BALDERAS MORALES","08DPT0003A",null,null,null,null,null,null,0,216,0,null,null,null,null,null,null,0,216,0,27272.7]
[null,"CHIHUAHUA","CACF650131IUA","CACF650131HCHNHL00","FILIBERTO CANO CHAVEZ","08DPT0003A",null,null,null,null,null,null,0,240,0,null,null,null,null,null,null,0,240,0,23364]
[null,"CHIHUAHUA","CALA591128150","CALA591128HCHNSB00","ABRAHAM CANO LEOS","08DPT0003A",null,null,null,null,null,null,0,120,0,null,null,null,null,null,null,0,120,0,15151.5]
[null,"CHIHUAHUA","CATI910806HS0","CATI910806HCHRRV03","IVAN DOROTEO CARRERA DE LA TORRE","08DPT0003A",null,null,null,null,null,null,0,216,0,null,null,null,null,null,null,0,216,0,27272.7]
[null,"CHIHUAHUA","CATN8302135X1","CATN830213MCHRRD06","NADIA BEATRIZ CARRERA DE LA TORRE","08DPT0003A",null,null,null,null,null,null,0,216,0,null,null,null,null,null,null,0,216,0,27272.7]
[null,"CHIHUAHUA","CAGG681119QE9","CAGG681119MCHRRB25","MARIA GABRIELA CARRILLO GARDEA","08DPT0003A",null,null,null,null,null,null,0,204,0,null,null,null,null,null,null,0,204,0,25757.58]
[null,"CHIHUAHUA","CATA900830PFA","CATA900830MCHRRL03","ALEJANDRA IVETTE  CARRILLO TRUJILLO","08DPT0003A",null,null,null,null,null,null,0,240,0,null,null,null,null,null,null,0,240,0,30303]
[null,"CHIHUAHUA","CATI851219KEA","CATI851219MCHRRR12","IRMA RAQUEL CARRILLO TRUJILLO","08DPT0003A",null,null,null,null,null,null,0,96,0,null,null,null,null,null,null,0,96,0,12121.2]
[null,"CHIHUAHUA","CAGL680404GU5","CAGL680404MCHSTT08","LETICIA CASILLAS GUTIERREZ","08DPT0003A",null,null,null,null,null,null,0,192,0,null,null,null,null,null,null,0,192,0,24242.400000000001]
[null,"CHIHUAHUA","CEBC880121MJ0","CEBC880121MCHBCL06","CLAUDIA INES CEBALLOS BACA","08DPT0003A",null,null,null,null,null,null,0,240,0,null,null,null,null,null,null,0,240,0,30303]
[null,"CHIHUAHUA","CEHF701204P69","CEHF701204HDGRRR02","FRANCISCO JAVIER CERENIL HERRERA","08DPT0003A",null,null,null,null,null,null,0,216,0,null,null,null,null,null,null,0,216,0,27272.7]
[null,"CHIHUAHUA","CASC781201J96","CASC781201MCHHNR02","CORINA CHAVEZ SANCHEZ","08DPT0003A",null,null,null,null,null,null,0,216,0,null,null,null,null,null,null,0,216,0,27272.7]
[null,"CHIHUAHUA","DERI7801118J5","DEXR780111HCHLXC03","RICARDO DELGADO","08DPT0003A",null,null,null,null,null,null,0,228,0,null,null,null,null,null,null,0,228,0,23633.1]
[null,"CHIHUAHUA","LEPJ860727765","LEPJ860727HCHNRV08","JAVIER EDUVIGES DE LEON PARADA","08DPT0003A",null,null,null,null,null,null,0,216,0,null,null,null,null,null,null,0,216,0,28787.88]
[null,"CHIHUAHUA","EARD8007284EA","EARD800728MCHSCL06","DULCE MARGARITA ELIZABETH ESCALANTE ROCHA","08DPT0003A",null,null,null,null,null,null,0,240,0,null,null,null,null,null,null,0,240,0,30303]
[null,"CHIHUAHUA","FEAL8707295J5","DUPB710508MCHRRR02","LUIS RAUL FERNANDEZ ACOSTA","08DPT0003A",null,null,null,null,null,null,0,180,0,null,null,null,null,null,null,0,180,0,22727.279999999999]
[null,"CHIHUAHUA","GAQL770122HI2","GAQL770122MCHLXZ06","LUZ ELIZABETH GALVAN QUIÑONEZ","08DPT0003A",null,null,null,null,null,null,0,216,0,null,null,null,null,null,null,0,216,0,27272.7]
[null,"CHIHUAHUA","GACP590517MU6","GACP590517MCHRHT05","PATRICIA EUGENIA GARCIA CHAVEZ","08DPT0003A",null,null,null,null,null,null,0,216,0,null,null,null,null,null,null,0,216,0,27272.7]
[null,"CHIHUAHUA","GARJ67122131A","GARJ671221HCHRZM09","JAIME GARCIA RUIZ","08DPT0003A",null,null,null,null,null,null,0,240,0,null,null,null,null,null,null,0,240,0,30303]
[null,"CHIHUAHUA","GODK810903VC5","GODK810903MCHNVN04","KENIS GONZALEZ DAVILA","08DPT0003A",null,null,null,null,null,null,0,204,0,null,null,null,null,null,null,0,204,0,25757.58]
[null,"CHIHUAHUA","GOGA810922999","GOGA810922HCHNRG02","AGUSTIN GONZALEZ GARCIA","08DPT0003A",null,null,null,null,null,null,0,240,0,null,null,null,null,null,null,0,240,0,30303]
[null,"CHIHUAHUA","GOGJ8811064X6","GOGJ881106MCHNTS09","JESSICA JANETH GONZALEZ GUTIERREZ","08DPT0003A",null,null,null,null,null,null,0,240,0,null,null,null,null,null,null,0,240,0,30303]
[null,"CHIHUAHUA","GOHD580525IP0","GOHD580525HCHNRV01","DAVID GONZALEZ HERNANDEZ","08DPT0003A",null,null,null,null,null,null,0,240,0,null,null,null,null,null,null,0,240,0,26259]
[null,"CHIHUAHUA","GUCG610126B56","GUCG610126HCHTNR03","JOSE GERARDO GUTIERREZ CONTRERAS","08DPT0003A",null,null,null,null,null,null,0,144,0,null,null,null,null,null,null,0,144,0,18181.8]
[null,"CHIHUAHUA","HEAV711202QZ8","HEAV711202MCHRGV01","VIVIANA HERNANDEZ AGUILERA","08DPT0003A",null,null,null,null,null,null,0,108,0,null,null,null,null,null,null,0,108,0,13636.38]
[null,"CHIHUAHUA","HEAA900716PY3","HEAA900716HCHRGL00","ALFREDO HERNANDEZ AGUIRRE","08DPT0003A",null,null,null,null,null,null,0,204,0,null,null,null,null,null,null,0,204,0,22320.18]
[null,"CHIHUAHUA","HEAA881029IG6","HEAA881029MCHRNN04","ANGELICA HERNANDEZ ANGEL","08DPT0003A",null,null,null,null,null,null,0,216,0,null,null,null,null,null,null,0,216,0,27272.7]
[null,"CHIHUAHUA","HISE750912LP7","HISE750912MCHNNT05","ETHEL JANETH HINOJOS SANCHEZ","08DPT0003A",null,null,null,null,null,null,0,240,0,null,null,null,null,null,null,0,240,0,30303]
[null,"CHIHUAHUA","HOOJ841127R23","HOOJ841127HCHLJS04","JESUS MANUEL HOLGUIN OJEDA","08DPT0003A",null,null,null,null,null,null,0,240,0,null,null,null,null,null,null,0,240,0,30303]
[null,"CHIHUAHUA","HOQS841119E44","HOQS841119MCHLNL02","SILVIA HOLGUIN QUINTANA","08DPT0003A",null,null,null,null,null,null,0,240,0,null,null,null,null,null,null,0,240,0,30303]
[null,"CHIHUAHUA","IEPA690710Q2A","IEPA690710HZSRRL07","ALEJANDRO IRENE PEREZ","08DPT0003A",null,null,null,null,null,null,0,228,0,null,null,null,null,null,null,0,228,0,28787.88]
[null,"CHIHUAHUA","JUEM870729SW2","JUEM870729MCHRSR04","MARINA JUAREZ ESPARZA","08DPT0003A",null,null,null,null,null,null,0,96,0,null,null,null,null,null,null,0,96,0,9345.6]
[null,"CHIHUAHUA","JUGE790622JJ2","JUGE790622HCHRRD03","EDGAR ELIEL JUAREZ GRAJEDA","08DPT0003A",null,null,null,null,null,null,0,240,0,null,null,null,null,null,null,0,240,0,30303]
[null,"CHIHUAHUA","LARJ611212G44","LARJ611212HCHZDL03","JOEL GUADALUPE LAZCANO RODRIGUEZ","08DPT0003A",null,null,null,null,null,null,0,180,0,null,null,null,null,null,null,0,180,0,17523]
[null,"CHIHUAHUA","LISA761208237","LISA761208HCHCLN05","ANGEL LICERIO SILVEYRA","08DPT0003A",null,null,null,null,null,null,0,228,0,null,null,null,null,null,null,0,228,0,22195.8]
[null,"CHIHUAHUA","LOGJ770422620","LOGJ770422HCHPRL08","JOEL ALONSO LOPEZ GRANADOS","08DPT0003A",null,null,null,null,null,null,0,228,0,null,null,null,null,null,null,0,228,0,28787.88]
[null,"CHIHUAHUA","LOSS7606157X9","LOSS760615MCHPLL02","SILVIA LOPEZ SALCIDO","08DPT0003A",null,null,null,null,null,null,0,180,0,null,null,null,null,null,null,0,180,0,22727.279999999999]
[null,"CHIHUAHUA","LOCM7912081Q9","LOCM791208MCHYLR09","MARTHA LAURA LOYA CELESTIN","08DPT0003A",null,null,null,null,null,null,0,216,0,null,null,null,null,null,null,0,216,0,27272.7]
[null,"CHIHUAHUA","MAAK800331I60","MAAK800331MCHCGR00","KAREN LOURDES MACIAS AGUIRRE","08DPT0003A",null,null,null,null,null,null,0,180,0,null,null,null,null,null,null,0,180,0,22727.279999999999]
[null,"CHIHUAHUA","MAMF571028UH3","MAMF571028HCHRCR08","FRANCISCO ROBERTO MARTINEZ MACIAS","08DPT0003A",null,null,null,null,null,null,0,240,0,null,null,null,null,null,null,0,240,0,30303]
[null,"CHIHUAHUA","MAMS761009L43","MAMS761009HCHRCR04","SERGIO RENE MARTINEZ MACIAS","08DPT0003A",null,null,null,null,null,null,0,204,0,null,null,null,null,null,null,0,204,0,22320.18]
[null,"CHIHUAHUA","MAML781222TP2","MAML781222MCHRNR05","LAURA GABRIELA MARTINEZ MONARREZ","08DPT0003A",null,null,null,null,null,null,0,192,0,null,null,null,null,null,null,0,192,0,24242.400000000001]
[null,"CHIHUAHUA","MAPJ881207NN8","MAPJ881207MCHRRN07","JANETH DERAT MARTINEZ PROSPERO","08DPT0003A",null,null,null,null,null,null,0,216,0,null,null,null,null,null,null,0,216,0,27272.7]
[null,"CHIHUAHUA","MARB780909MG5","MARB780909MCHRSR07","BRENDA SOCORRO MARTINEZ RIOS","08DPT0003A",null,null,null,null,null,null,0,240,0,null,null,null,null,null,null,0,240,0,30303]
[null,"CHIHUAHUA","MEMP850117HB8","MEMP850117MCHNNL01","PALOMA DEL CARMEN MENDEZ MENDEZ","08DPT0003A",null,null,null,null,null,null,0,240,0,null,null,null,null,null,null,0,240,0,30303]
[null,"CHIHUAHUA","MOHE7612192R9","MOHE761219HCHNLD06","EDGAR OBEK MONTES HOLGUIN","08DPT0003A",null,null,null,null,null,null,0,192,0,null,null,null,null,null,null,0,192,0,24242.400000000001]
[null,"CHIHUAHUA","MOMA830930QR2","MOMA830930MCHRRN04","ANTONIA MORENO MORALES","08DPT0003A",null,null,null,null,null,null,0,216,0,null,null,null,null,null,null,0,216,0,27272.7]
[null,"CHIHUAHUA","NAMR830722I63","NAMR830722MCHXNB01","REBECA DIANA NANEZ MENDOZA","08DPT0003A",null,null,null,null,null,null,0,240,0,null,null,null,null,null,null,0,240,0,26259]
[null,"CHIHUAHUA","PAQR840612BHA","PAQR840612HCHLXM03","JOSE RAMON PALMA QUIÑONEZ","08DPT0003A",null,null,null,null,null,null,0,240,0,null,null,null,null,null,null,0,240,0,26259]
[null,"CHIHUAHUA","PAMZ880803S42","PAMZ880803MCHTRM09","ZAMISH GABRIELA PATIÑO MORALES","08DPT0003A",null,null,null,null,null,null,0,216,0,null,null,null,null,null,null,0,216,0,21837.599999999999]
[null,"CHIHUAHUA","PERO820514295","PERO820514HCHRMM06","OMAR ARMANDO PEREZ RAMIREZ","08DPT0003A",null,null,null,null,null,null,0,240,0,null,null,null,null,null,null,0,240,0,30303]
[null,"CHIHUAHUA","QUVC860208IX4","QUVC860208MCHNLR06","CRISTINA QUINTANA VILLEGAS","08DPT0003A",null,null,null,null,null,null,0,204,0,null,null,null,null,null,null,0,204,0,22320.18]
[null,"CHIHUAHUA","QUGG830326LY2","QUGG830326MCHXRR05","GEORGINA ALHELI QUIÑONEZ GARCIA","08DPT0003A",null,null,null,null,null,null,0,240,0,null,null,null,null,null,null,0,240,0,30303]
[null,"CHIHUAHUA","QUYD920620SG7","QUYD920620MCHXXN07","DANIA ANGELICA QUIÑONEZ YAÑEZ","08DPT0003A",null,null,null,null,null,null,0,240,0,null,null,null,null,null,null,0,240,0,26259]
[null,"CHIHUAHUA","RACG650805Q12","RACG650805HSRMNM07","GAMALIEL RAMOS CONTRERAS","08DPT0003A",null,null,null,null,null,null,0,216,0,null,null,null,null,null,null,0,216,0,27272.7]
[null,"CHIHUAHUA","RACA620817IU7","RACA620817HCHSHN09","ANTONIO RASCON CHAVEZ","08DPT0003A",null,null,null,null,null,null,0,240,0,null,null,null,null,null,null,0,240,0,23364]
[null,"CHIHUAHUA","RERH8005305SA","RERH800530HCHNDC03","HECTOR RAUL RENTERIA RODRIGUEZ","08DPT0003A",null,null,null,null,null,null,0,216,0,null,null,null,null,null,null,0,216,0,23633.1]
[null,"CHIHUAHUA","RIPS680731I67","RIPS680731HCHCRR07","SERGIO RICO PEREZ","08DPT0003A",null,null,null,null,null,null,0,240,0,null,null,null,null,null,null,0,240,0,23364]
[null,"CHIHUAHUA","RIAJ830525SU3","RIAJ830525HCHVCM08","JAIME MICHAEL RIVERA ACOSTA","08DPT0003A",null,null,null,null,null,null,0,228,0,null,null,null,null,null,null,0,228,0,28787.88]
[null,"CHIHUAHUA","ROSL891018R33","ROSL891018HCHDNS03","LUIS ISIDRO RODRIGUEZ SAENZ","08DPT0003A",null,null,null,null,null,null,0,204,0,null,null,null,null,null,null,0,204,0,25757.58]
[null,"CHIHUAHUA","ROSL8112066G9","ROSL811206HCHDFS05","LUIS CARLOS RODRIGUEZ SIFUENTES","08DPT0003A",null,null,null,null,null,null,0,240,0,null,null,null,null,null,null,0,240,0,30303]
[null,"CHIHUAHUA","ROMC790529SQ8","ROMC790529HCHJZR03","CARLOS GERMAN ROJAS MEZA","08DPT0003A",null,null,null,null,null,null,0,240,0,null,null,null,null,null,null,0,240,0,30303]
[null,"CHIHUAHUA","ROMJ820824341","ROMJ820824HCHMRN09","JUAN PABLO ROMO MARTINEZ","08DPT0003A",null,null,null,null,null,null,0,120,0,null,null,null,null,null,null,0,120,0,15151.5]
[null,"CHIHUAHUA","ROQM800726NK3","ROQM800726MCHNXR09","MARISA JUDITH RONQUILLO QUIÑONEZ","08DPT0003A",null,null,null,null,null,null,0,180,0,null,null,null,null,null,null,0,180,0,19694.28]
[null,"CHIHUAHUA","SARJ830528CW0","SARJ830528HCHLDR12","JORGE ARTURO SALAS RODRIGUEZ","08DPT0003A",null,null,null,null,null,null,0,216,0,null,null,null,null,null,null,0,216,0,23633.1]
[null,"CHIHUAHUA","SADC810906EH7","SADC810906MCHNZR07","MARIA CRISTINA SANCHEZ DIAZ","08DPT0003A",null,null,null,null,null,null,0,240,0,null,null,null,null,null,null,0,240,0,26259]
[null,"CHIHUAHUA","SERM730609876","SERM730609MCHPYY01","MYRIAM SEPULVEDA REYES","08DPT0003A",null,null,null,null,null,null,0,216,0,null,null,null,null,null,null,0,216,0,27272.7]
[null,"CHIHUAHUA","TEAR760610A38","TEAR760610HCHRGL01","RAUL FELIPE TERRAZAS AGUIRRE","08DPT0003A",null,null,null,null,null,null,0,120,0,null,null,null,null,null,null,0,120,0,15151.5]
[null,"CHIHUAHUA","TOBT8310246R6","TOBT831024MCHRRH05","THELMA GUADALUPE TORRES BARRETO","08DPT0003A",null,null,null,null,null,null,0,240,0,null,null,null,null,null,null,0,240,0,31113]
[null,"CHIHUAHUA","UUAJ8910286B1","UUAJ891028HCHRRL00","JOEL URTUZUASTEGUI ARZOLA","08DPT0003A",null,null,null,null,null,null,0,240,0,null,null,null,null,null,null,0,240,0,30303]
[null,"CHIHUAHUA","VASM721005K88","VASM721005HCHLRR06","MARIO ALBERTO VALDEZ SIERRA","08DPT0003A",null,null,null,null,null,null,0,108,0,null,null,null,null,null,null,0,108,0,13636.38]
[null,"CHIHUAHUA","VATE6505053PA","VATE650505HCHLRR02","ERNESTO VALLEJO TERRAZAS","08DPT0003A",null,null,null,null,null,null,0,204,0,null,null,null,null,null,null,0,204,0,25757.58]
[null,"CHIHUAHUA","VAGS580921NS3","VAGS580921MCHZRL04","SOLEDAD VAZQUEZ GARCIA","08DPT0003A",null,null,null,null,null,null,0,228,0,null,null,null,null,null,null,0,228,0,28787.88]
[null,"CHIHUAHUA","VASI870422IA8","VASI870422MCHZVS04","ISIS KRYSTAL VAZQUEZ SAENZ","08DPT0003A",null,null,null,null,null,null,0,228,0,null,null,null,null,null,null,0,228,0,28787.88]
[null,"CHIHUAHUA","VEMA770621BW5","VEMA770621MCHLRN02","ANA ISABEL VELAZQUEZ MARTINEZ","08DPT0003A",null,null,null,null,null,null,0,228,0,null,null,null,null,null,null,0,228,0,28787.88]
[null,"CHIHUAHUA","VEDA870119GY2","VEDA870119MDGRMD03","ADRIANA VERGARA DOMINGUEZ","08DPT0003A",null,null,null,null,null,null,0,180,0,null,null,null,null,null,null,0,180,0,22727.279999999999]
[null,"CHIHUAHUA","VILJ810613D4A","VILJ810613HCHLRR06","JORGE ANTONIO VILLAR LOERA","08DPT0003A",null,null,null,null,null,null,0,240,0,null,null,null,null,null,null,0,240,0,26259]
[null,"CHIHUAHUA","VIGR710609UT2","VIGR710609HCHLRF00","RAFAEL VILLEGAS GARCIA","08DPT0003A",null,null,null,null,null,null,0,240,0,null,null,null,null,null,null,0,240,0,30303]
[null,"CHIHUAHUA","AUAC800520NRA","AUAC800520HDGGNS04","CESAR ALEJANDRO AGUILAR ANTUNEZ","08DPT0007X",null,null,null,1,0,0,null,null,null,null,null,null,null,null,null,1,0,0,54972]
[null,"CHIHUAHUA","AARJ7003036F2","AARJ700303MCHNMS07","MARIA DE JESUS ANAYA RAMIREZ","08DPT0007X",null,null,null,1,0,0,null,null,null,null,null,null,null,null,null,1,0,0,91240.18]
[null,"CHIHUAHUA","AIEL6711121J4","AIXE671112MCHRXL03","MARIA ELIZABETH ARRIETA","08DPT0007X",null,null,null,1,0,0,null,null,null,null,null,null,null,null,null,1,0,0,35992.339999999997]
[null,"CHIHUAHUA","BELH630930M26","BELH630930HCHNNM06","JOSE HUMBERTO BENITEZ LONGORIA","08DPT0007X",null,null,null,1,0,0,null,null,null,null,null,null,null,null,null,1,0,0,57314.19]
[null,"CHIHUAHUA","CADE710915BB6","CADE710915MCHRZL02","ELVIRA CARRASCO DIAZ","08DPT0007X",null,null,null,null,null,null,null,null,null,null,null,null,1,0,0,1,0,0,100611.18]
[null,"CHIHUAHUA","CACI7205151S9","CACI720515HOCHRS01","ISIDRO MANUEL CHAVEZ CARRERA","08DPT0007X",null,null,null,1,0,0,null,null,null,null,null,null,null,null,null,1,0,0,87339.82]
[null,"CHIHUAHUA","DEML700812U65","DEML700812MDGLRR03","LAURA DIANA DELGADO MARRERO","08DPT0007X",null,null,null,1,0,0,null,null,null,null,null,null,null,null,null,1,0,0,55182.57]
[null,"CHIHUAHUA","EALJ731221FM3","EALJ731221HSLSRN06","JUAN DE DIOS ESCALANTE LAUREAN","08DPT0007X",null,null,null,1,0,0,null,null,null,null,null,null,null,null,null,1,0,0,45044.18]
[null,"CHIHUAHUA","GAEM680908Q97","GAEC680908MCLLSN03","MA CONCEPCION GALLARDO ESPARZA","08DPT0007X",null,null,null,1,0,0,null,null,null,null,null,null,null,null,null,1,0,0,42391.24]
[null,"CHIHUAHUA","GADA760726L20","GADA760726MCHRZD02","ADRIANA GARCIA DIAZ","08DPT0007X",null,null,null,1,0,0,null,null,null,null,null,null,null,null,null,1,0,0,53889.21]
[null,"CHIHUAHUA","HEGJ620729F26","HEGJ620729HCHRNV07","JOSE JAVIER HERNANDEZ GONZALEZ","08DPT0007X",null,null,null,1,0,0,null,null,null,null,null,null,null,null,null,1,0,0,87992.84]
[null,"CHIHUAHUA","HEGL611117FN5","HEGL611117MCHRNZ00","LUZ MARIA HERNANDEZ GONZALEZ","08DPT0007X",null,null,null,1,0,0,null,null,null,null,null,null,null,null,null,1,0,0,106398.27]
[null,"CHIHUAHUA","HEPH660312FI8","HEPH660312HCHRRC02","HECTOR HERNANDEZ PEREZ","08DPT0007X",null,null,null,1,0,0,null,null,null,null,null,null,null,null,null,1,0,0,63252.93]
[null,"CHIHUAHUA","LIMR6608162E8","LIMR660816HZSRNY01","RAYMUNDO LIRA MENDOZA","08DPT0007X",null,null,null,1,0,0,null,null,null,null,null,null,null,null,null,1,0,0,141869.51]
[null,"CHIHUAHUA","MASF580311IY9","MASF580311HDGGCR04","FRANCISCO MAGDALENO SAUCEDO","08DPT0007X",null,null,null,1,0,0,null,null,null,null,null,null,null,null,null,1,0,0,89733.24]
[null,"CHIHUAHUA","MARL701010AR4","MARL701010MCLRBD02","LUDIVINA MARTINEZ REBOLLOSO","08DPT0007X",null,null,null,1,0,0,null,null,null,null,null,null,null,null,null,1,0,0,60847.93]
[null,"CHIHUAHUA","MECL790627CP7","MEXC790627MCHJXL02","CLAUDIA FABIOLA MEJIA","08DPT0007X",null,null,null,1,0,0,null,null,null,null,null,null,null,null,null,1,0,0,51949.2]
[null,"CHIHUAHUA","MONL710121CT7","MONL710121MSLGVR08","LORENA INES MOGUEL NOVELO","08DPT0007X",null,null,null,1,0,0,null,null,null,null,null,null,null,null,null,1,0,0,103335.16]
[null,"CHIHUAHUA","MONM720514D8A","MONM720514HCHRXR04","MARCIAL EZEQUIEL MORALES NUÑEZ","08DPT0007X",null,null,null,1,0,0,null,null,null,null,null,null,null,null,null,1,0,0,125276.72]
[null,"CHIHUAHUA","OIPL750706829","OIPL750706HNTRXS09","LUIS ALBERTO ORTIZ PEÑA","08DPT0007X",null,null,null,1,0,0,null,null,null,null,null,null,null,null,null,1,0,0,81527.360000000001]
[null,"CHIHUAHUA","PECG710113QA8","PECG710113MCHRRB06","GABRIELA PEREZ CRUZ","08DPT0007X",null,null,null,1,0,0,null,null,null,null,null,null,null,null,null,1,0,0,49711.19]
[null,"CHIHUAHUA","ROCS700130LMA","ROCS700130MDGDLL00","SILVIA ESTELA RODRIGUEZ CALVILLO","08DPT0007X",null,null,null,1,0,0,null,null,null,null,null,null,null,null,null,1,0,0,88864.57]
[null,"CHIHUAHUA","ROMA711015CL1","ROMA711015MDFDLN06","ANA LUISA RODRIGUEZ MILAN","08DPT0007X",null,null,null,1,0,0,null,null,null,null,null,null,null,null,null,1,0,0,54699.21]
[null,"CHIHUAHUA","ROME6706013EA","ROME670601MDFJLD04","MARIA EDITH ROJAS MELENDEZ","08DPT0007X",null,null,null,1,0,0,null,null,null,null,null,null,null,null,null,1,0,0,54535.89]
[null,"CHIHUAHUA","SOGC711207N65","SOGC711207MCHTRN06","MARIA CONCEPCION SOTO GUERRERO","08DPT0007X",null,null,null,1,0,0,null,null,null,null,null,null,null,null,null,1,0,0,132651.32]
[null,"CHIHUAHUA","SOHJ7805045P4","SOHJ780504HCHTRS02","JOSE DE JESUS SOTO HERNANDEZ","08DPT0007X",null,null,null,1,0,0,null,null,null,null,null,null,null,null,null,1,0,0,51202.05]
[null,"CHIHUAHUA","ZAVE920703L47","ZAVE920703HCHVLD09","EDGAR ALEJANDRO ZAVALA VALLES","08DPT0007X",null,null,null,1,0,0,null,null,null,null,null,null,null,null,null,1,0,0,34968.699999999997]
[null,"CHIHUAHUA","AAVJ670109VEA","AAVJ670109HVZBLL08","JULIAN MIGUEL ABSALON VILLEGAS ","08DPT0007X",null,null,null,null,null,null,0,240,0,null,null,null,null,null,null,0,240,0,28194]
[null,"CHIHUAHUA","AOLJ680721RSA","AOLJ680721MCHCJL09","JULIA ROSA ACOSTA LUJAN ","08DPT0007X",null,null,null,null,null,null,0,228,0,null,null,null,null,null,null,0,228,0,34827]
[null,"CHIHUAHUA","AEMV850720NG8","AEMV850720MCHLNR03","VIRIDIANA ALMEIDA MONTES ","08DPT0007X",null,null,null,null,null,null,0,204,0,null,null,null,null,null,null,0,204,0,31161]
[null,"CHIHUAHUA","AAGP8807274Z4","AAGP880727MMCLLB04","PABLOVA ALVARADO GALICIA ","08DPT0007X",null,null,null,null,null,null,0,216,0,null,null,null,null,null,null,0,216,0,32994]
[null,"CHIHUAHUA","AASJ7104236Z2","AASJ710423HCHLNR06","JORGE ADRIAN ALVARADO SANCHEZ ","08DPT0007X",null,null,null,null,null,null,0,240,0,null,null,null,null,null,null,0,240,0,36660]
[null,"CHIHUAHUA","AATG900815VD7","AATG900815MCHLRL09","GLORIA YARALDY ALVARADO TARANGO ","08DPT0007X",null,null,null,null,null,null,0,204,0,null,null,null,null,null,null,0,204,0,31161]
[null,"CHIHUAHUA","AARP801213GG6","AARP801213HCHVDD14","PEDRO ALONSO AVALOS RODARTE ","08DPT0007X",null,null,null,null,null,null,0,240,0,null,null,null,null,null,null,0,240,0,36660]
[null,"CHIHUAHUA","BACJ730108BV7","BACJ730108MDFYRH00","JAHEL BAYARDO CARVAJAL ","08DPT0007X",null,null,null,null,null,null,0,204,0,null,null,null,null,null,null,0,204,0,31161]
[null,"CHIHUAHUA","BECI670819Q93","BECI670819HCHLRV03","IVAN BELMONTE CARRILLO ","08DPT0007X",null,null,null,null,null,null,0,228,0,null,null,null,null,null,null,0,228,0,34827]
[null,"CHIHUAHUA","BEMY780623E38","BEMY780623MCHRRS01","YESICA BERUMEN MARTINEZ ","08DPT0007X",null,null,null,null,null,null,0,180,0,null,null,null,null,null,null,0,180,0,27495]
[null,"CHIHUAHUA","BUEL761105V38","BUEL761105MCHSSR05","LAURA ISELA BUSTAMANTE ESCOBEDO","08DPT0007X",null,null,null,null,null,null,0,216,0,null,null,null,null,null,null,0,216,0,32994]
[null,"CHIHUAHUA","CAVM69042817A","CAVM690428HCHBGR00","MARIO ALBERTO CABALLERO VEGA ","08DPT0007X",null,null,null,null,null,null,0,228,0,null,null,null,null,null,null,0,228,0,30269.849999999995]
[null,"CHIHUAHUA","CAVM6006195R6","CAVM600619HCHLLN01","MANUEL ALBERTO CALLEROS VILLALOBOS ","08DPT0007X",null,null,null,null,null,null,0,240,0,null,null,null,null,null,null,0,240,0,31863]
[null,"CHIHUAHUA","CIGJ801220RP4","CIGJ801220HCHSRL09","JULIO ALBERTO CISNEROS GARCIA ","08DPT0007X",null,null,null,null,null,null,0,240,0,null,null,null,null,null,null,0,240,0,36660]
[null,"CHIHUAHUA","DIAA860226874","DIAA860226MSRZGN04","ANA FABOLA DIAZ AGUILAR ","08DPT0007X",null,null,null,null,null,null,0,144,0,null,null,null,null,null,null,0,144,0,21996]
[null,"CHIHUAHUA","DOBG610203LR2","DOBG610203HCHMRL02","GILBERTO DOMINGUEZ BARAY ","08DPT0007X",null,null,null,null,null,null,0,240,0,null,null,null,null,null,null,0,240,0,36660]
[null,"CHIHUAHUA","DOEJ630916HP1","DOEJ630916HCLRSN05","JUAN JESUS DORADO ESPINO ","08DPT0007X",null,null,null,null,null,null,0,216,0,null,null,null,null,null,null,0,216,0,21145.5]
[null,"CHIHUAHUA","EADJ860902I17","EADJ860902HCHSZV01","JAVIER EDUARDO ESPARZA DIAZ ","08DPT0007X",null,null,null,null,null,null,0,216,0,null,null,null,null,null,null,0,216,0,32994]
[null,"CHIHUAHUA","EACL8412183L3","EACL841218MCHSRR08","LAURA VERONICA ESTRADA CARRILLO ","08DPT0007X",null,null,null,null,null,null,0,228,0,null,null,null,null,null,null,0,228,0,34827]
[null,"CHIHUAHUA","EAHJ881022RT6","EAHJ881022HCHSRQ05","JOAQUIN JOEL ESTRADA HERNANDEZ ","08DPT0007X",null,null,null,null,null,null,0,240,0,null,null,null,null,null,null,0,240,0,36660]
[null,"CHIHUAHUA","EASA951019EL5","EASA951019HCHSLN00","JOSE ANGEL ESTRADA SALAYANDIA ","08DPT0007X",null,null,null,null,null,null,0,240,0,null,null,null,null,null,null,0,240,0,28194]
[null,"CHIHUAHUA","FOCG620409LQ0","FOCG620409HDGLHN03","GONZALO FLORES CHACON ","08DPT0007X",null,null,null,null,null,null,0,240,0,null,null,null,null,null,null,0,240,0,36660]
[null,"CHIHUAHUA","GAEH711103S52","GAEH711103HCHBNC07","HECTOR GERARDO GABALDON ENRÍQUEZ                   ","08DPT0007X",null,null,null,null,null,null,0,156,0,null,null,null,null,null,null,0,156,0,23829]
[null,"CHIHUAHUA","GAJE670908MV9","GAJE670908HDGLRV06","EVARISTO GALVAN JUAREZ ","08DPT0007X",null,null,null,null,null,null,0,240,0,null,null,null,null,null,null,0,240,0,31863]
[null,"CHIHUAHUA","GAMY7604228L5","GAMY760422MDGLXL00","YOLANDA ALEJANDRA GALVAN MUÑOZ","08DPT0007X",null,null,null,null,null,null,0,144,0,null,null,null,null,null,null,0,144,0,21996]
[null,"CHIHUAHUA","GAOR861127BG3","GAOR861127MCHMNQ19","RAQUEL GAMBOA ONTIVEROS ","08DPT0007X",null,null,null,null,null,null,0,240,0,null,null,null,null,null,null,0,240,0,36660]
[null,"CHIHUAHUA","GAAN631226D5A","GAAN631226MCHNNR03","NORMA GANDARA ANGUIANO","08DPT0007X",null,null,null,null,null,null,0,168,0,null,null,null,null,null,null,0,168,0,25662]
[null,"CHIHUAHUA","GARA6105276N5","GARA610527HCHRZL00","JOSE ALFONSO GARAY RUIZ ","08DPT0007X",null,null,null,null,null,null,0,240,0,null,null,null,null,null,null,0,240,0,36660]
[null,"CHIHUAHUA","GAMB810605AT7","GAMB810605HDGRCR04","BERNARDO ANTONIO GARCIA MACIAS ","08DPT0007X",null,null,null,null,null,null,0,192,0,null,null,null,null,null,null,0,192,0,18796]
[null,"CHIHUAHUA","GOTD6910121D1","GOTD691012MCHMVY06","DEYANIRA GOMEZ TAVARES ","08DPT0007X",null,null,null,null,null,null,0,120,0,null,null,null,null,null,null,0,120,0,18330]
[null,"CHIHUAHUA","GOGG8703244X4","GOGG870324MCHNNB07","GABRIELA ALEJANDRA GONZALEZ GANDARA ","08DPT0007X",null,null,null,null,null,null,0,204,0,null,null,null,null,null,null,0,204,0,17783.7]
[null,"CHIHUAHUA","GONM640214JC7","GONM640214HJCNVG03","MIGUEL GONZÁLEZ NAVA","08DPT0007X",null,null,null,null,null,null,0,240,0,null,null,null,null,null,null,0,240,0,28194]
[null,"CHIHUAHUA","GUCH710602IC3","GUCH710602HCHTSC09","HECTOR GUTIERREZ CISNEROS ","08DPT0007X",null,null,null,null,null,null,0,204,0,null,null,null,null,null,null,0,204,0,19970.75]
[null,"CHIHUAHUA","HEPR900403KQ2","HEPR900403HCHRRC03","RICARDO HERNANDEZ PEREZ ","08DPT0007X",null,null,null,null,null,null,0,120,0,null,null,null,null,null,null,0,120,0,18330]
[null,"CHIHUAHUA","HEMA6604046K4","HEMA660404HCHRXN05","JOSE ANGEL HERRERA MUÑOZ ","08DPT0007X",null,null,null,null,null,null,0,240,0,null,null,null,null,null,null,0,240,0,36660]
[null,"CHIHUAHUA","HEOS840726F25","HEOS840726HCHRGR06","SERGIO ARTURO HERRERA OGAZ ","08DPT0007X",null,null,null,null,null,null,0,120,0,null,null,null,null,null,null,0,120,0,18330]
[null,"CHIHUAHUA","HOAG621120KT8","HOAG621120MCHLVB08","GABRIELA ALEJANDRA HOLGUIN AVILA ","08DPT0007X",null,null,null,null,null,null,0,216,0,null,null,null,null,null,null,0,216,0,28676.7]
[null,"CHIHUAHUA","HUJD820323M58","HUJD820323HMCRMN01","DANIEL HUERTA JIMENEZ ","08DPT0007X",null,null,null,null,null,null,0,228,0,null,null,null,null,null,null,0,228,0,19875.900000000001]
[null,"CHIHUAHUA","LOHA840518CS8","LOHA840518HCHPRL07","ALBERTO LOPEZ HERNANDEZ ","08DPT0007X",null,null,null,null,null,null,0,204,0,null,null,null,null,null,null,0,204,0,31161]
[null,"CHIHUAHUA","MAVA850717159","MAVA850717MCHCLL06","ALEJANDRA MACÍAS VELAZQUEZ ","08DPT0007X",null,null,null,null,null,null,0,240,0,null,null,null,null,null,null,0,240,0,36660]
[null,"CHIHUAHUA","MAER720708DH1","MAXE720708MCHNXR00","ERIKA SELENE MANCHA ","08DPT0007X",null,null,null,null,null,null,0,192,0,null,null,null,null,null,null,0,192,0,29328]
[null,"CHIHUAHUA","MAOD8107099T0","MAOD810709HCHRLN01","DANIEL ANTONIO MARQUEZ OLIVAS ","08DPT0007X",null,null,null,null,null,null,0,240,0,null,null,null,null,null,null,0,240,0,31863]
[null,"CHIHUAHUA","MARS830130RA7","MARS830130HCHRVR05","SERGIO ALONSO MARTINEZ RIVERA ","08DPT0007X",null,null,null,null,null,null,0,120,0,null,null,null,null,null,null,0,120,0,18330]
[null,"CHIHUAHUA","MALA850527KR1","MALA850527HTLTCN04","ANDRES ISAAC MATUS LECOURTOIS ","08DPT0007X",null,null,null,null,null,null,0,180,0,null,null,null,null,null,null,0,180,0,21145.5]
[null,"CHIHUAHUA","MEAP8301055K0","MEAP830105MSLDRT07","PATRICIA DEL ROCIO MEDINA ARMENTA ","08DPT0007X",null,null,null,null,null,null,0,204,0,null,null,null,null,null,null,0,204,0,19970.75]
[null,"CHIHUAHUA","MESO501218RY9","MESO501218HJCNLS04","OSCAR IGNACIO MENDOZA SALAS ","08DPT0007X",null,null,null,null,null,null,0,144,0,null,null,null,null,null,null,0,144,0,21996]
[null,"CHIHUAHUA","MESB8507159W0","MESB850715HCHNRN00","BENJAMIN ALEJANDRO MENDOZA SORIANO","08DPT0007X",null,null,null,null,null,null,0,240,0,null,null,null,null,null,null,0,240,0,36660]
[null,"CHIHUAHUA","MOHF7603319E7","MOHF760331HDFCRR01","FERNANDO MOCTEZUMA HERNANDEZ ","08DPT0007X",null,null,null,null,null,null,0,168,0,null,null,null,null,null,null,0,168,0,16446.5]
[null,"CHIHUAHUA","MOAJ681102IQ0","MOAJ681102HCHNGS07","JESUS GERARDO MONTES AGUILAR","08DPT0007X",null,null,null,null,null,null,0,228,0,null,null,null,null,null,null,0,228,0,26784.3]
[null,"CHIHUAHUA","MOMM791027B8A","MOMM791027MCHRRY08","MAYRA MARGARITA MORALES MORENO ","08DPT0007X",null,null,null,null,null,null,0,216,0,null,null,null,null,null,null,0,216,0,32994]
[null,"CHIHUAHUA","OEPH7911267A5","OEPH791126HCHRNC09","HECTOR RICARDO ORNELAS DEL PINO ","08DPT0007X",null,null,null,null,null,null,0,180,0,null,null,null,null,null,null,0,180,0,27495]
[null,"CHIHUAHUA","OOMB8207037W4","OOMB820703HCHRLN09","BLAS OROZCO MONTES ","08DPT0007X",null,null,null,null,null,null,0,180,0,null,null,null,null,null,null,0,180,0,17621.25]
[null,"CHIHUAHUA","OIGV851019169","OIGV851019HTSRRC00","VICTOR HUGO ORTIZ GARCIA ","08DPT0007X",null,null,null,null,null,null,0,240,0,null,null,null,null,null,null,0,240,0,23495]
[null,"CHIHUAHUA","OIGC960301QQA","OIGC960301HCHRNR04","CARLOS ANDRES ORTIZ GONZALEZ ","08DPT0007X",null,null,null,null,null,null,0,108,0,null,null,null,null,null,null,0,108,0,7845.7499999999991]
[null,"CHIHUAHUA","OIGA8509273I1","OIGA850927HCHRTL04","JOSE ALBERTO ORTIZ GUTIERREZ ","08DPT0007X",null,null,null,null,null,null,0,132,0,null,null,null,null,null,null,0,132,0,20163]
[null,"CHIHUAHUA","PEME750130UP9","PEME750130HCHRRR00","ERICK DAVID PEREZ MARTINEZ ","08DPT0007X",null,null,null,null,null,null,0,216,0,null,null,null,null,null,null,0,216,0,28676.7]
[null,"CHIHUAHUA","PERL8208024K1","PERL820802MCHRMR03","LAURA ANGELICA PEREZ RAMOS ","08DPT0007X",null,null,null,null,null,null,0,216,0,null,null,null,null,null,null,0,216,0,32994]
[null,"CHIHUAHUA","PESD840502CP3","PESD840502HCHRCG00","DIEGO ALEJANDRO PEREZ SAUCEDO ","08DPT0007X",null,null,null,null,null,null,0,180,0,null,null,null,null,null,null,0,180,0,21145.5]
[null,"CHIHUAHUA","POMJ860826TB2","POMJ860826HCHRDN05","JUAN CARLOS PORRAS MEDINA ","08DPT0007X",null,null,null,null,null,null,0,228,0,null,null,null,null,null,null,0,228,0,34827]
[null,"CHIHUAHUA","RIBG810102KB8","RIBG810102MCHVRR02","GRACIELA RIVAS BARRAGAN ","08DPT0007X",null,null,null,null,null,null,0,216,0,null,null,null,null,null,null,0,216,0,32994]
[null,"CHIHUAHUA","ROMP8008014S4","ROMP800801MCSBZT07","PATRICIA ROBLERO MAZARIEGOS ","08DPT0007X",null,null,null,null,null,null,0,144,0,null,null,null,null,null,null,0,144,0,21996]
[null,"CHIHUAHUA","ROCG680807P47","ROCG680807MCLLSR09","GRISELDA ROLDAN CASTILLO ","08DPT0007X",null,null,null,null,null,null,0,204,0,null,null,null,null,null,null,0,204,0,31161]
[null,"CHIHUAHUA","RUGA7605108F9","RUGA760510MCHVTN01","MARIA ANTONIETA RUVALCABA GUTIERREZ","08DPT0007X",null,null,null,null,null,null,0,96,0,null,null,null,null,null,null,0,96,0,12745.2]
[null,"CHIHUAHUA","SAMR880304CG8","SAMR880304HCHLXF03","RAFAEL SALAS MUÑOZ ","08DPT0007X",null,null,null,null,null,null,0,240,0,null,null,null,null,null,null,0,240,0,31863]
[null,"CHIHUAHUA","SAFA580219G58","SAFA580219HVZMLL08","ALVARO SAMARIO FLORES ","08DPT0007X",null,null,null,null,null,null,0,240,0,null,null,null,null,null,null,0,240,0,36660]
[null,"CHIHUAHUA","SAOA880909JJ6","SAOA880909HOCMSL00","ALVARO OSCAR SAMARIO OSORIO","08DPT0007X",null,null,null,null,null,null,0,240,0,null,null,null,null,null,null,0,240,0,28194]
[null,"CHIHUAHUA","SAON851028RE1","SAON851028MVZMSL07","NALLELY SAMARIO OSORIO ","08DPT0007X",null,null,null,null,null,null,0,96,0,null,null,null,null,null,null,0,96,0,11277.6]
[null,"CHIHUAHUA","SAEO910403QK8","SAEO910403HNLNSS08","OSCAR IVAN SANCHEZ ESTRADA ","08DPT0007X",null,null,null,null,null,null,0,192,0,null,null,null,null,null,null,0,192,0,22555.200000000001]
[null,"CHIHUAHUA","SEEI760505188","SEEI760505MCHRSL09","ILSE SERRATOS ESPARZA ","08DPT0007X",null,null,null,null,null,null,0,204,0,null,null,null,null,null,null,0,204,0,31161]
[null,"CHIHUAHUA","TAVY911105KV5","TAVY911105MCHGNS05","YASSMIN TAGLE VENZOR ","08DPT0007X",null,null,null,null,null,null,0,240,0,null,null,null,null,null,null,0,240,0,36660]
[null,"CHIHUAHUA","TENA800305KZ2","TENA800305HCHJVN00","ANGEL ADRIAN TEJADA NEVAREZ ","08DPT0007X",null,null,null,null,null,null,0,240,0,null,null,null,null,null,null,0,240,0,36660]
[null,"CHIHUAHUA","TORE8012234Y9","TORE801223HNTPYD08","EDGAR TOPETE REYES ","08DPT0007X",null,null,null,null,null,null,0,216,0,null,null,null,null,null,null,0,216,0,32994]
[null,"CHIHUAHUA","TOCJ650407CT0","TOCJ650407HVZRNS07","JOSE TORRES CANTERO ","08DPT0007X",null,null,null,null,null,null,0,240,0,null,null,null,null,null,null,0,240,0,36660]
[null,"CHIHUAHUA","TORN791114PY6","TORN791114MCHRYD07","NADIA MARIA TORRES REY ","08DPT0007X",null,null,null,null,null,null,0,216,0,null,null,null,null,null,null,0,216,0,32994]
[null,"CHIHUAHUA","UUAR860131EV3","UUAR860131HCHRRF06","RAFAEL URTUZUASTEGUI ARZOLA ","08DPT0007X",null,null,null,null,null,null,0,240,0,null,null,null,null,null,null,0,240,0,36660]
[null,"CHIHUAHUA","VAAF840608FK3","VAAF840608HCHZCR03","FERNANDO VAZQUEZ ACEVEDO ","08DPT0007X",null,null,null,null,null,null,0,240,0,null,null,null,null,null,null,0,240,0,31863]
[null,"CHIHUAHUA","VIAS640217RZ1","VIAS640217HCHLGL08","SAUL VILLALOBOS AGUIRRE ","08DPT0007X",null,null,null,null,null,null,0,228,0,null,null,null,null,null,null,0,228,0,30269.849999999995]
[null,"CHIHUAHUA","VIGR720403880","VIGR720403HVZLBC14","RICARDO VILLARAUZ GABINO ","08DPT0007X",null,null,null,null,null,null,0,228,0,null,null,null,null,null,null,0,228,0,34827]
[null,"CHIHUAHUA","AUED570608MR1","AUED570608HZSGSN08","DANIEL AGUILAR ESPARZA","08DPT0008W",null,null,null,1,0,0,null,null,null,null,null,null,null,null,null,1,0,0,53661.899999999994]
[null,"CHIHUAHUA","BESJ800501RQ3","BESJ800501HCLRLL06","JULIO CESAR BERNAL SALAS","08DPT0008W",null,null,null,1,0,0,null,null,null,null,null,null,null,null,null,1,0,0,83706.86]
[null,"CHIHUAHUA","EOCA6608284C4","EOCA660828HCHSRG02","AGUSTIN ESCOBAR CERVANTES","08DPT0008W",null,null,null,1,0,0,null,null,null,null,null,null,null,null,null,1,0,0,36589.25]
[null,"CHIHUAHUA","GORL940810U53","GORL940810MCHMDR00","LARISSA GOMEZ RODRIGUEZ ","08DPT0008W",null,null,null,1,0,0,null,null,null,null,null,null,null,null,null,1,0,0,22755.119999999999]
[null,"CHIHUAHUA","HEGA690525I40","HEGA690525MCHRRL02","ALICIA HERNANDEZ GARCIA","08DPT0008W",null,null,null,1,0,0,null,null,null,null,null,null,null,null,null,1,0,0,48671.76]
[null,"CHIHUAHUA","MALM890515EN0","MALM890515HCHTCR05","MARIO ALBERTO MATA LICON","08DPT0008W",null,null,null,null,null,null,null,null,null,null,null,null,1,0,0,1,0,0,85992.48]
[null,"CHIHUAHUA","MEMF660302UM0","MEMF660302HCHNLD06","FEDERICO MENDOZA MOLINA","08DPT0008W",null,null,null,1,0,0,null,null,null,null,null,null,null,null,null,1,0,0,54910.079999999994]
[null,"CHIHUAHUA","MOAG600916JW6","MOAG600916HCHYCL04","GUILLERMO MOY ACOSTA","08DPT0008W",null,null,null,1,0,0,null,null,null,null,null,null,null,null,null,1,0,0,79779.75]
[null,"CHIHUAHUA","OOVM6504302T1","OOVM650430HCHRLS07","MOISES OROZCO VALDEZ","08DPT0008W",null,null,null,1,0,0,null,null,null,null,null,null,null,null,null,1,0,0,54910.079999999994]
[null,"CHIHUAHUA","PANA720117JW4","PANA720117HDGLVN01","ANTONIO PALMA NEVAREZ","08DPT0008W",null,null,null,1,0,0,null,null,null,null,null,null,null,null,null,1,0,0,48534.74]
[null,"CHIHUAHUA","PAHA640330KP3","PAHA640330MCHYLR06","ARMIDA IRENE PAYAN HOLGUIN","08DPT0008W",null,null,null,1,0,0,null,null,null,null,null,null,null,null,null,1,0,0,131759.72999999998]
[null,"CHIHUAHUA","POAJ710301PK6","POAJ710301MCHRLS06","MARIA DE JESUS PORTILLO ALARCON","08DPT0008W",null,null,null,1,0,0,null,null,null,null,null,null,null,null,null,1,0,0,37745.5]
[null,"CHIHUAHUA","RIGR710129FB6","RIGR710129MCHVRQ06","RAQUEL ERENDIDA RIVERA GARCIA","08DPT0008W",null,null,null,1,0,0,null,null,null,null,null,null,null,null,null,1,0,0,130057.84000000001]
[null,"CHIHUAHUA","ROGJ660820EP3","ROGJ660820HCHDNN02","JOSE JUAN RODRIGUEZ GONZALEZ","08DPT0008W",null,null,null,1,0,0,null,null,null,null,null,null,null,null,null,1,0,0,29451.870000000003]
[null,"CHIHUAHUA","SAML750404ND1","SAML750404MCHNXZ07","SAENZ MUNOZ LUZ MARIA","08DPT0008W",null,null,null,1,0,0,null,null,null,null,null,null,null,null,null,1,0,0,33485.17]
[null,"CHIHUAHUA","TAHJ7109304KA","TAHJ710930HCHRLV01","JAVIER EUSEBIO TARANGO HOLGUIN","08DPT0008W",null,null,null,1,0,0,null,null,null,null,null,null,null,null,null,1,0,0,118144.84000000001]
[null,"CHIHUAHUA","VAGJ9208132AA","VAGJ920813HCHLRN08","JONHATAN VALDEZ GARCIA","08DPT0008W",null,null,null,1,0,0,null,null,null,null,null,null,null,null,null,1,0,0,27575.8]
[null,"CHIHUAHUA","VARJ610925H36","VARJ610925HCHLSS00","JESUS ANTONIO VALDEZ ROSALES","08DPT0008W",null,null,null,1,0,0,null,null,null,null,null,null,null,null,null,1,0,0,41625.910000000003]
[null,"CHIHUAHUA","VAMA950227HC9","VAMA950227HCLLNL00","ALDO EUGENIO VALENCIANO MENDEZ ","08DPT0008W",null,null,null,null,null,null,null,null,null,null,null,null,1,0,0,1,0,0,66459.899999999994]
[null,"CHIHUAHUA","VEGR750904UR2","VEGR750904MCHLRS06","ROSALIA MARGARITA VELARDE GARCIA","08DPT0008W",null,null,null,1,0,0,null,null,null,null,null,null,null,null,null,1,0,0,83706.86]
[null,"CHIHUAHUA","VARO691222JA8","VAXR691222MCHLXS07","ROSA MARIA VALENZUELA","08DPT0008W",null,null,null,null,null,null,0,216,0,null,null,null,null,null,null,0,216,0,27272.7]
[null,"CHIHUAHUA","AUMM780328A31","AUMM780328MCHGLN09","MINERVA AGUILAR MOLINAR","08DPT0008W",null,null,null,null,null,null,0,240,0,null,null,null,null,null,null,0,240,0,30303]
[null,"CHIHUAHUA","AEGL800105RF6","AEGL800105MCHLNZ06","LIZETTE JOHANNA ALEJANDRO GONZALEZ","08DPT0008W",null,null,null,null,null,null,0,240,0,null,null,null,null,null,null,0,240,0,30303]
[null,"CHIHUAHUA","AAGJ670423U8A","AAGJ670423HCHMNR05","JORGE AMPARAN GONZALEZ","08DPT0008W",null,null,null,null,null,null,0,240,0,null,null,null,null,null,null,0,240,0,30303]
[null,"CHIHUAHUA","AESS721002N67","AESS721002MCHRTS00","SUSANA ARMENDARIZ SOTO","08DPT0008W",null,null,null,null,null,null,0,240,0,null,null,null,null,null,null,0,240,0,30303]
[null,"CHIHUAHUA","BAVM821203FN0","BAVM821203MCHRLN06","MONICA LOURDES BARRAZA VILLALOBOS","08DPT0008W",null,null,null,null,null,null,0,228,0,null,null,null,null,null,null,0,228,0,28787.879999999997]
[null,"CHIHUAHUA","CAVS820702FV1","CAVS820702MCHRRN01","SANDRA ELIZABETH CARDENAS VARGAS","08DPT0008W",null,null,null,null,null,null,0,216,0,null,null,null,null,null,null,0,216,0,23633.1]
[null,"CHIHUAHUA","ROMJ731201675","CANA840815MCHRVN00","ANA ISABEL CARREON NAVA","08DPT0008W",null,null,null,null,null,null,0,228,0,null,null,null,null,null,null,0,228,0,24946.080000000002]
[null,"CHIHUAHUA","COFA750408JB9","COFA750408MCHRRZ08","AZUCENA CORRAL FRANCO","08DPT0008W",null,null,null,null,null,null,0,228,0,null,null,null,null,null,null,0,228,0,28787.879999999997]
[null,"CHIHUAHUA","DIHL770620B93","DIHL770620MCHZRZ06","LUZ IMELDA DIAZ HERNANDEZ","08DPT0008W",null,null,null,null,null,null,0,216,0,null,null,null,null,null,null,0,216,0,27272.7]
[null,"CHIHUAHUA","DIHO910620AV5","DIHO910620MZSZRS07","OSIRIS DIAZ HERNANDEZ","08DPT0008W",null,null,null,null,null,null,0,144,0,null,null,null,null,null,null,0,144,0,21027.599999999999]
[null,"CHIHUAHUA","GASJ850822GF7","GASJ850822HCHLNS04","JOSE GALVEZ SANTANA","08DPT0008W",null,null,null,null,null,null,0,240,0,null,null,null,null,null,null,0,240,0,30303]
[null,"CHIHUAHUA","GASA8103319V2","GASA810331MCHRRD08","ADRIANA GARDEA SERRANO","08DPT0008W",null,null,null,null,null,null,0,240,0,null,null,null,null,null,null,0,240,0,26259]
[null,"CHIHUAHUA","GULM750313628","GULM750313HCHLNN08","MANUEL ALEJANDRO GULLEN LUNA","08DPT0008W",null,null,null,null,null,null,0,216,0,null,null,null,null,null,null,0,216,0,27272.7]
[null,"CHIHUAHUA","HEAJ8610295N1","HEAJ861029HCHRCN09","JUAN CARLOS HERNANDEZ ACOSTA ","08DPT0008W",null,null,null,null,null,null,0,240,0,null,null,null,null,null,null,0,240,0,30303]
[null,"CHIHUAHUA","HEGE760311918","HEGE760311HCHRTF05","EFRAIN ARTURO HERNANDEZ GUTIERREZ","08DPT0008W",null,null,null,null,null,null,0,216,0,null,null,null,null,null,null,0,216,0,21027.599999999999]
[null,"CHIHUAHUA","MAML7703077T7","MAML770307MCHCRS01","LESSLEY MYRLEE MACIAS MARTINEZ","08DPT0008W",null,null,null,null,null,null,0,216,0,null,null,null,null,null,null,0,216,0,27272.7]
[null,"CHIHUAHUA","MAEJ690219AK2","MAEJ690219HCHRSS06","JESUS MARTINEZ ESPARZA","08DPT0008W",null,null,null,null,null,null,0,240,0,null,null,null,null,null,null,0,240,0,30303]
[null,"CHIHUAHUA","MEMR7702148Q4","MEMR770214HCHLNC02","RICARDO MELENDEZ MENDOZA","08DPT0008W",null,null,null,null,null,null,0,80,0,null,null,null,null,null,null,0,80,0,11682]
[null,"CHIHUAHUA","MECO5508271G3","MECO550827MSLXSL09","MEXIA CASTRO OLGA PATRICIA","08DPT0008W",null,null,null,null,null,null,0,240,0,null,null,null,null,null,null,0,240,0,30303]
[null,"CHIHUAHUA","MOGE730414EA4","MOGE730414HCHRRL09","MORENO GARCIA ELISEO","08DPT0008W",null,null,null,null,null,null,0,216,0,null,null,null,null,null,null,0,216,0,21027.599999999999]
[null,"CHIHUAHUA","MUMP8911284K8","MUMP891128HCHXXS06","PASCUAL ABRAHAM MUÑOZ MUÑOZ","08DPT0008W",null,null,null,null,null,null,0,240,0,null,null,null,null,null,null,0,240,0,26259]
[null,"CHIHUAHUA","NAHJ790815BF0","NAHJ790815HCHVRS00","JESUS MIGUEL NAVARRO HERNANDEZ","08DPT0008W",null,null,null,null,null,null,0,240,0,null,null,null,null,null,null,0,240,0,23364]
[null,"CHIHUAHUA","OIGM890424IC1","OIGM890424MCHLRR06","MARTHA ALEJANDRA OLIVAS GUERRERO","08DPT0008W",null,null,null,null,null,null,0,228,0,null,null,null,null,null,null,0,228,0,28787.879999999997]
[null,"CHIHUAHUA","OINS5902223YA","OINS590222HMNLXL02","OLIVO NUÑEZ JOSE SALVADOR","08DPT0008W",null,null,null,null,null,null,0,240,0,null,null,null,null,null,null,0,240,0,30303]
[null,"CHIHUAHUA","PAFV661205KZ5","PAFV661205HCHTRC01","PATENA FIERRO VICTOR MANUEL","08DPT0008W",null,null,null,null,null,null,0,216,0,null,null,null,null,null,null,0,216,0,27272.7]
[null,"CHIHUAHUA","RATV881128H34","RATV881128HCHMRC05","VICTOR HUGO RAMIREZ","08DPT0008W",null,null,null,null,null,null,0,80,0,null,null,null,null,null,null,0,80,0,11682]
[null,"CHIHUAHUA","RERP770809FK9","RERP770809HCHDDD04","PEDRO OSWALDO REDE RODRIGUEZ","08DPT0008W",null,null,null,null,null,null,0,216,0,null,null,null,null,null,null,0,216,0,27272.7]
[null,"CHIHUAHUA","REVY780409NT1","REVY780409MCHYLZ05","YASMIN LISSET REYES VALLES","08DPT0008W",null,null,null,null,null,null,0,240,0,null,null,null,null,null,null,0,240,0,26259]
[null,"CHIHUAHUA","RIGJ610311956","RIGJ610311HDFVRL08","JOEL RAUL RIVAS GARCIA","08DPT0008W",null,null,null,null,null,null,0,216,0,null,null,null,null,null,null,0,216,0,23633.1]
[null,"CHIHUAHUA","ROGR680108PWA","ROGR680108HCHDRC09","RICARDO RODRIGUEZ GARCIA","08DPT0008W",null,null,null,null,null,null,0,120,0,null,null,null,null,null,null,0,120,0,15151.5]
[null,"CHIHUAHUA","SADR840831726","SADR840831HCHNZM02","RAMON AGUSTO SANCHEZ DIAZ","08DPT0008W",null,null,null,null,null,null,0,120,0,null,null,null,null,null,null,0,120,0,15151.5]
[null,"CHIHUAHUA","SARJ650111CB4","SARJ650111HCHNVM05","JAIME SANCHEZ RIVERA","08DPT0008W",null,null,null,null,null,null,0,120,0,null,null,null,null,null,null,0,120,0,15151.5]
[null,"CHIHUAHUA","TAGR880916H31","TAGR880916MCHLNS09","ROSA CAROLINA TALAMANTES GONZALEZ","08DPT0008W",null,null,null,null,null,null,0,132,0,null,null,null,null,null,null,0,132,0,12850.2]
[null,"CHIHUAHUA","VAVS740521TK5","VAVS740521HCHLLL09","SAUL ARMANDO VALLES VALLE","08DPT0008W",null,null,null,null,null,null,0,180,0,null,null,null,null,null,null,0,180,0,22727.280000000002]
[null,"CHIHUAHUA","VICG5002047Q6","VICG500204HCHTRL01","GILBERTO FELICIANO VITELA CARRASCO","08DPT0008W",null,null,null,null,null,null,0,240,0,null,null,null,null,null,null,0,240,0,10101]
[null,"CHIHUAHUA","CAMC8511068L5","CAMC851106MCHRRR00","CARMEN IVONNE CARMONA MURILLO","08DPT0012I",null,null,null,1,0,0,null,null,null,null,null,null,null,null,null,1,0,0,31150.369999999995]
[null,"CHIHUAHUA","CAJG690110UD1","CAJG690110HCHHRN00","GONZALO CHAVEZ JUAREZ","08DPT0012I",null,null,null,1,0,0,null,null,null,null,null,null,null,null,null,1,0,0,79779.75]
[null,"CHIHUAHUA","COVC830703U30","COVC830703MCHRZY01","CYNTHIA ROSARIO CORONADO VAZQUEZ","08DPT0012I",null,null,null,1,0,0,null,null,null,null,null,null,null,null,null,1,0,0,98758.42]
[null,"CHIHUAHUA","EIRL670407TS6","EIRL670407MCHNDT08","LETICIA ENRIQUEZ RODRIGUEZ","08DPT0012I",null,null,null,1,0,0,null,null,null,null,null,null,null,null,null,1,0,0,135048.34999999998]
[null,"CHIHUAHUA","GACI7107098NA","GACI710709MCHRRM01","IMELDA IVONE GARCIA CARMONA","08DPT0012I",null,null,null,1,0,0,null,null,null,null,null,null,null,null,null,1,0,0,54243.75]
[null,"CHIHUAHUA","GOMB690116428","GOMB690116MCHNRL02","BELIA LORENA GONZALEZ  MORENO","08DPT0012I",null,null,null,1,0,0,null,null,null,null,null,null,null,null,null,1,0,0,49421.909999999989]
[null,"CHIHUAHUA","IAMM880831RY4","IAMM880831MCHZRR03","MAR ELISA IZAGUIRRE MARTINEZ","08DPT0012I",null,null,null,1,0,0,null,null,null,null,null,null,null,null,null,1,0,0,43263.18]
[null,"CHIHUAHUA","LECG700827GY1","LECG700827MCHCHL00","GLORIA A LECHUGA CHAVEZ","08DPT0012I",null,null,null,1,0,0,null,null,null,null,null,null,null,null,null,1,0,0,87272.34]
[null,"CHIHUAHUA","LOLJ670723J90","LOLJ670723HCHPZV05","JAVIER LOPEZ LOZANO","08DPT0012I",null,null,null,1,0,0,null,null,null,null,null,null,null,null,null,1,0,0,31150.369999999995]
[null,"CHIHUAHUA","MAAS821018113","MAAS821018HCHRNG05","SIGIFREDO MARQUEZ ANCHONDO","08DPT0012I",null,null,null,1,0,0,null,null,null,null,null,null,null,null,null,1,0,0,45250.200000000004]
[null,"CHIHUAHUA","MAQS651014TH4","MAQS651014HCHRNL03","SAUL MARQUEZ QUINTANA","08DPT0012I",null,null,null,1,0,0,null,null,null,null,null,null,null,null,null,1,0,0,38464.94]
[null,"CHIHUAHUA","PEDR620906HG6","PEDR620906HCHRMM07","RAMON JAVIER PEREZ DOMINGUEZ","08DPT0012I",null,null,null,1,0,0,null,null,null,null,null,null,null,null,null,1,0,0,84403.62000000001]
[null,"CHIHUAHUA","ROCR700830F58","ROCR700830HCHDNC08","RICARDO ANTELMO RODRIGUEZ CANO","08DPT0012I",null,null,null,1,0,0,null,null,null,null,null,null,null,null,null,1,0,0,41287.83]
[null,"CHIHUAHUA","ROTF760823LY5","ROTF760823MCHDRL03","FLOR GUADALUPE RODRIGUEZ TREJO","08DPT0012I",null,null,null,1,0,0,null,null,null,null,null,null,null,null,null,1,0,0,44793.4]
[null,"CHIHUAHUA","SOMD561124TEA","SOMD561124HCHTDV09","DAVID SOTELO MEDRANO","08DPT0012I",null,null,null,1,0,0,null,null,null,null,null,null,null,null,null,1,0,0,49713.69000000001]
[null,"CHIHUAHUA","TERL781019J60","TERL781019HCHNDS08","LUIS CARLOS TENA RODELAS","08DPT0012I",null,null,null,1,0,0,null,null,null,null,null,null,null,null,null,1,0,0,45661.68]
[null,"CHIHUAHUA","UIST6008045JA","UIST600804HDGRMM07","TOMAS URBINA SIMENTAL","08DPT0012I",null,null,null,1,0,0,null,null,null,null,null,null,null,null,null,1,0,0,53141.8]
[null,"CHIHUAHUA","VAGA800112LSA","VAGA800112HCHLTL07","ALBERTO VALENZUELA GUTIERREZ","08DPT0012I",null,null,null,1,0,0,null,null,null,null,null,null,null,null,null,1,0,0,36921.280000000006]
[null,"CHIHUAHUA","AARP7710257KA","AARP771025MCHLZL02","PALMA LILIANA ALMANZA RUIZ","08DPT0012I",null,null,null,null,null,null,0,168,0,null,null,null,null,null,null,0,168,0,21212.1]
[null,"CHIHUAHUA","AAOG811026Q47","AAOG811026MCHRRB02","GABRIELA MARIA ARAGON ORTIZ","08DPT0012I",null,null,null,null,null,null,0,240,0,null,null,null,null,null,null,0,240,0,30303]
[null,"CHIHUAHUA","AEGL940102TD8","AEGL940102HCHRNS03","LUIS DANIEL ARMENDARIZ GONZALEZ","08DPT0012I",null,null,null,null,null,null,0,192,0,null,null,null,null,null,null,0,192,0,18691.2]
[null,"CHIHUAHUA","BALL820222AW6","BALL820222HCHYNR00","LORENZO ANTONIO BAYLON DE LEON","08DPT0012I",null,null,null,null,null,null,0,192,0,null,null,null,null,null,null,0,192,0,18691.2]
[null,"CHIHUAHUA","CARE8810091J2","CARE881009HCHRMD08","EDGAR ENRIQUE CARREON RAMOS","08DPT0012I",null,null,null,null,null,null,0,228,0,null,null,null,null,null,null,0,228,0,28787.879999999997]
[null,"CHIHUAHUA","CACP850903KT2","CACP850903MCHHHR00","PERLA JAZMIN CHAIREZ CHACON","08DPT0012I",null,null,null,null,null,null,0,216,0,null,null,null,null,null,null,0,216,0,27272.7]
[null,"CHIHUAHUA","CAMN760505UE4","CAMN760505MCHHNN03","NANCY LORENA CHAVEZ MONCADA","08DPT0012I",null,null,null,null,null,null,0,180,0,null,null,null,null,null,null,0,180,0,22727.280000000002]
[null,"CHIHUAHUA","PEMC8412061M5","PEMC841206HCHXRR02","CARLOS DE LA PEÑA MERAZ","08DPT0012I",null,null,null,null,null,null,0,240,0,null,null,null,null,null,null,0,240,0,30303]
[null,"CHIHUAHUA","DOCE610806AJ3","DOCE610806MCHMMS03","ESPERANZA DOMINGUEZ CAMUÑEZ","08DPT0012I",null,null,null,null,null,null,0,216,0,null,null,null,null,null,null,0,216,0,21027.599999999999]
[null,"CHIHUAHUA","DOTW8710023S3","DOTW871002HCHMRL06","WALTER ALEJANDRO DOMINGUEZ TORRES","08DPT0012I",null,null,null,null,null,null,0,192,0,null,null,null,null,null,null,0,192,0,24242.400000000001]
[null,"CHIHUAHUA","DUIA911217JM8","DUIA911217HCHRBR05","ARMANDO ALEXIS DUARTE IBARRA","08DPT0012I",null,null,null,null,null,null,0,240,0,null,null,null,null,null,null,0,240,0,26259]
[null,"CHIHUAHUA","EIRK930402BZ7","EIRK930402MCHNDR04","KARINA LIZETH ENRIQUEZ RODRIGUEZ","08DPT0012I",null,null,null,null,null,null,0,216,0,null,null,null,null,null,null,0,216,0,21027.599999999999]
[null,"CHIHUAHUA","EACL761108IA6","EACL761108HCHSHS08","JOSE LUIS ESTRADA CHAVEZ","08DPT0012I",null,null,null,null,null,null,0,168,0,null,null,null,null,null,null,0,168,0,12024.6]
[null,"CHIHUAHUA","FITM7609208P9","FITM760920MCHGVR05","MARISOL FIGUEROA TOVAR","08DPT0012I",null,null,null,null,null,null,0,216,0,null,null,null,null,null,null,0,216,0,27272.7]
[null,"CHIHUAHUA","GAMC820716BJ4","GAMC820716MCHLRR08","MARIA DEL CARMEN GALLEGOS MARTINEZ","08DPT0012I",null,null,null,null,null,null,0,240,0,null,null,null,null,null,null,0,240,0,30303]
[null,"CHIHUAHUA","GOCS820528T91","GOCS820528MCHNLN05","SANDRA BERENICE GONZALEZ COLMENERO","08DPT0012I",null,null,null,null,null,null,0,240,0,null,null,null,null,null,null,0,240,0,30303]
[null,"CHIHUAHUA","GOGG631226J88","GOGG631226MCHNLL06","GLORIA MARINA GONZALEZ GALLEGOS","08DPT0012I",null,null,null,null,null,null,0,240,0,null,null,null,null,null,null,0,240,0,30303]
[null,"CHIHUAHUA","GOQM960413969","GOQM960413HCHNXR03","MARCO ANTONIO GONZALEZ QUIÑONEZ","08DPT0012I",null,null,null,null,null,null,0,204,0,null,null,null,null,null,null,0,204,0,14601.3]
[null,"CHIHUAHUA","GAMO630830H94","GAMO630830MCHRRL07","OLGA CECILIA GRAJEDA  MIRAMONTES","08DPT0012I",null,null,null,null,null,null,0,120,0,null,null,null,null,null,null,0,120,0,15151.5]
[null,"CHIHUAHUA","HEGP741201TCA","HEGP741201MCHRRT03","PATRICIA OLAYA HERRERA GARCIA","08DPT0012I",null,null,null,null,null,null,0,228,0,null,null,null,null,null,null,0,228,0,28787.879999999997]
[null,"CHIHUAHUA","IAPJ9005168T2","IAPJ900516MCHBRS04","JESIKA EDITH IBARRA PEREZ","08DPT0012I",null,null,null,null,null,null,0,144,0,null,null,null,null,null,null,0,144,0,14018.4]
[null,"CHIHUAHUA","IAFR620519979","IAFR620519HSLZRM07","RAMON  IZAGUIRRE FIERRO","08DPT0012I",null,null,null,null,null,null,0,240,0,null,null,null,null,null,null,0,240,0,26259]
[null,"CHIHUAHUA","JAAG74101784A","JAAG741017MCHQRL01","GLORIA LINDA JAQUEZ ARBALLO","08DPT0012I",null,null,null,null,null,null,0,240,0,null,null,null,null,null,null,0,240,0,30303]
[null,"CHIHUAHUA","LAGL890709J41","LAGL890709MCHZNL07","LLUVIA CRISTINA LAZO GONZALEZ","08DPT0012I",null,null,null,null,null,null,0,228,0,null,null,null,null,null,null,0,228,0,28787.879999999997]
[null,"CHIHUAHUA","MALS840210DM2","MALS840210MCHCYL02","SILVIA ISELA MACIAS LOYA","08DPT0012I",null,null,null,null,null,null,0,120,0,null,null,null,null,null,null,0,120,0,15151.5]
[null,"CHIHUAHUA","MATM841124GU1","MATM841124MCHRLY00","MAYTEE ABRIL MARQUEZ TELLO","08DPT0012I",null,null,null,null,null,null,0,180,0,null,null,null,null,null,null,0,180,0,22727.280000000002]
[null,"CHIHUAHUA","MAGM880802UR1","MAGM880802MCHRRR08","MARINA ANGELICA MARTINEZ GARCIA","08DPT0012I",null,null,null,null,null,null,0,228,0,null,null,null,null,null,null,0,228,0,28787.879999999997]
[null,"CHIHUAHUA","MEOE6606187C0","MEOE660618HCHLRF02","EFREN MELENDEZ ORTIZ","08DPT0012I",null,null,null,null,null,null,0,216,0,null,null,null,null,null,null,0,216,0,27272.7]
[null,"CHIHUAHUA","MERA900126FD2","MERA900126MCHNMN03","ANA ISABEL MENDOZA RAMOS","08DPT0012I",null,null,null,null,null,null,0,240,0,null,null,null,null,null,null,0,240,0,26259]
[null,"CHIHUAHUA","MOEJ8410204P7","MOEJ841020HCHRSS09","JESUS MORENO ESTRADA","08DPT0012I",null,null,null,null,null,null,0,216,0,null,null,null,null,null,null,0,216,0,27272.7]
[null,"CHIHUAHUA","NAAH950220UHA","NAAH950220MCHKNR00","HARUMI VALERIA NAKAMURA ANCHONDO","08DPT0012I",null,null,null,null,null,null,0,120,0,null,null,null,null,null,null,0,120,0,11682]
[null,"CHIHUAHUA","NUMR860506DV4","NUMR860506MCHXRQ03","RAQUEL NUÑEZ MARTINEZ","08DPT0012I",null,null,null,null,null,null,0,120,0,null,null,null,null,null,null,0,120,0,15151.5]
[null,"CHIHUAHUA","OIPC830620AE8","OIPC830620HCHRRR03","CARLOS ALEJANDRO ORTIZ PAREDES","08DPT0012I",null,null,null,null,null,null,0,240,0,null,null,null,null,null,null,0,240,0,30303]
[null,"CHIHUAHUA","PAVC680810379","PAVC680810MCHLLR09","CARMEN LORENA PALMA VALVERDE","08DPT0012I",null,null,null,null,null,null,0,240,0,null,null,null,null,null,null,0,240,0,30303]
[null,"CHIHUAHUA","PAVK8303143F4","PAVK830314MCHYLR05","KARLA DENISSE PAYAN VALVERDE","08DPT0012I",null,null,null,null,null,null,0,240,0,null,null,null,null,null,null,0,240,0,30303]
[null,"CHIHUAHUA","POED8604086S3","POED860408MCHRCN03","DIANA ELIZABETH PORTILLO ECHAVARRIA","08DPT0012I",null,null,null,null,null,null,0,240,0,null,null,null,null,null,null,0,240,0,30303]
[null,"CHIHUAHUA","ROAN6811104YA","ROAN681110HVZDGX08","JOSE NOE RODRIGUEZ AGUILERA","08DPT0012I",null,null,null,null,null,null,0,168,0,null,null,null,null,null,null,0,168,0,21212.1]
[null,"CHIHUAHUA","ROVC830522ILA","ROVC830522MCHDLR00","CRISTINA RODRIGUEZ VALVERDE","08DPT0012I",null,null,null,null,null,null,0,216,0,null,null,null,null,null,null,0,216,0,21027.599999999999]
[null,"CHIHUAHUA","SAME780216645","SAME780216MCHCLS05","ESMERALDA SAUCEDO MOLINA","08DPT0012I",null,null,null,null,null,null,0,240,0,null,null,null,null,null,null,0,240,0,30303]
[null,"CHIHUAHUA","SATL841206QI8","SATL841206HCHZRS00","LUIS MIGUEL SAUZAMEDA TORRES","08DPT0012I",null,null,null,null,null,null,0,228,0,null,null,null,null,null,null,0,228,0,22195.8]
[null,"CHIHUAHUA","UUGA831111DY9","UUGA831111MCHRND03","ADRIANA ARMINE URQUIZA GONZALEZ","08DPT0012I",null,null,null,null,null,null,0,240,0,null,null,null,null,null,null,0,240,0,30303]
[null,"CHIHUAHUA","VATL8403292K8","VATL840329HCHLRS05","LUIS OCTAVIO VALVERDE TORRES","08DPT0012I",null,null,null,null,null,null,0,240,0,null,null,null,null,null,null,0,240,0,26259]
[null,"CHIHUAHUA","VACA8309027BA","VXCA830902HCHZHN07","ANDRES VAZQUEZ  CHAVEZ","08DPT0012I",null,null,null,null,null,null,0,240,0,null,null,null,null,null,null,0,240,0,30303]
[null,"CHIHUAHUA","VIVR8208282I1","VIVR820828HDGLLB03","ROBERTO RENE VILLALPALDO VILLALPANDO","08DPT0012I",null,null,null,null,null,null,0,240,0,null,null,null,null,null,null,0,240,0,17178]
[null,"CHIHUAHUA","AAEJ730109C94","AAEJ730109HCHLSL06","JULIAN  ALVAREZ ESCARCEGA ","08DPT0011J",null,null,null,1,0,0,null,null,null,null,null,null,null,null,null,1,0,0,31150.31]
[null,"CHIHUAHUA","AOJS831129TE8","AOJS831129MCHNRL09","SILVIA GRACIELA ANCHONDO JUAREZ ","08DPT0011J",null,null,null,1,0,0,null,null,null,null,null,null,null,null,null,1,0,0,41402.94]
[null,"CHIHUAHUA","AOLY671118ELA","AOLY671118MDGRCZ05","YAZMIN ARROYO LECHUGA ","08DPT0011J",null,null,null,1,0,0,null,null,null,null,null,null,null,null,null,1,0,0,124837.2]
[null,"CHIHUAHUA","AIAA780609P70","AIAA780609HCHVGG01","AGUSTIN AVITIA AGUILAR ","08DPT0011J",null,null,null,null,null,null,null,null,null,null,null,null,1,0,0,1,0,0,66459.899999999994]
[null,"CHIHUAHUA","BARM6606271QA","BARM660627HCHRBR03","MARIO ALBERTO BARBA RUBIO","08DPT0011J",null,null,null,1,0,0,null,null,null,null,null,null,null,null,null,1,0,0,34618.54]
[null,"CHIHUAHUA","CAMF661018JC7","CAMF661018HCHHDR08","FRANCISCO JAVIER CABRERA MEDINA","08DPT0011J",null,null,null,1,0,0,null,null,null,null,null,null,null,null,null,1,0,0,89111.94]
[null,"CHIHUAHUA","CAVJ9010233Z3","CAVJ901023MCHXZH05","JAHAIRA ARANI CAÑAS VAZQUEZ ","08DPT0011J",null,null,null,1,0,0,null,null,null,null,null,null,null,null,null,1,0,0,57302.73]
[null,"CHIHUAHUA","EUGM7504107E2","EUGM750410HCHSRR05","MAURO EZEQUIEL ESQUIVEL GUERRERO ","08DPT0011J",null,null,null,1,0,0,null,null,null,null,null,null,null,null,null,1,0,0,5574.08]
[null,"CHIHUAHUA","FACG681029MZ8","FACG681029MCHDRR04","GEORGINA FAUDOA CRUZ","08DPT0011J",null,null,null,1,0,0,null,null,null,null,null,null,null,null,null,1,0,0,50681.16]
[null,"CHIHUAHUA","FUCJ631107GN9","FUCJ611107MCHNHL09","JULIETA FUENTES CHAVEZ","08DPT0011J",null,null,null,1,0,0,null,null,null,null,null,null,null,null,null,1,0,0,106708.68]
[null,"CHIHUAHUA","GAGJ740328P75","GAGJ740328HCHLNR03","JORGE ARTURO GALLEGOS GONZALEZ","08DPT0011J",null,null,null,1,0,0,null,null,null,null,null,null,null,null,null,1,0,0,45738.6]
[null,"CHIHUAHUA","GOML880120US2","GOML880120MCHMNZ01","GOMEZ MENDOZA LUZ IVONNE","08DPT0011J",null,null,null,1,0,0,null,null,null,null,null,null,null,null,null,1,0,0,24403.32]
[null,"CHIHUAHUA","GOQG650428BVA","GOQG650428MCHNNR07","GEORGINA GONZALEZ QUINTANA","08DPT0011J",null,null,null,1,0,0,null,null,null,null,null,null,null,null,null,1,0,0,44342.58]
[null,"CHIHUAHUA","GURJ541104T10","GURJ541104HCHRMS04","JESUS LUIS GUERRA RAMIREZ","08DPT0011J",null,null,null,1,0,0,null,null,null,null,null,null,null,null,null,1,0,0,45601.59]
[null,"CHIHUAHUA","HEAT6405082U8","HEAT640508MCHRNR05","MARIA TERESA HERNANDEZ ANCHONDO ","08DPT0011J",null,null,null,1,0,0,null,null,null,null,null,null,null,null,null,1,0,0,22755.119999999999]
[null,"CHIHUAHUA","HENE680323MJ1","HENE680323MCHRRL03","ELIDA HERNANDEZ NORES","08DPT0011J",null,null,null,1,0,0,null,null,null,null,null,null,null,null,null,1,0,0,48635.4]
[null,"CHIHUAHUA","LIGG8206272AA","LIGG820627HCLRRZ15","GIEZI LIRA GARCIA","08DPT0011J",null,null,null,1,0,0,null,null,null,null,null,null,null,null,null,1,0,0,46227.06]
[null,"CHIHUAHUA","LOPO671113I30","LOPO671113HCHPRS00","OSCAR BENJAMIN LOPEZ PEREZ","08DPT0011J",null,null,null,1,0,0,null,null,null,null,null,null,null,null,null,1,0,0,126654.16]
[null,"CHIHUAHUA","MAGI710826BY5","MAGI710826HCHRNV05","IVONNE ARACELI MARTINEZ GONZALEZ","08DPT0011J",null,null,null,1,0,0,null,null,null,null,null,null,null,null,null,1,0,0,84025.09]
[null,"CHIHUAHUA","MAVE810424SY3","MAVE810424MCHRLL08","ELIA ZURASY MARTINEZ VELO","08DPT0011J",null,null,null,1,0,0,null,null,null,null,null,null,null,null,null,1,0,0,35440.370000000003]
[null,"CHIHUAHUA","MEGM480906839","MEGM480906HCHNNG00","MIGUEL ANGEL MENDOZA GONZALEZ","08DPT0011J",null,null,null,1,0,0,null,null,null,null,null,null,null,null,null,1,0,0,34990.129999999997]
[null,"CHIHUAHUA","MOCY820701FR6","MOCY820701MCHRHS01","YESSENIA IVONNE MORENO CHAVEZ ","08DPT0011J",null,null,null,1,0,0,null,null,null,null,null,null,null,null,null,1,0,0,113409.28]
[null,"CHIHUAHUA","NIRF750722BR7","NIRF750722HCHXDL02","FILIBERTO NIÑO RODRIGUEZ ","08DPT0011J",null,null,null,1,0,0,null,null,null,null,null,null,null,null,null,1,0,0,22755.119999999999]
[null,"CHIHUAHUA","OIFL620226IA5","OIFL620226MCHLLD03","LIDIA GUADALUPE OLIVAS FLORES","08DPT0011J",null,null,null,1,0,0,null,null,null,null,null,null,null,null,null,1,0,0,82716.06]
[null,"CHIHUAHUA","OESN6905137N5","OESN690513MCHRCR06","NORMA ORTEGA SCOTT","08DPT0011J",null,null,null,1,0,0,null,null,null,null,null,null,null,null,null,1,0,0,86829.75]
[null,"CHIHUAHUA","REVB701115KRA","REVB701115MCHGTH02","BHERDINA REGALADO VITELA ","08DPT0011J",null,null,null,1,0,0,null,null,null,null,null,null,null,null,null,1,0,0,126539.04]
[null,"CHIHUAHUA","ROAA860101KQ4","ROAA860101HCHCNL04","JOSE ALBERTO ROCHA ANTUNA","08DPT0011J",null,null,null,1,0,0,null,null,null,null,null,null,null,null,null,1,0,0,29772.03]
[null,"CHIHUAHUA","RUAJ680828NZ1","RUAJ680828HCHZGN01","JUAN CARLOS RUIZ AGUIRRE","08DPT0011J",null,null,null,1,0,0,null,null,null,null,null,null,null,null,null,1,0,0,30908.98]
[null,"CHIHUAHUA","SADC620717A78","SADC620717MCHLMR01","CARMEN ESTELA SALAS DOMINGUEZ","08DPT0011J",null,null,null,1,0,0,null,null,null,null,null,null,null,null,null,1,0,0,72432.990000000005]
[null,"CHIHUAHUA","SACG701206260","SACG701206MCHLND02","MARIA GUADALUPE SALAZAR CONTRERAS","08DPT0011J",null,null,null,1,0,0,null,null,null,null,null,null,null,null,null,1,0,0,89589.15]
[null,"CHIHUAHUA","SAOD961029SV8","SAOD961029MCHNRN08","DIANA GUADALUPE SANDATE ORTEGA","08DPT0011J",null,null,null,1,0,0,null,null,null,null,null,null,null,null,null,1,0,0,20336.099999999999]
[null,"CHIHUAHUA","VAAG6312036W2","VAAG631203HTSLVR03","GERARDO VALDEZ AVILA","08DPT0011J",null,null,null,null,null,null,null,null,null,null,null,null,1,0,0,1,0,0,85992.48]
[null,"CHIHUAHUA","VIDV791004RJ0","VIDV791004MCHLRR04","VIRGINIA VILLALBA DURAN","08DPT0011J",null,null,null,1,0,0,null,null,null,null,null,null,null,null,null,1,0,0,45193.74]
[null,"CHIHUAHUA","VIMS620916I47","VIMS620916MCHLRN00","SANDRA HORTENSIA VILLALOBOS MARIN","08DPT0011J",null,null,null,1,0,0,null,null,null,null,null,null,null,null,null,1,0,0,86277.87]
[null,"CHIHUAHUA","VIYD6702201Q6","VIYD670220MCHLXR09","DORA EMMA VILLALOBOS YAÑEZ","08DPT0011J",null,null,null,1,0,0,null,null,null,null,null,null,null,null,null,1,0,0,46489.02]
[null,"CHIHUAHUA","AOAJ720609R46","AOAJ720609MCHCLS06","MARIA DE JESUS ACOSTA ALVAREZ","08DPT0011J",null,null,null,null,null,null,0,240,0,null,null,null,null,null,null,0,240,0,23364]
[null,"CHIHUAHUA","AORC6607129B3","AORC660712HCHCMS03","CESAR RENE ACOSTA ROMO","08DPT0011J",null,null,null,null,null,null,0,180,0,null,null,null,null,null,null,0,180,0,19694.28]
[null,"CHIHUAHUA","AUVX671108950","AUVX671108MCHGLC09","XOCHITL MARGARITA AGUILAR VILLALOBOS","08DPT0011J",null,null,null,null,null,null,0,180,0,null,null,null,null,null,null,0,180,0,22727.279999999999]
[null,"CHIHUAHUA","AADF760822JB4","AADF760822MCHLML07","FLOR ANEL ALMANZA DOMINGUEZ","08DPT0011J",null,null,null,null,null,null,0,216,0,null,null,null,null,null,null,0,216,0,27272.699999999997]
[null,"CHIHUAHUA","AADF541004UL3","AADF541004HDGLMR07","FRANCISCO ALVARADO DOMINGUEZ","08DPT0011J",null,null,null,null,null,null,0,192,0,null,null,null,null,null,null,0,192,0,24242.400000000001]
[null,"CHIHUAHUA","AAGD820816HU2","AAGD820816MCHLTL09","DALYLA ALVARADO GUTIERREZ","08DPT0011J",null,null,null,null,null,null,0,204,0,null,null,null,null,null,null,0,204,0,25757.58]
[null,"CHIHUAHUA","AASE930324BT6","AASE930324MCHLLD02","EDITH ALVAREZ SALAZAR","08DPT0011J",null,null,null,null,null,null,0,216,0,null,null,null,null,null,null,0,216,0,23633.1]
[null,"CHIHUAHUA","AIRL900105A19","AIRL900105HCHLSS09","JOSE LUIS ALVIDREZ RIOS","08DPT0011J",null,null,null,null,null,null,0,228,0,null,null,null,null,null,null,0,228,0,28787.879999999997]
[null,"CHIHUAHUA","AALU670310HX2","AAXL670310HCHMXS16","LUIS CARLOS AMAYA X","08DPT0011J",null,null,null,null,null,null,0,192,0,null,null,null,null,null,null,0,192,0,24242.400000000001]
[null,"CHIHUAHUA","AAAM8805014VA","AAAM880501MCHNCL02","MILDRED ARLETTE ANDRADE ACOSTA","08DPT0011J",null,null,null,null,null,null,0,216,0,null,null,null,null,null,null,0,216,0,21027.599999999999]
[null,"CHIHUAHUA","AIDJ6101296Q4","AIDJ610129HCHVLS09","JESUS HUMBERTO AVILA DELGADO","08DPT0011J",null,null,null,null,null,null,0,240,0,null,null,null,null,null,null,0,240,0,30303]
[null,"CHIHUAHUA","AIQC690227LQ0","AIQC690227HCHVNS05","CESAR ROGACIANO AVILA QUINTANA","08DPT0011J",null,null,null,null,null,null,0,240,0,null,null,null,null,null,null,0,240,0,30303]
[null,"CHIHUAHUA","BAGA570401CF3","BAGA570401HCHRNN09","ANDRES BARBA GANDARA","08DPT0011J",null,null,null,null,null,null,0,240,0,null,null,null,null,null,null,0,240,0,30303]
[null,"CHIHUAHUA","BABR540126HB4","BABR540126HCHZDL02","RAUL GABRIEL BAEZA BEDOY","08DPT0011J",null,null,null,null,null,null,0,144,0,null,null,null,null,null,null,0,144,0,18181.8]
[null,"CHIHUAHUA","BASZ650208NL8","BASZ650208MDFRTH15","BARRAZA STOELTING ZHENIA PATRICIA","08DPT0011J",null,null,null,null,null,null,0,96,0,null,null,null,null,null,null,0,96,0,12121.2]
[null,"CHIHUAHUA","BEAG740617SI1","BEAG740617MSLJRB00","MARIA GABIELA BEJARANO ARREDONDO","08DPT0011J",null,null,null,null,null,null,0,240,0,null,null,null,null,null,null,0,240,0,30303]
[null,"CHIHUAHUA","BEML730902B28","BEML730902HCHLRS07","JOSE LUIS BELTRAN MARQUEZ","08DPT0011J",null,null,null,null,null,null,0,228,0,null,null,null,null,null,null,0,228,0,28787.879999999997]
[null,"CHIHUAHUA","BACJ820811R51","BACJ820811HCHLRN02","JUAN JOSE BLANCO CRUZ","08DPT0011J",null,null,null,null,null,null,0,120,0,null,null,null,null,null,null,0,120,0,15151.5]
[null,"CHIHUAHUA","BASH700602N82","BASH700602HCHLNR08","HERNAN BLANCO SAENZ","08DPT0011J",null,null,null,null,null,null,0,192,0,null,null,null,null,null,null,0,192,0,24242.400000000001]
[null,"CHIHUAHUA","CAHJ821204323","CAHJ821204HCHBRL07","JOEL ANTONIO CABALLERO HERNANDEZ","08DPT0011J",null,null,null,null,null,null,0,228,0,null,null,null,null,null,null,0,228,0,28787.879999999997]
[null,"CHIHUAHUA","CADL780717DQ0","CADL780717HCHMLS06","LUIS MANUEL CAMACHO DELGADO","08DPT0011J",null,null,null,null,null,null,0,240,0,null,null,null,null,null,null,0,240,0,26259]
[null,"CHIHUAHUA","CAML770621S57","CAML770621HCHRRS02","LUIS CARMONA MORA","08DPT0011J",null,null,null,null,null,null,0,96,0,null,null,null,null,null,null,0,96,0,12121.2]
[null,"CHIHUAHUA","CAEI831214746","CAEI831214MCHRSV05","IVETH SELENE CARO ESCUDERO","08DPT0011J",null,null,null,null,null,null,0,180,0,null,null,null,null,null,null,0,180,0,22727.279999999999]
[null,"CHIHUAHUA","CAGS5611036P5","CAGS561103MCHRLL06","SILVIA CARRASCO GALVAN","08DPT0011J",null,null,null,null,null,null,0,180,0,null,null,null,null,null,null,0,180,0,22727.279999999999]
[null,"CHIHUAHUA","CAVJ780821N37","CAVJ780821HCHZLS05","JESUS MANUEL CAZARES VILLARREAL","08DPT0011J",null,null,null,null,null,null,0,228,0,null,null,null,null,null,null,0,228,0,24946.080000000002]
[null,"CHIHUAHUA","CEPJ5209176A4","CEPJ520917MCLDXS03","MARIA DE JESUS CEDILLO PEÑA","08DPT0011J",null,null,null,null,null,null,0,240,0,null,null,null,null,null,null,0,240,0,30303]
[null,"CHIHUAHUA","CALM790104KB2","CALM790104HCHHPN06","MANUEL ALBERTO CHAVIRA LOPEZ","08DPT0011J",null,null,null,null,null,null,0,240,0,null,null,null,null,null,null,0,240,0,30303]
[null,"CHIHUAHUA","CORI861010967","CORI861010HCHNVS07","ISAUL CONTRERAS RIVERA","08DPT0011J",null,null,null,null,null,null,0,228,0,null,null,null,null,null,null,0,228,0,24946.080000000002]
[null,"CHIHUAHUA","COVM710719995","COVM710719HCHRLR08","MARCO ANTONIO CORONADO VILLARREAL","08DPT0011J",null,null,null,null,null,null,0,228,0,null,null,null,null,null,null,0,228,0,28787.879999999997]
[null,"CHIHUAHUA","DIVM670828475","DIVM670828HCHZQN04","MANUEL DIAZ VAQUERA","08DPT0011J",null,null,null,null,null,null,0,180,0,null,null,null,null,null,null,0,180,0,22727.279999999999]
[null,"CHIHUAHUA","EICP660518T31","EICP660518MCHSRT02","PATRICIA EISSA CARRILLO","08DPT0011J",null,null,null,null,null,null,0,180,0,null,null,null,null,null,null,0,180,0,22727.279999999999]
[null,"CHIHUAHUA","EIAL6904095Y1","EIAL690409MCHSLR06","LORENA MARGARITA ESPINOZA ALCALA","08DPT0011J",null,null,null,null,null,null,0,240,0,null,null,null,null,null,null,0,240,0,30303]
[null,"CHIHUAHUA","FOSJ7411047Y2","FOSJ741104HCHLLV00","JAVIER ARTURO FLORES SALAS","08DPT0011J",null,null,null,null,null,null,0,144,0,null,null,null,null,null,null,0,144,0,18181.800000000003]
[null,"CHIHUAHUA","GAGJ7110079I6","GAGJ711007HCHBRL03","JULIAN GABIRA DE LA GARZA","08DPT0011J",null,null,null,null,null,null,0,228,0,null,null,null,null,null,null,0,228,0,28787.879999999997]
[null,"CHIHUAHUA","GALP8605195S6","GALP860519MCHRCR06","PERLA LILIANA GARCIA LUCERO","08DPT0011J",null,null,null,null,null,null,0,240,0,null,null,null,null,null,null,0,240,0,26259]
[null,"CHIHUAHUA","GOCC7107156X6","GOCC710715MCHNHR03","CARMEN GUADALUPE GONZALEZ CHACON","08DPT0011J",null,null,null,null,null,null,0,216,0,null,null,null,null,null,null,0,216,0,27272.699999999997]
[null,"CHIHUAHUA","GOGJ721103UI4","GOGJ721103HCHNRL03","JULIO CESAR GONZALEZ GRANADOS","08DPT0011J",null,null,null,null,null,null,0,204,0,null,null,null,null,null,null,0,204,0,25757.58]
[null,"CHIHUAHUA","GOPS631119234","GOPS631119HCHNZX06","SIXTO HUMBERTO GONZALEZ PAEZ","08DPT0011J",null,null,null,null,null,null,0,240,0,null,null,null,null,null,null,0,240,0,30303]
[null,"CHIHUAHUA","GUTM700125HI4","GUTM700125MCHRRR03","MARGARITA GUARDADO TORRES","08DPT0011J",null,null,null,null,null,null,0,192,0,null,null,null,null,null,null,0,192,0,24242.400000000001]
[null,"CHIHUAHUA","GUGL640702V28","GUGL640702HCHTRS02","LUIS ROGELIO GUTIERREZ GARCIA","08DPT0011J",null,null,null,null,null,null,0,204,0,null,null,null,null,null,null,0,204,0,25757.58]
[null,"CHIHUAHUA","HECM730118LI9","HECM730118HCHRDR06","MAURICIO HERNANDEZ CAUDILLO","08DPT0011J",null,null,null,null,null,null,0,120,0,null,null,null,null,null,null,0,120,0,15151.5]
[null,"CHIHUAHUA","HEOD870714897","HEOD870714MCLRLN06","DIANA HERNANDEZ OLIVARES","08DPT0011J",null,null,null,null,null,null,0,204,0,null,null,null,null,null,null,0,204,0,25757.58]
[null,"CHIHUAHUA","HETC830217EB1","HETC830217MCHRRN07","CINTHIA LIZETH HERNANDEZ TREVIÑO","08DPT0011J",null,null,null,null,null,null,0,144,0,null,null,null,null,null,null,0,144,0,18181.800000000003]
[null,"CHIHUAHUA","HEDM761211T33","HEDM761211MCHRZY08","MAYRA GUADALUPE HERRERA DIAZ","08DPT0011J",null,null,null,null,null,null,0,216,0,null,null,null,null,null,null,0,216,0,27272.699999999997]
[null,"CHIHUAHUA","JASX660321NQ4","JASX660321HZSYTM15","XAMIR JAYDAR SOTO","08DPT0011J",null,null,null,null,null,null,0,180,0,null,null,null,null,null,null,0,180,0,22727.279999999999]
[null,"CHIHUAHUA","JISR460111595","JISR460111HBCMLY00","REYNALDO JIMENEZ SOLIS","08DPT0011J",null,null,null,null,null,null,0,216,0,null,null,null,null,null,null,0,216,0,23633.1]
[null,"CHIHUAHUA","JILS7804098R3","JILS780409HCHMZR04","SERGIO ARMANDO JIMENEZ LOZANO","08DPT0011J",null,null,null,null,null,null,0,72,0,null,null,null,null,null,null,0,72,0,9090.9000000000015]
[null,"CHIHUAHUA","LEGI810812S76","LEGI810812HCHYNR04","IRVING LEYVA GONZALEZ","08DPT0011J",null,null,null,null,null,null,0,216,0,null,null,null,null,null,null,0,216,0,27272.699999999997]
[null,"CHIHUAHUA","LOGE770513DS3","LOGE770513MCHPLL01","ELENA DEL ROSARIO LOPEZ GALAVIZ","08DPT0011J",null,null,null,null,null,null,0,216,0,null,null,null,null,null,null,0,216,0,27272.699999999997]
[null,"CHIHUAHUA","LUCL830421CC7","LUCL830421HCHVNS03","LUIS FERNANDO LUEVANO CONTRERAS","08DPT0011J",null,null,null,null,null,null,0,204,0,null,null,null,null,null,null,0,204,0,22320.18]
[null,"CHIHUAHUA","LURI7603163W9","LURI760316MCHJDR01","IRMA EMILIA LUJAN RODRIGUEZ","08DPT0011J",null,null,null,null,null,null,0,216,0,null,null,null,null,null,null,0,216,0,23633.1]
[null,"CHIHUAHUA","MEFJ6010186V1","MEFJ601018HCHNNS07","JESUS ALBERTO MENCHACA FUENTES","08DPT0011J",null,null,null,null,null,null,0,240,0,null,null,null,null,null,null,0,240,0,30303]
[null,"CHIHUAHUA","MEEJ750705D34","MEEJ750705HCHNSS02","JESUS MENDOZA ESTEVANE","08DPT0011J",null,null,null,null,null,null,0,144,0,null,null,null,null,null,null,0,144,0,18181.800000000003]
[null,"CHIHUAHUA","MOVI660317J46","MOXV660317HCHLXC08","VICTOR MANUEL MOLINAR X","08DPT0011J",null,null,null,null,null,null,0,240,0,null,null,null,null,null,null,0,240,0,26259]
[null,"CHIHUAHUA","MORR640403339","MORR640403MCHNDS08","ROSARIO FLORENTINA MONTOYA RODRIGUEZ","08DPT0011J",null,null,null,null,null,null,0,204,0,null,null,null,null,null,null,0,204,0,25757.58]
[null,"CHIHUAHUA","MOEC8307215B7","MOEC830721HCHRSR06","CARLOS DANIEL MORALES ESPINOZA","08DPT0011J",null,null,null,null,null,null,0,228,0,null,null,null,null,null,null,0,228,0,28787.879999999997]
[null,"CHIHUAHUA","MOSV610329FQ2","MOSV610329HCHRTC06","VICTOR MORENO SOTO","08DPT0011J",null,null,null,null,null,null,0,192,0,null,null,null,null,null,null,0,192,0,24242.400000000001]
[null,"CHIHUAHUA","MOOL690713831","MOOL690713MCHRSR07","LAURA MAGDALENA MORONES OSUNA","08DPT0011J",null,null,null,null,null,null,0,240,0,null,null,null,null,null,null,0,240,0,30303]
[null,"CHIHUAHUA","MORC720201UY4","MORC720201MCHRDL09","CLAUDIA MORONES RODRIGUEZ","08DPT0011J",null,null,null,null,null,null,0,192,0,null,null,null,null,null,null,0,192,0,24242.400000000001]
[null,"CHIHUAHUA","MUNL690829H48","MUNL690829MCHXTZ04","LUZ EMILIA MUÑOZ NATIVIDAD","08DPT0011J",null,null,null,null,null,null,0,120,0,null,null,null,null,null,null,0,120,0,15151.5]
[null,"CHIHUAHUA","NADJ630505N67","NADJ630505HCHVLN05","JUAN NAVA DELGADO","08DPT0011J",null,null,null,null,null,null,0,240,0,null,null,null,null,null,null,0,240,0,30303]
[null,"CHIHUAHUA","NAML740428B29","NAML740428MCHVRR05","LORENA IVONNE NAVA MORALES","08DPT0011J",null,null,null,null,null,null,0,240,0,null,null,null,null,null,null,0,240,0,30303]
[null,"CHIHUAHUA","OOMJ6108305IA","OOMJ610830MCHCDN00","JUANA ROSA OCHOA MADRID","08DPT0011J",null,null,null,null,null,null,0,240,0,null,null,null,null,null,null,0,240,0,30303]
[null,"CHIHUAHUA","OOGI7603109Y9","OOGI760310HDGRNS08","ISIDRO OROZCO GONZALEZ","08DPT0011J",null,null,null,null,null,null,0,240,0,null,null,null,null,null,null,0,240,0,30303]
[null,"CHIHUAHUA","OORA820321MG3","OORA820321MCHRNY08","AYDE OROZCO RENOVA","08DPT0011J",null,null,null,null,null,null,0,216,0,null,null,null,null,null,null,0,216,0,27272.699999999997]
[null,"CHIHUAHUA","PAMC840828GP8","PAMC840828MCHCRR08","CRISTINA PACHECO MARQUEZ","08DPT0011J",null,null,null,null,null,null,0,180,0,null,null,null,null,null,null,0,180,0,22727.279999999999]
[null,"CHIHUAHUA","PAPA610623V58","PAPA610623HCHLXN04","ANTONIO PALACIO PIÑA","08DPT0011J",null,null,null,null,null,null,0,216,0,null,null,null,null,null,null,0,216,0,27272.699999999997]
[null,"CHIHUAHUA","PEHJ6802298H5","PEHJ680229HCHRRN03","JUAN JOSE PEREZ HERNANDEZ","08DPT0011J",null,null,null,null,null,null,0,120,0,null,null,null,null,null,null,0,120,0,15151.5]
[null,"CHIHUAHUA","PERM720917SD7","PERM720917MCHRMR06","MARGARITA PEREZ RAMIREZ","08DPT0011J",null,null,null,null,null,null,0,108,0,null,null,null,null,null,null,0,108,0,13636.380000000001]
[null,"CHIHUAHUA","PADM510809SZ5","PADM510809HNTLZG08","MIGUEL ANGEL PLASCENCIA DIAZ","08DPT0011J",null,null,null,null,null,null,0,240,0,null,null,null,null,null,null,0,240,0,30303]
[null,"CHIHUAHUA","QUCC800518RJ7","QUCC800518MCHZML03","CLAUDIA ROCIO QUEZADA CAMPOYA","08DPT0011J",null,null,null,null,null,null,0,192,0,null,null,null,null,null,null,0,192,0,24242.400000000001]
[null,"CHIHUAHUA","QUME830808SH6","QUME830808HCHXRR06","ERIC QUIÑONES MARIÑELARENA","08DPT0011J",null,null,null,null,null,null,0,192,0,null,null,null,null,null,null,0,192,0,24242.400000000001]
[null,"CHIHUAHUA","RARR491119L95","RARR491119HPLMVB06","ROBERTO PONCIANO RAMIREZ RIVERA","08DPT0011J",null,null,null,null,null,null,0,240,0,null,null,null,null,null,null,0,240,0,30303]
[null,"CHIHUAHUA","RAHA780618377","RAHA780618HCHMRD01","ADARIK QUILEO RAMOS HERRERA","08DPT0011J",null,null,null,null,null,null,0,216,0,null,null,null,null,null,null,0,216,0,27272.699999999997]
[null,"CHIHUAHUA","RARL740713SN9","RARL740713MCHSYR08","LOURDES GABRIELA RASCON REYES","08DPT0011J",null,null,null,null,null,null,0,180,0,null,null,null,null,null,null,0,180,0,22727.279999999999]
[null,"CHIHUAHUA","REGJ630501KR7","REGJ630501HDFNRN07","JUAN CARLOS RENDON GARCIA","08DPT0011J",null,null,null,null,null,null,0,240,0,null,null,null,null,null,null,0,240,0,30303]
[null,"CHIHUAHUA","RILA820506DD4","RILA820506HCHVCN08","ANGEL ARMANDO RIVERA LECHUGA","08DPT0011J",null,null,null,null,null,null,0,228,0,null,null,null,null,null,null,0,228,0,24946.080000000002]
[null,"CHIHUAHUA","ROVW790131VE9","ROVW790131HCHJLL05","WILFREDO ROJO VELAZQUEZ","08DPT0011J",null,null,null,null,null,null,0,132,0,null,null,null,null,null,null,0,132,0,16666.68]
[null,"CHIHUAHUA","ROHE830406P40","ROHE830406MCHMRL03","ELSA SAMANTHA ROMERO HERRERA","08DPT0011J",null,null,null,null,null,null,0,144,0,null,null,null,null,null,null,0,144,0,18181.800000000003]
[null,"CHIHUAHUA","RUBJ910211L87","RUBJ910211HCHZCS01","RUIZ ESPARZA BACASEHUA JOSE","08DPT0011J",null,null,null,null,null,null,0,228,0,null,null,null,null,null,null,0,228,0,24946.080000000002]
[null,"CHIHUAHUA","RUHJ7401277YA","RUHJ740127HCHZRR00","JORGE ARTURO RUIZ HEIRAS","08DPT0011J",null,null,null,null,null,null,0,240,0,null,null,null,null,null,null,0,240,0,30303]
[null,"CHIHUAHUA","RUCJ590315LP9","RUCJ590315HZSZMS00","JOSE RUIZ ESPARZA CAMARENA","08DPT0011J",null,null,null,null,null,null,0,240,0,null,null,null,null,null,null,0,240,0,30303]
[null,"CHIHUAHUA","SARC670203156","SARC670203MDGLZR00","MARIA DEL CARMEN SALAS RUIZ","08DPT0011J",null,null,null,null,null,null,0,240,0,null,null,null,null,null,null,0,240,0,30303]
[null,"CHIHUAHUA","SACD640228KY5","SACD640228HCHLNN03","DANIEL JAVIER SALAZAR CONTRERAS","08DPT0011J",null,null,null,null,null,null,0,180,0,null,null,null,null,null,null,0,180,0,22727.279999999999]
[null,"CHIHUAHUA","SASL611115CC2","SASL611115HCHMPP00","LEOPOLDO SAMANIEGO SEPULVEDA","08DPT0011J",null,null,null,null,null,null,0,192,0,null,null,null,null,null,null,0,192,0,24242.400000000001]
[null,"CHIHUAHUA","SAPJ770502I20","SAPJ770502HCHNRV00","JAVIER SANCHEZ PEREZ","08DPT0011J",null,null,null,null,null,null,0,96,0,null,null,null,null,null,null,0,96,0,12121.2]
[null,"CHIHUAHUA","SEVK920127JG4","SEVK920127MCHGLR02","KAREN JEMIMA SEGOVIA VILLALOBOS","08DPT0011J",null,null,null,null,null,null,0,180,0,null,null,null,null,null,null,0,180,0,22727.279999999999]
[null,"CHIHUAHUA","TOMG6805124B0","TOMG680512MCHRRB05","GABRIELA TORRES MORENO","08DPT0011J",null,null,null,null,null,null,0,240,0,null,null,null,null,null,null,0,240,0,30303]
[null,"CHIHUAHUA","TOPD7211138C2","TOPD721113MCHRRL03","DELIA ARMIDA TORRES PORTILLO","08DPT0011J",null,null,null,null,null,null,0,204,0,null,null,null,null,null,null,0,204,0,25757.58]
[null,"CHIHUAHUA","TORJ640811CX6","TORJ640811HCHVVS02","JOSE TOVAR RIVERO","08DPT0011J",null,null,null,null,null,null,0,240,0,null,null,null,null,null,null,0,240,0,30303]
[null,"CHIHUAHUA","UUIL8212152F2","UUIL821215HCHRBS02","LUIS ALBERTO URQUIDI IBARBOL","08DPT0011J",null,null,null,null,null,null,0,240,0,null,null,null,null,null,null,0,240,0,30303]
[null,"CHIHUAHUA","VAPD660401U61","VAPD660401HCHLRN00","DANIEL VALADEZ PORTILLO","08DPT0011J",null,null,null,null,null,null,0,216,0,null,null,null,null,null,null,0,216,0,27272.699999999997]
[null,"CHIHUAHUA","VAGB5901245Z9","VAGB590124MCHLNL07","VALDERRABANO GONZALEZ BLANCA ESTELA ","08DPT0011J",null,null,null,null,null,null,0,216,0,null,null,null,null,null,null,0,216,0,27272.699999999997]
[null,"CHIHUAHUA","VAHJ690910EY0","VAHJ690910HCHLRM02","JAIME VALENZUELA HERNANDEZ","08DPT0011J",null,null,null,null,null,null,0,180,0,null,null,null,null,null,null,0,180,0,22727.279999999999]
[null,"CHIHUAHUA","VAGJ670203PVA","VAGJ670203HCLLVS03","JOSE VALLEJO GUEVARA","08DPT0011J",null,null,null,null,null,null,0,240,0,null,null,null,null,null,null,0,240,0,30303]
[null,"CHIHUAHUA","VACL8309162TA","VACL830916MCHRRR05","LAURA YANETH VARGAS CORRAL","08DPT0011J",null,null,null,null,null,null,0,168,0,null,null,null,null,null,null,0,168,0,13629]
[null,"CHIHUAHUA","VEDL620727PL3","VEDL620727MCHGRR05","LORETO VEGA DURAN","08DPT0011J",null,null,null,null,null,null,0,240,0,null,null,null,null,null,null,0,240,0,30303]
[null,"CHIHUAHUA","VEMA551027JGA","VEMA551027HCHGRR06","ARIEL VEGA MIRANDA","08DPT0011J",null,null,null,null,null,null,0,240,0,null,null,null,null,null,null,0,240,0,30303]
[null,"CHIHUAHUA","VIBH7007255V7","VIBH700725MCHDNL05","HILDA MINERVA VIDAÑA BENCOMO","08DPT0011J",null,null,null,null,null,null,0,228,0,null,null,null,null,null,null,0,228,0,28787.88]
[null,"CHIHUAHUA","VIPT690222SN0","VIPT690222MCHLXR04","MARIA TERESA VILLARREAL PIÑON","08DPT0011J",null,null,null,null,null,null,0,144,0,null,null,null,null,null,null,0,144,0,18181.8]
[null,"CHIHUAHUA","AOVP680821N74","AOVP680821MCHLLT07","PATRICIA GUADALUPE ALONSO VALENZUELA","08DPT0013H",null,null,null,null,null,null,0,240,0,null,null,null,null,null,null,0,240,0,31863]
[null,"CHIHUAHUA","AAOP870805580","AAOP870805HCHLLD04","PEDRO TOMAS ALVARADO OLIVAS","08DPT0013H",null,null,null,null,null,null,0,216,0,null,null,null,null,null,null,0,216,0,25374.6]
[null,"CHIHUAHUA","AIBS821008VBA","AIBS821008HVZRRR09","SERGIO ARIAS BRAVO","08DPT0013H",null,null,null,null,null,null,0,240,0,null,null,null,null,null,null,0,240,0,36660]
[null,"CHIHUAHUA","BUMA741111CX0","BUMA741111MCHSNN11","ANGELICA BUSTILLOS MINJAREZ","08DPT0013H",null,null,null,null,null,null,0,240,0,null,null,null,null,null,null,0,240,0,36660]
[null,"CHIHUAHUA","BURK950212RQ2","BURK950212MCHSNR03","KARLA ESTRELLA BUSTILLOS RENDON","08DPT0013H",null,null,null,null,null,null,0,240,0,null,null,null,null,null,null,0,240,0,28194]
[null,"CHIHUAHUA","CACR890101JE8","CACR890101HCHLRN05","RENE CALDERON CARNERO","08DPT0013H",null,null,null,null,null,null,0,240,0,null,null,null,null,null,null,0,240,0,36660]
[null,"CHIHUAHUA","CAMY820713FS4","CAMY820713MCHRTR09","YURIDIA ITZEL CARDONA MATA","08DPT0013H",null,null,null,null,null,null,0,240,0,null,null,null,null,null,null,0,240,0,36660]
[null,"CHIHUAHUA","CAGX6801106S4","CXGA680110HCLRRR09","ARTURO CARRILLO GARCIA","08DPT0013H",null,null,null,null,null,null,0,240,0,null,null,null,null,null,null,0,240,0,28194]
[null,"CHIHUAHUA","CECD871010N16","CECD871010HCHRSG08","DIEGO ADOLFO CERVANTES CASTILLO","08DPT0013H",null,null,null,null,null,null,0,216,0,null,null,null,null,null,null,0,216,0,25374.6]
[null,"CHIHUAHUA","COTD9112155M3","COTD911215MCHRRN03","DENISSE ALEJANDRA CORELLA TRUJILLO","08DPT0013H",null,null,null,null,null,null,0,240,0,null,null,null,null,null,null,0,240,0,36660]
[null,"CHIHUAHUA","CUAL871105HE1","CUAL871105HCHRLS08","LUIS ALEJANDRO CRUZ ALVARADO","08DPT0013H",null,null,null,null,null,null,0,240,0,null,null,null,null,null,null,0,240,0,31863]
[null,"CHIHUAHUA","DAGR770317JPA","DAGR770317HCLVNF02","RAFAEL DAVILA GONZALEZ","08DPT0013H",null,null,null,null,null,null,0,132,0,null,null,null,null,null,null,0,132,0,15506.7]
[null,"CHIHUAHUA","CUYJ890624UL8","CUYJ890624HCHRXN04","JUAN RAMON DE LA CRUZ YAÑEZ","08DPT0013H",null,null,null,null,null,null,0,228,0,null,null,null,null,null,null,0,228,0,26784.3]
[null,"CHIHUAHUA","ROCJ811214HD5","ROCJ811214HCLSMV04","JAVIER ROLANDO DE LA ROSA CAMPOS","08DPT0013H",null,null,null,null,null,null,0,240,0,null,null,null,null,null,null,0,240,0,36660]
[null,"CHIHUAHUA","LEVD880414UB2","LEVD880414MCLNLN07","DIANA GABRIELA DE LEON VELAZQUEZ","08DPT0013H",null,null,null,null,null,null,0,216,0,null,null,null,null,null,null,0,216,0,32994]
[null,"CHIHUAHUA","DODK891025237","DODK891025MCHMMR03","KARLA KARINA DOMINGUEZ DOMINGUEZ","08DPT0013H",null,null,null,null,null,null,0,240,0,null,null,null,null,null,null,0,240,0,36660]
[null,"CHIHUAHUA","EECA8503081Q2","EECA850308HSLCRB06","ABRAHAM JACOBO ECHEVARRIA CORRALES","08DPT0013H",null,null,null,null,null,null,0,240,0,null,null,null,null,null,null,0,240,0,36660]
[null,"CHIHUAHUA","EISC871230RT1","EISC871230MCHSNR08","CAROLINA ESPINOZA DE SANTIAGO","08DPT0013H",null,null,null,null,null,null,0,240,0,null,null,null,null,null,null,0,240,0,36660]
[null,"CHIHUAHUA","GAOR680723LM5","GAOR680723HCHLRC05","RICARDO RAUL GALARZA ORTEGA","08DPT0013H",null,null,null,null,null,null,0,240,0,null,null,null,null,null,null,0,240,0,36660]
[null,"CHIHUAHUA","GARS970720IY4","GARS970720MCHRDN02","SONIA YANIRA GARCIA RODRIGUEZ","08DPT0013H",null,null,null,null,null,null,0,216,0,null,null,null,null,null,null,0,216,0,25374.6]
[null,"CHIHUAHUA","GONJ870317J36","GONJ870317MVZMCN02","JENNY PATRICIA GOMEZ NICIDA","08DPT0013H",null,null,null,null,null,null,0,240,0,null,null,null,null,null,null,0,240,0,31863]
[null,"CHIHUAHUA","GOBA8404166GA","GOBA840416MDFNRN06","ANGELINA GONZALEZ BARCENAS","08DPT0013H",null,null,null,null,null,null,0,204,0,null,null,null,null,null,null,0,204,0,23964.9]
[null,"CHIHUAHUA","GOHD860913N63","GOHD860913MCLNRL08","DALIA LIBERTAD GONZALEZ HERNANDEZ","08DPT0013H",null,null,null,null,null,null,0,240,0,null,null,null,null,null,null,0,240,0,28194]
[null,"CHIHUAHUA","GOMA820909QV4","GOMA820909MCHNRD09","ADRIANA GONZALEZ MARQUEZ","08DPT0013H",null,null,null,null,null,null,0,240,0,null,null,null,null,null,null,0,240,0,36660]
[null,"CHIHUAHUA","GORR890405IP7","GORR890405HCHNMY01","RAYMUNDO RAMIREZ GONZALEZ","08DPT0013H",null,null,null,null,null,null,0,240,0,null,null,null,null,null,null,0,240,0,36660]
[null,"CHIHUAHUA","GUCD860131S71","GUCD860131HCHRLV06","JOSE DAVID GUERRERO CALLEROS","08DPT0013H",null,null,null,null,null,null,0,240,0,null,null,null,null,null,null,0,240,0,31863]
[null,"CHIHUAHUA","GUMG891202IP6","GUMG891202MCHTRR04","GRECIA REYNA GUTIERREZ MARRUFO","08DPT0013H",null,null,null,null,null,null,0,228,0,null,null,null,null,null,null,0,228,0,30269.879999999997]
[null,"CHIHUAHUA","HEAN911008UH6","HEAN911008MCHRLN03","NANCY ELIZABETH HEREDIA ALVARADO","08DPT0013H",null,null,null,null,null,null,0,240,0,null,null,null,null,null,null,0,240,0,28194]
[null,"CHIHUAHUA","HEAL6501012W6","HEAL650101HCHRRR04","LORENZO HERNANDEZ ARMENTA","08DPT0013H",null,null,null,null,null,null,0,240,0,null,null,null,null,null,null,0,240,0,36660]
[null,"CHIHUAHUA","HEPM870418QNA","HEPM870418MDFRRR08","MARY CARMEN HERNANDEZ PERALES","08DPT0013H",null,null,null,null,null,null,0,240,0,null,null,null,null,null,null,0,240,0,36660]
[null,"CHIHUAHUA","HIMY9004108E8","MIMY900410MCHNDS05","YISSEL SAYONARA HINOJO MODESTO","08DPT0013H",null,null,null,null,null,null,0,228,0,null,null,null,null,null,null,0,228,0,26784.3]
[null,"CHIHUAHUA","JUAS860801FD3","JUAS860801MCHRLL00","SILVIA ANGELICA JUAREZ ALVARADO","08DPT0013H",null,null,null,null,null,null,0,240,0,null,null,null,null,null,null,0,240,0,36660]
[null,"CHIHUAHUA","JUGD920330V98","JUGD920330MCHRRN02","DIANA MARIA JUAREZ GRANADOS","08DPT0013H",null,null,null,null,null,null,0,180,0,null,null,null,null,null,null,0,180,0,21145.5]
[null,"CHIHUAHUA","LINM5608318QA","LINM560731HDFVTG06","MIGUEL ARTURO LIEVANO NORMAN","08DPT0013H",null,null,null,null,null,null,0,240,0,null,null,null,null,null,null,0,240,0,28194]
[null,"CHIHUAHUA","LOMR7805084Z7","LOMR780508HCHRNL09","RAUL ERNESTO LOERA MONARREZ","08DPT0013H",null,null,null,null,null,null,0,160,0,null,null,null,null,null,null,0,160,0,24440]
[null,"CHIHUAHUA","LOAA850515Q46","LOAA850515HCHPRL03","ALEJANDRO LOPEZ ARMENDARIZ","08DPT0013H",null,null,null,null,null,null,0,240,0,null,null,null,null,null,null,0,240,0,36660]
[null,"CHIHUAHUA","LOCS771008517","LOCS771008HCHPRR09","SERGIO LOPEZ DE LA CRUZ","08DPT0013H",null,null,null,null,null,null,0,240,0,null,null,null,null,null,null,0,240,0,36660]
[null,"CHIHUAHUA","MAGT901211DE9","MAGT901211MCHLNH09","THANIA GUADALUPE MALDONADO GONZALEZ","08DPT0013H",null,null,null,null,null,null,0,240,0,null,null,null,null,null,null,0,240,0,36660]
[null,"CHIHUAHUA","MAGC661008FYA","MAGC661008HCHRNN09","CANDELARIO MARTINEZ GONZALEZ","08DPT0013H",null,null,null,null,null,null,0,240,0,null,null,null,null,null,null,0,240,0,36660]
[null,"CHIHUAHUA","METJ941115RJ7","METJ941115MCHDNN07","JENIFFER MEDINA TUNCHEZ","08DPT0013H",null,null,null,null,null,null,0,228,0,null,null,null,null,null,null,0,228,0,26784.3]
[null,"CHIHUAHUA","MOAR891030LR4","MOAR891030HCHNGC01","RICARDO DANIEL MONJARAS AGUILAR","08DPT0013H",null,null,null,null,null,null,0,240,0,null,null,null,null,null,null,0,240,0,28194]
[null,"CHIHUAHUA","MUSF8807088K7","MUSF880708HCHRLR03","FRANCISCO JAVIER MURILLO SALAZAR","08DPT0013H",null,null,null,null,null,null,0,240,0,null,null,null,null,null,null,0,240,0,28194]
[null,"CHIHUAHUA","NARM960112JC1","NARM960112HCHVMB02","MOAB DANIEL NAVARRO RAMIREZ","08DPT0013H",null,null,null,null,null,null,0,240,0,null,null,null,null,null,null,0,240,0,28194]
[null,"CHIHUAHUA","OISE771121RD9","OISE771121HCHLNL07","ELIAS HERIBERTO OLIVAS SAENZ","08DPT0013H",null,null,null,null,null,null,0,240,0,null,null,null,null,null,null,0,240,0,31863]
[null,"CHIHUAHUA","OISM951129R68","OISM951129MCHRLC03","MICHELLE ALEJANDRA ORTIZ SILVA","08DPT0013H",null,null,null,null,null,null,0,216,0,null,null,null,null,null,null,0,216,0,18829.8]
[null,"CHIHUAHUA","POGD861005KA6","POGD861005MCHRMN00","DANIELA PORRAS GOMEZ","08DPT0013H",null,null,null,null,null,null,0,240,0,null,null,null,null,null,null,0,240,0,36660]
[null,"CHIHUAHUA","PUYR780420I72","PUYR780420MMCLXC00","ROCIO PULIDO YAÑEZ","08DPT0013H",null,null,null,null,null,null,0,240,0,null,null,null,null,null,null,0,240,0,36660]
[null,"CHIHUAHUA","QUPK7804119NA","QUPK780411MSRVRR11","KARLA LIZETTE  QUEVEDO PRECIADO","08DPT0013H",null,null,null,null,null,null,0,240,0,null,null,null,null,null,null,0,240,0,36660]
[null,"CHIHUAHUA","RESJ851201GQ9","RESJ851201HCHVPV07","JAVIER EDUARDO  REVELES SAPIEN","08DPT0013H",null,null,null,null,null,null,0,240,0,null,null,null,null,null,null,0,240,0,36660]
[null,"CHIHUAHUA","ROGM9209304F8","ROGM920930HMCDLG05","MIGUEL ANGEL RODRIGUEZ GALVAN","08DPT0013H",null,null,null,null,null,null,0,240,0,null,null,null,null,null,null,0,240,0,28194]
[null,"CHIHUAHUA","ROVC550831794","ROVC550831MQTDLN04","CONCEPCION ROSARIO RODRIGUEZ VALDIVIELSO","08DPT0013H",null,null,null,null,null,null,0,216,0,null,null,null,null,null,null,0,216,0,28676.7]
[null,"CHIHUAHUA","RORE881219EW3","RORE881219HVZJYR07","ERNESTO IVAN ROJAS REYES","08DPT0013H",null,null,null,null,null,null,0,240,0,null,null,null,null,null,null,0,240,0,28194]
[null,"CHIHUAHUA","SASG860316EQ4","SASG860316HCHNNN09","GENARO ALONSO SAENZ SAENZ","08DPT0013H",null,null,null,null,null,null,0,240,0,null,null,null,null,null,null,0,240,0,20922]
[null,"CHIHUAHUA","SACR870225HZ8","SACR870225HCHLLB02","ROBERTO ISMAEL SALAZAR CALDERA","08DPT0013H",null,null,null,null,null,null,0,240,0,null,null,null,null,null,null,0,240,0,36660]
[null,"CHIHUAHUA","SACE740906S3A","SACE740906HCLLMN05","ENRIQUE  SALAZAR CAMPOS","08DPT0013H",null,null,null,null,null,null,0,240,0,null,null,null,null,null,null,0,240,0,36660]
[null,"CHIHUAHUA","SARC911030SC8","SARC911030HCHLMR00","CARLOS SALGADO ROMO","08DPT0013H",null,null,null,null,null,null,0,240,0,null,null,null,null,null,null,0,240,0,31863]
[null,"CHIHUAHUA","SESU611116K12","SESU611116HDFGRL05","ULISES SEGURA SIERRA","08DPT0013H",null,null,null,null,null,null,0,240,0,null,null,null,null,null,null,0,240,0,20922]
[null,"CHIHUAHUA","SIER8905149W5","SIER890514MCHGSS03","ROSA SELENE SIGALA ESQUIVEL","08DPT0013H",null,null,null,null,null,null,0,240,0,null,null,null,null,null,null,0,240,0,36660]
[null,"CHIHUAHUA","SORR740817E88","SORR740817HCHSDC09","RICARDO SOSA RODRIGUEZ","08DPT0013H",null,null,null,null,null,null,0,240,0,null,null,null,null,null,null,0,240,0,36660]
[null,"CHIHUAHUA","TECI630106UW7","TECI630106MDFLBS09","MARIA ISABEL TELLEZ GIRON COBOS","08DPT0013H",null,null,null,null,null,null,0,240,0,null,null,null,null,null,null,0,240,0,31863]
[null,"CHIHUAHUA","TORR840104UJ5","TORR840104MCHRMQ05","RAQUEL IVETTE TORRES RAMIREZ","08DPT0013H",null,null,null,null,null,null,0,240,0,null,null,null,null,null,null,0,240,0,36660]
[null,"CHIHUAHUA","UUMM850610TB5","UUMM850610HCHNNN02","MANUEL EDUARDO UNZUETA MONTES","08DPT0013H",null,null,null,null,null,null,0,204,0,null,null,null,null,null,null,0,204,0,27083.58]
[null,"CHIHUAHUA","VATB930812JK4","VATB930812MCHLRR05","BRENDA SUJEY VALADEZ TRUJILLO","08DPT0013H",null,null,null,null,null,null,0,240,0,null,null,null,null,null,null,0,240,0,31863]
[null,"CHIHUAHUA","VABE970529355","VABE970529HDFZLR00","ERNESTO VAZQUEZ BELMONTES","08DPT0013H",null,null,null,null,null,null,0,240,0,null,null,null,null,null,null,0,240,0,28194]
[null,"CHIHUAHUA","VEPS7608116K0","VEPS760811MCHLBS04","SUSANA ADRIANA VELAZQUEZ POBLANO","08DPT0013H",null,null,null,null,null,null,0,240,0,null,null,null,null,null,null,0,240,0,36660]
[null,"CHIHUAHUA","VIPL700512EU4","VIPL700512HCHDRS00","JOSE LUIS VIDAÑA PEREZ","08DPT0013H",null,null,null,null,null,null,0,228,0,null,null,null,null,null,null,0,228,0,34827]
[null,"CHIHUAHUA","AOVP680821N74","AOVP680821MCHLLT07","PATRICIA GUADALUPE ALONSO VALENZUELA","08DPT0013H",null,null,null,0,0,1,null,null,null,null,null,null,null,null,null,0,"0",1,25729.5]
[null,"CHIHUAHUA","AIBS821008VBA","AIBS821008HVZRRR09","SERGIO ARIAS BRAVO","08DPT0013H",null,null,null,0,0,1,null,null,null,null,null,null,null,null,null,0,"0",1,78454.92]
[null,"CHIHUAHUA","CAAJ800611RP7","CAAJ800611HCHHLL08","JULIO CESAR CHAVEZ ALVARADO","08DPT0013H",null,null,null,0,0,1,null,null,null,null,null,null,null,null,null,0,"0",1,23749.32]
[null,"CHIHUAHUA","DODK891025237","DODK891025MCHMMR03","KARLA KARINA DOMINGUEZ DOMINGUEZ","08DPT0013H",null,null,null,0,0,1,null,null,null,null,null,null,null,null,null,0,"0",1,43632.539999999994]
[null,"CHIHUAHUA","EECA8503081Q2","EECA850308HSLCRB06","ABRAHAM JACOBO ECHEVARRIA CORRALES","08DPT0013H",null,null,null,0,0,1,null,null,null,null,null,null,null,null,null,0,"0",1,43632.539999999994]
[null,"CHIHUAHUA","EAGJ991008R37","EAGJ991008MCHSZS02","JESSICA LIZBETH ESCAÑUELAS GUZMAN","08DPT0013H",null,null,null,0,0,1,null,null,null,null,null,null,null,null,null,0,"0",1,28768.139999999996]
[null,"CHIHUAHUA","EISC871230RT1","EISC871230MCHSNR08","CAROLINA ESPINOZA DE SANTIAGO","08DPT0013H",null,null,null,0,0,1,null,null,null,null,null,null,null,null,null,0,"0",1,43632.539999999994]
[null,"CHIHUAHUA","GARS970720IY4","GARS970720MCHRDN02","SONIA YANIRA GARCIA RODRIGUEZ","08DPT0013H",null,null,null,0,0,1,null,null,null,null,null,null,null,null,null,0,"0",1,25729.5]
[null,"CHIHUAHUA","GOHD860913N63","GOHD860913MCLNRL08","DALIA LIBERTAD GONZALEZ HERNANDEZ","08DPT0013H",null,null,null,0,0,1,null,null,null,null,null,null,null,null,null,0,"0",1,23749.32]
[null,"CHIHUAHUA","HEAC5605024W8","HEAC560502HTCRRR19","JOSE CRUZ HERNANDEZ ARA","08DPT0013H",null,null,null,0,0,1,null,null,null,null,null,null,null,null,null,0,"0",1,21795.420000000002]
[null,"CHIHUAHUA","HECK800610371","HECK800610MMCRHR10","KARINA HERNANDEZ CHAVEZ","08DPT0013H",null,null,null,0,0,1,null,null,null,null,null,null,null,null,null,0,"0",1,21795.420000000002]
[null,"CHIHUAHUA","LOCS771008517","LOCS771008HCHPRR09","SERGIO LOPEZ  DE LA CRUZ","08DPT0013H",null,null,null,0,0,1,null,null,null,null,null,null,null,null,null,0,"0",1,78454.92]
[null,"CHIHUAHUA","MARA971025347","MARA971025MCHNBR07","ARGELIA YAZMIN MANZUR REBOLLOZO","08DPT0013H",null,null,null,0,0,1,null,null,null,null,null,null,null,null,null,0,"0",1,23749.32]
[null,"CHIHUAHUA","NEAA910928HC9","NEAA910928HCHGCN09","ANTONIO NEGRETE ACOSTA","08DPT0013H",null,null,null,0,0,1,null,null,null,null,null,null,null,null,null,0,"0",1,21795.420000000002]
[null,"CHIHUAHUA","OISE001029EX3","OISE001029HCHRLRA7","ERICK LORENZO ORTIZ SILVA","08DPT0013H",null,null,null,0,0,1,null,null,null,null,null,null,null,null,null,0,"0",1,23749.32]
[null,"CHIHUAHUA","OISM951129R68","OISM951129MCHRLC03","MICHELLE ALEJANDRA ORTIZ SILVA","08DPT0013H",null,null,null,0,0,1,null,null,null,null,null,null,null,null,null,0,"0",1,25729.5]
[null,"CHIHUAHUA","PAVS900926C55","PAVS900926MVZDZN02","SANDY YUNUEN PADILLA VAZQUEZ","08DPT0013H",null,null,null,0,0,1,null,null,null,null,null,null,null,null,null,0,"0",1,43632.539999999994]
[null,"CHIHUAHUA","PUYR780420I72","PUYR780420MMCLXC00","ROCIO PULIDO  YAÑEZ","08DPT0013H",null,null,null,0,0,1,null,null,null,null,null,null,null,null,null,0,"0",1,78454.92]
[null,"CHIHUAHUA","RACI731115V49","RACI731115HPLMNS06","ISRAEL RAMOS CONTRERAS","08DPT0013H",null,null,null,0,0,1,null,null,null,null,null,null,null,null,null,0,"0",1,21795.420000000002]
[null,"CHIHUAHUA","RESJ851201GQ9","RESJ851201HCHVPV07","JAVIER EDUARDO REVELES  SAPIEN","08DPT0013H",null,null,null,0,0,1,null,null,null,null,null,null,null,null,null,0,"0",1,78454.92]
[null,"CHIHUAHUA","ROES970521Q99","ROES970521MCHDSN09","SINAI CAROLINA RODRIGUEZ ESTRADA","08DPT0013H",null,null,null,0,0,1,null,null,null,null,null,null,null,null,null,0,"0",1,23749.32]
[null,"CHIHUAHUA","RUMJ670308JU5","RUMJ670308HSPBRN01","JUAN RUBIO MARTINEZ","08DPT0013H",null,null,null,0,0,1,null,null,null,null,null,null,null,null,null,0,"0",1,21795.420000000002]
[null,"CHIHUAHUA","SARC911030SC8","SARC911030HCHLMR00","CARLOS SALGADO  ROMO","08DPT0013H",null,null,null,0,0,1,null,null,null,null,null,null,null,null,null,0,"0",1,43632.539999999994]
[null,"CHIHUAHUA","SAVS980512N44","SAVS980512MCHVLR08","SARAH INES SAAVEDRA VILLEGAS","08DPT0013H",null,null,null,0,0,1,null,null,null,null,null,null,null,null,null,0,"0",1,21795.420000000002]
[null,"CHIHUAHUA","SIER8905149W5","SIER890514MCHGSS03","ROSA SELENE SIGALA ESQUIVEL","08DPT0013H",null,null,null,0,0,1,null,null,null,null,null,null,null,null,null,0,"0",1,43632.539999999994]
[null,"CHIHUAHUA","TORR840104UJ5","TORR840104MCHRMQ05","RAQUEL IVETTE TORRES RAMIREZ","08DPT0013H",null,null,null,0,0,1,null,null,null,null,null,null,null,null,null,0,"0",1,43632.539999999994]
[null,"CHIHUAHUA","LIAL810304JK3","LIAL810304MCHCRL00","LILIANA LICON ARAGONEZ","00XXX0000X",null,null,null,null,null,null,null,null,null,null,null,null,1,0,0,1,0,0,100611.18]
[null,"CHIHUAHUA","BUAC8304198K9","BUAC830419MCHNGY03","CYNTHIA IRENE BUENO AGUIRRE","00XXX0000X",null,null,null,null,null,null,null,null,null,null,null,null,1,0,0,1,0,0,66459.899999999994]
[null,"CHIHUAHUA","CATC7205274V8","CATC720527HCHNRR09","CARLOS CANO TORRES","00XXX0000X",null,null,null,1,0,0,null,null,null,null,null,null,null,null,null,1,0,0,94462.98]
[null,"CHIHUAHUA","GOMD671113QD6","GOMD671113HCHMRG03","DIEGO RAUL GOMEZ MARTINEZ","00XXX0000X",null,null,null,1,0,0,null,null,null,null,null,null,null,null,null,1,0,0,97312.24]
[null,"CHIHUAHUA","MOHB751008LK5","MOHB751008MMNNRL03","BLANCA ESTELA MONTAÑEZ HERNANDEZ","00XXX0000X",null,null,null,1,0,0,null,null,null,null,null,null,null,null,null,1,0,0,79957.03]
[null,"CHIHUAHUA","PALU750621U84","PAXL750621HCHLXS05","LUIS ENRIQUE PALACIOS","00XXX0000X",null,null,null,1,0,0,null,null,null,null,null,null,null,null,null,1,0,0,88707.46]
[null,"CHIHUAHUA","QUEG630216GA8","QUEG630216MCHXSR02","GRACIELA QUIÑONEZ ESTRADA","00XXX0000X",null,null,null,null,null,null,null,null,null,null,null,null,1,0,0,1,0,0,66459.899999999994]
[null,"CHIHUAHUA","SAWV80120227A","SAWV801202MCLNLV05","VIVIANA SANCHEZ WILLIAMS","00XXX0000X",null,null,null,null,null,null,null,null,null,null,null,null,1,0,0,1,0,0,66459.899999999994]
[null,"CHIHUAHUA","VARM7910137D6","VARM791013MCHLMR03","MARISOL VALLES RAMOS","00XXX0000X",null,null,null,1,0,0,null,null,null,null,null,null,null,null,null,1,0,0,85085.71]
[null,"CHIHUAHUA","AOCF590913PU5","AOCF590913HCHCNL08","FLAVIO FILOMENO ACOSTA CANO DE LOS RIOS","00XXX0000X",null,null,null,null,null,null,null,null,null,null,null,null,1,0,0,1,0,0,236416.25999999998]
[null,"CHIHUAHUA","AAGE900717365","AAGE900717MCHZZL09","ELIZABETH AZAETA GUZMAN","00XXX0000X",null,null,null,1,0,0,null,null,null,null,null,null,null,null,null,1,0,0,65383.959999999992]
[null,"CHIHUAHUA","CAMH8103197WA","CAMH810319HCHRRG06","HUGO ALBERTO CARMONA MORA","00XXX0000X",null,null,null,null,null,null,null,null,null,null,null,null,1,0,0,1,0,0,75764.28]
[null,"CHIHUAHUA","DUCD810810J24","DUCD810810MCHRRN06","DANISSA DURAN CARO","00XXX0000X",null,null,null,1,0,0,null,null,null,null,null,null,null,null,null,1,0,0,98561.43]
[null,"CHIHUAHUA","FEPD840911LH2","FEPD840911MCHRZN04","DENISSE JANETT FERNANDEZ PAEZ","00XXX0000X",null,null,null,1,0,0,null,null,null,null,null,null,null,null,null,1,0,0,76556.27]
[null,"CHIHUAHUA","GACS670112I53","GACS670112MCHRHN02","SANDRA MARGARITA GARCIA CHAVEZ","00XXX0000X",null,null,null,1,0,0,null,null,null,null,null,null,null,null,null,1,0,0,117224.02]
[null,"CHIHUAHUA","GARG760607HY8","GARG760607HCHSMS07","GUSTAVO ALONSO GASCA RAMIREZ ","00XXX0000X",null,null,null,null,null,null,null,null,null,null,null,null,1,0,0,1,0,0,75764.28]
[null,"CHIHUAHUA","LAAC860420JE7","LAAC860420MCHBPL04","CLAUDIA PATRICIA LABRADO APARICIO","00XXX0000X",null,null,null,1,0,0,null,null,null,null,null,null,null,null,null,1,0,0,70597.780000000013]
[null,"CHIHUAHUA","LORC551120FV3","LORC551120HCHYDR08","CARLOS JAVIER LOYA RODRIGUEZ","00XXX0000X",null,null,null,null,null,null,null,null,null,null,null,null,1,0,0,1,0,0,75764.28]
[null,"CHIHUAHUA","MADY940205DA8","MADY940205MCHRMR02","YARITZA IVONNE MARQUEZ DOMINGUEZ","00XXX0000X",null,null,null,1,0,0,null,null,null,null,null,null,null,null,null,1,0,0,23133.119999999999]
[null,"CHIHUAHUA","MEFL841115AN9","MEFL841115MCHDRZ02","LIZETH MEDRANO FIERRO","00XXX0000X",null,null,null,1,0,0,null,null,null,null,null,null,null,null,null,1,0,0,26069.040000000001]
[null,"CHIHUAHUA","MOSF7009259L5","MOSF700925HCHRTR02","FERNANDO ALBERTO MORA SOTO","00XXX0000X",null,null,null,1,0,0,null,null,null,null,null,null,null,null,null,1,0,0,124384.97999999998]
[null,"CHIHUAHUA","PAMA800623I22","PAMA800623MDGDRL02","PADILLA MARQUEZ ALICIA","00XXX0000X",null,null,null,1,0,0,null,null,null,null,null,null,null,null,null,1,0,0,69664.66]
[null,"CHIHUAHUA","PEGC781114HZ3","PEGC781114HCHRRS06","CESAR VALENTE PEREA GARCIA ","00XXX0000X",null,null,null,1,0,0,null,null,null,null,null,null,null,null,null,1,0,0,42937.720000000008]
[null,"CHIHUAHUA","RAMJ770419E96","RAMJ770419HSPMRS01","JESUS ALFONSO RAMIREZ MARRUFO","00XXX0000X",null,null,null,1,0,0,null,null,null,null,null,null,null,null,null,1,0,0,96082.91]
[null,"CHIHUAHUA","ROMF8411116Z4","ROMF841111MCHJXR01","FARINA ROJAS MUÑOZ","00XXX0000X",null,null,null,1,0,0,null,null,null,null,null,null,null,null,null,"1",0,0,39048.839999999997]
[null,"CHIHUAHUA","SACP740829IP4","SACP740829MCHLNL05","PILAR ALICIA SALAZAR CONTRERAS","00XXX0000X",null,null,null,1,0,0,null,null,null,null,null,null,null,null,null,1,0,0,80207.25]
[null,"CHIHUAHUA","SIRS640927FF8","SIRS640927MCHLDL09","SILVIA SILVA RODRIGUEZ ","00XXX0000X",null,null,null,0,0,1,null,null,null,null,null,null,null,null,null,0,0,1,73993.98]
[null,"CHIHUAHUA","VARS761230AZ5","VARS761230MCHLML03","VALENZUELA RAMIREZ SILVIA CAROLINA","00XXX0000X",null,null,null,1,0,0,null,null,null,null,null,null,null,null,null,1,0,0,59436.58]
[null,"CHIHUAHUA","VAGP6007013D4","VAGP600701MCHLNT09","PATRICIA RAQUEL VALVERDE GONZALEZ","00XXX0000X",null,null,null,1,0,0,null,null,null,null,null,null,null,null,null,1,0,0,128647.44]
[null,"CHIHUAHUA","RAPE620309J41","RAPE620309HCHYRN08","ENRIQUE RAY PORTILLO","00XXX0000X",null,null,null,0,0,1,null,null,null,null,null,null,null,null,null,0,0,1,66066.720000000001]
[null,"Total Personas : ",831,null,null,null,null,null,null,null,null,null,null,null,null,null,null,null,null,null,null,"Total Recursos Ejercidos:",null,null,{"$f":"SUM(Tabla11[Columna24])","v":31374385.246999979}]

{"sheet":"II C y 1_","index":6,"n_rows":852,"n_cols":22,"rows_kept":852,"cut":false,"hidden":false,"merged":[[8,1,8,8],[846,18,846,19],[11,21,12,21],[11,8,12,8],[11,9,11,15],[11,16,12,16],[11,17,12,17],[11,20,12,20],[11,18,11,19],[11,2,12,2],[11,1,12,1],[11,7,12,7],[11,6,12,6],[11,5,12,5],[11,4,12,4],[11,3,12,3]]}
[]
[]
[]
[]
[]
[]
[]
[null,"Formato: Personal Federalizado por Registro Federal de Contribuyentes"]
[null,{"$f":"IF('1'!D22=\"Elige el Periodo…\",\"\",'1'!D22)","v":"Fondo de Aportaciones para la Educación Tecnológica y de Adultos/Colegio Nacional de Educación Profesional Técnica (FAETA/CONALEP)"},null,null,null,null,null,null,null,null,null,null,null,null,null,null,null,null,null,null,"2do. Trimestre 2020"]
[]
[]
[null,"Entidad Federativa","Clave CT","Turno","RFC","CURP","Nombre","Funcion Real","Horas que labora en el Centro de Trabajo","Clave Presupuestal",null,null,null,null,null,null,"Tipo de Categoría","Identificador de Contrato de Honorarios","Periodo de efecto de pago en el trimestre",null,"Percepciones pagadas en el Periodo de Comisión con Presupuesto Federal*","Percepciones pagadas en el Periodo de Comisión con Presupuesto de otra fuente*"]
[null,null,null,null,null,null,null,null,null,"Partida Presupuestal","Código de Pago","Clave de Unidad","Clave de Sub Unidad","Clave de Categoría","Horas Semana Mes ","Número de Plaza",null,null,"Inicial","Termino"]
[]
[null,"Columna1","Columna2","Columna3","Columna4","Columna5","Columna6","Columna7","Columna8","Columna9","Columna10","Columna11","Columna12","Columna13","Columna14","Columna15","Columna16","Columna17","Columna18","Columna19","Columna20","Columna21"]
[null,"CHIHUAHUA","08DPT0001C",120,"AEEF700614J96","AEEF700614HCHLNR00","JOSE FRANCISCO ALDERETE ENRIQUEZ","20108",480,83101,1003,"00",25,"CF33206",0,13641,2,null,20200401,20200630,124952.32000000002,0]
[null,"CHIHUAHUA","08DPT0001C",120,"CACM660522B70","CACM660522HCHNHR08","MARIO RUBEN CANO CHEW","20108",480,83101,1003,"00",25,"CF33206",0,10185,2,null,20200401,20200630,79779.760000000009,0]
[null,"CHIHUAHUA","08DPT0001C",120,"DEMS680803PI5","DEMS680803MCHLXN06","SANDRA DELGADO MUÑOZ","20108",480,83101,1003,"01",25,"CD3206",0,13184,2,null,20200401,20200630,91391.940000000017,0]
[null,"CHIHUAHUA","08DPT0001C",120,"DIAM641007CI5","DIAM641007HCHZCN00","MANUEL DIAZ ACOSTA","20402",480,83101,1003,"00",25,"CF19201",0,2416,2,null,20200401,20200630,40550.6,0]
[null,"CHIHUAHUA","08DPT0001C",120,"FEPH590719P2A","FEPH590719MCHRRR08","HORTENSIA FERNANDEZ PARGA","20401",480,83101,1003,"00",25,"S01202",0,2408,2,null,20200401,20200630,38103.11,0]
[null,"CHIHUAHUA","08DPT0001C",120,"GADE730513AY2","GADE730513HCHRZL06","ELIAS GARCIA DIAZ","20401",480,83101,1003,"00",25,"A03202",0,2375,2,null,20200401,20200630,46435.890000000007,0]
[null,"CHIHUAHUA","08DPT0001C",120,"GAVL610223PN1","GAVL610223MGTRLN08","LEONOR GARZON VALDEZ","50401",480,83101,1003,"00",25,"CF02103",0,12557,5,null,20200401,20200630,85992.48000000001,0]
[null,"CHIHUAHUA","08DPT0001C",120,"GOBS630720GU7","GOBS630720MCHNLL02","SILVIA CECILIA GONZALEZ BALDERRAMA","20401",480,83101,1003,"00",25,"S01202",0,2415,2,null,20200401,20200630,36201.17,0]
[null,"CHIHUAHUA","08DPT0001C",120,"GUSL800307M72","GUSL800307MCHTNL01","LILIANA GUTIERREZ SANDOVAL","20401",480,83101,1003,"00",25,"S01201",0,2391,2,null,20200401,20200630,35249.61,0]
[null,"CHIHUAHUA","08DPT0001C",120,"HEMM670602FX4","HEMM670602HCHRRL08","MELCHOR HERNANDEZ MORALES",20108,480,83101,1003,"00",25,"CF33206",0,13189,2,null,20200401,20200630,33928.83,0]
[null,"CHIHUAHUA","08DPT0001C",200,"IAAM650713G14","IAAM650713HCLBRR06","MARTIN GENARO IBARRA ARREDONDO","20401",480,83101,1003,"00",25,"S01201",0,2374,2,null,20200401,20200630,130057.9,0]
[null,"CHIHUAHUA","08DPT0001C",200,"JUVD951202BR4","JUVD951202HCHRLN06","DANIEL FRANCISCO JUAREZ VILLALOBOS","20402",480,83101,1003,"02",25,"S01201",0,2398,2,null,20200401,20200630,30847.510000000002,0]
[null,"CHIHUAHUA","08DPT0001C",120,"JUGA720809R10","JUGA720809MCHRRL05","ALMA VERONICA JURADO GARCIA","20401",480,83101,1003,"03",25,"S01201",0,2410,2,null,20200401,20200630,32895.710000000006,0]
[null,"CHIHUAHUA","08DPT0001C",120,"LOCS740722BY1","LOCS740722MCHYSN03","SANDRA LOYA CASTAÑEDA","20215",480,83101,1003,"00",25,"CF33202",0,2367,2,null,20200401,20200630,29956.31,0]
[null,"CHIHUAHUA","08DPT0001C",120,"LOLG6105041C1","LOLG610504HCHZPR03","GERARDO LOZANO LOPEZ","20216",480,83101,1003,"00",25,"CF34202",0,2415,2,null,20200401,20200630,52371.45,0]
[null,"CHIHUAHUA","08DPT0001C",120,"MASS920625T67","MASS920625MCHNTT05","STEPHANIE MANCHA SOTO",20401,480,83101,1003,"00",25,"S01201",0,7502,2,null,20200401,20200630,46883.05000000001,0]
[null,"CHIHUAHUA","08DPT0001C",120,"MACN5607036J8","MACN560703MCHRHR01","NORMA MARGARITA MARRUFO CHAPARRO","20105",480,83101,1003,"00",25,"CF33206",0,11000,2,null,20200401,20200630,35310.89,0]
[null,"CHIHUAHUA","08DPT0001C",200,"MERA640505HY3","MERA640505HCHNYR01","ARMANDO MENDEZ REYES",20401,480,83101,1003,"00",25,"CF18201",0,2389,2,null,20200401,20200630,110745.45999999999,0]
[null,"CHIHUAHUA","08DPT0001C",120,"MOAP870129UT9","MOAP870129MCHLCT09","PATRICIA ARALI MOLINA ACOSTA","20401",480,83101,1003,"00",25,"CF33204",0,2392,2,null,20200401,20200630,30772.310000000005,0]
[null,"CHIHUAHUA","08DPT0001C",120,"MOTJ521007RU5","MOTJ521007HCHRRS02","JESUS ALBERTO MORENO TORRES","20215",480,83101,1003,"00",25,"A03202",0,2373,2,null,20200401,20200630,65539.83,0]
[null,"CHIHUAHUA","08DPT0001C",120,"NAOG680625QA5","NAOG680625HCHRRL00","GUILLERMO NICOLAS NARVAEZ ORDAZ","20212",480,83101,1003,"00",25,"CF18203",0,2397,2,null,20200401,20200630,45362.670000000006,0]
[null,"CHIHUAHUA","08DPT0001C",120,"NAWA860622JI6","NAWA860622HCHVGL05","ALEJANDRO MAURICIO NAVARRO WAGNER","20105",480,83101,1003,"00",25,"CF02105",0,12821,5,null,20200401,20200630,50541.409999999996,0]
[null,"CHIHUAHUA","08DPT0001C",120,"PIRE860510KC2","PIRE860510HCHZBS00","PIZANO RUBIO ESTALI",20401,480,83101,1003,"00",25,"S01201",0,10161,2,null,20200401,20200630,66459.899999999994,0]
[null,"CHIHUAHUA","08DPT0001C",200,"PODM630929V60","PODM630929HCHRZG02","MIGUEL PORTILLO DIAZ","20104",480,83101,1003,"00",25,"T08201",0,10784,2,null,20200401,20200630,30665.337000000003,0]
[null,"CHIHUAHUA","08DPT0001C",200,"QUHM750313QX2","QUHM750313HZSNZN02","MANUEL QUINTERO HUIZAR",20401,480,83101,1003,"01",25,"CF18201",0,11868,2,null,20200401,20200630,42125.010000000009,0]
[null,"CHIHUAHUA","08DPT0001C",120,"RAGN6608306N3","RAGN660830MCHMMR01","NORMA RAMIREZ GOMEZ","20206",480,83101,1003,"00",25,"CF04201",0,5255,2,null,20200401,20200630,29680.270000000004,0]
[null,"CHIHUAHUA","08DPT0001C",120,"REMV840531384","REMV840531HCHYRC03","VICTOR MANUEL REYES MURILLO","20104",480,83101,1003,"00",25,"CF33204",0,2384,2,null,20200401,20200630,51144.709999999992,0]
[null,"CHIHUAHUA","08DPT0001C",120,"REOS610731NK2","REOS610731MCHZLL01","SILVIA PATRICIA REZA OLIVAS","20102",480,83101,1003,"00",25,"CF33206",0,13184,2,null,20200401,20200630,67708.739999999991,0]
[null,"CHIHUAHUA","08DPT0001C",120,"ROCG710423BI2","ROCG710423MCHDNL05","GILDA ALEJANDRINA RODRIGUEZ CANO","20215",480,83101,1003,"00",25,"CF34201",0,2376,2,null,20200401,20200630,46860.259999999987,0]
[null,"CHIHUAHUA","08DPT0001C",200,"ROVB9202105WA","ROVB920210HCHDLR05","BRYAN ARMANDO RODRIGUEZ VALVERDE","20401",480,83101,1003,"00",25,"S01201",0,2394,2,null,20200401,20200630,30363.820000000003,0]
[null,"CHIHUAHUA","08DPT0001C",120,"RUDA711227IH4","RUDA711227HCHLLR08","ARTURO RUELAS DELGADO",20108,480,83101,1003,"00",25,"CF33206",0,14134,2,null,20200401,20200630,83706.86,0]
[null,"CHIHUAHUA","08DPT0001C",120,"SOPF600927M49","SOPF600927MCHTRR08","FERNANDA SOTELO PEREZ","20402",480,83101,1003,"00",25,"CF34202",0,2405,2,null,20200401,20200630,39631.74,0]
[null,"CHIHUAHUA","08DPT0001C",120,"TOEB620314DK2","TOEB620314HCHRNR09","BERNARDO TORRES ENRIQUEZ","20401",480,83101,1003,"00",25,"S01202",0,2401,2,null,20200401,20200630,41591.850000000006,0]
[null,"CHIHUAHUA","08DPT0001C",200,"TOLF901203UG1","TOLF901203HCHRZR07","FRANCISCO JAVIER TORRES LOZOYA","20401",480,83101,1003,"00",25,"S01201",0,2378,2,null,20200401,20200630,29680.270000000004,0]
[null,"CHIHUAHUA","08DPT0001C",120,"VAAH770519CJ9","VAAH770519HCHZRC04","HECTOR MANUEL VAZQUEZ ARMENDARIZ","20401",480,83101,1003,"00",25,"CF18201",0,2374,2,null,20200401,20200630,32634.06,0]
[null,"CHIHUAHUA","08DPT0001C",120,"VIRC720302LS1","VIRC720302MCHLVR06","MARIA CRISTINA VILLAGRAN RIVERA","20215",480,83101,1003,"00",25,"CF21202",0,2381,2,null,20200401,20200630,51144.709999999992,0]
[null,"CHIHUAHUA","08DPT0001C",120,"VIJD921113BZ7","VIJD921113HCHLRG00","DIEGO EMMANUEL VILLALBA JUAREZ","20105",480,83101,1003,"00",25,"CF33204",0,2385,2,null,20200401,20200630,66247.720000000016,0]
[null,"CHIHUAHUA","08DPT0001C",100,"AOZL821127LL7","AOZL821127HCHCVS03","LUIS ALBERTO ACOSTA ZAVALA",30102,120,83101,1001,"00",25,"E3725","10.0",0,3,null,20200401,20200630,15151.5,0]
[null,"CHIHUAHUA","08DPT0001C",200,"AUAJ750122A5A","AUAJ750122HCHGGS03","JESUS AGUILAR AGUILAR",30102,120,83101,1001,"00",25,"E3725",10,0,3,null,20200401,20200630,15151.5,0]
[null,"CHIHUAHUA","08DPT0001C",100,"AULE8612293K4","AULE861229MCHGRL05","AGUIRRE LOERA ELDA EUNICE",30102,216,83101,1001,"00",25,"E3711",18,0,3,null,20200401,20200630,21027.599999999999,0]
[null,"CHIHUAHUA","08DPT0001C",200,"AAMF560125R89","AAMF560125HCHLNL07","FLAVIO RAUL  ALVAREZ MONTOYA",30102,240,83101,1001,"00",25,"E3725",20,0,3,null,20200401,20200630,30303,0]
[null,"CHIHUAHUA","08DPT0001C",100,"AATL801210PB4","AATL801210MCHLNR06","LOURDES ADRIANA ALVAREZ TINTTORI",30102,180,83101,1001,"00",25,"E3725",15,0,3,null,20200401,20200630,22727.280000000002,0]
[null,"CHIHUAHUA","08DPT0001C",100,"AIOM820517TC5","AIOM820517MCHVLR08","MARIANA AVILA  OLIVAS",30102,240,83101,1001,"00",25,"E3725",20,0,3,null,20200401,20200630,30303,0]
[null,"CHIHUAHUA","08DPT0001C",100,"AAGJ821023VC5","AAGJ821023MCHZZS17","JESSICA CORAL AZAETA GUZMAN",30102,216,83101,1001,"00",25,"E3713",18,0,3,null,20200401,20200630,23633.1,0]
[null,"CHIHUAHUA","08DPT0001C",120,"BAFR630210M78","BAFR630210HCHQRC02","RICARDO BAQUERA  FRESCAS",30102,240,83101,1001,"00",25,"E3713",20,0,3,null,20200401,20200630,26259,0]
[null,"CHIHUAHUA","08DPT0001C",100,"BAAA801202930","BAAA801202HCHRLL09","ALBERTO GUERRERO BARRAZA ALVAREZ",30102,240,83101,1001,"00",25,"E3725","20.0",0,3,null,20200401,20200630,30303,0]
[null,"CHIHUAHUA","08DPT0001C",100,"BURS661015RT6","BURS661015HCHSSL07","SALVADOR  BUSTILLOS RASCON",30102,144,83101,1001,"00",25,"E3725","12.0",0,3,null,20200401,20200630,18181.8,0]
[null,"CHIHUAHUA","08DPT0001C",100,"CAAM640422S63","CAAM640422MCHMRR08","MARTHA LETICIA CAMPOS ARISMENDI",30102,216,83101,1001,"00",25,"E3725","18.0",0,3,null,20200401,20200630,27272.7,0]
[null,"CHIHUAHUA","08DPT0001C",200,"CARG7105218G9","CARG710521HCHMMR07","GERARDO CAMPOS RAMIREZ",30102,180,83101,1001,"00",25,"E3725",15,0,3,null,20200401,20200630,22727.280000000002,0]
[null,"CHIHUAHUA","08DPT0001C",100,"CASR730827BZ2","CASR730827HCHNTM09","RAMON ARMANDO CANO SOTO",30102,180,83101,1001,"00",25,"E3713",15,0,3,null,20200401,20200630,19694.280000000002,0]
[null,"CHIHUAHUA","08DPT0001C",100,"CABA600225IW2","CABA600225MCHRRR09","ARACELI CARRASCO BARRAZA",30102,180,83101,1001,"00",25,"E3725",15,0,3,null,20200401,20200630,22727.280000000002,0]
[null,"CHIHUAHUA","08DPT0001C",100,"CAON860317HL0","CAON860317MCHRCL00","NALLELY  YESENIA CARRASCO OCHOA",30102,108,83101,1001,"00",25,"E3725","9.0",0,3,null,20200401,20200630,13636.38,0]
[null,"CHIHUAHUA","08DPT0001C",120,"CAJM671130A58","CAJM671130HCHRRR04","MAURO GERARDO CARRILLO JUAREZ",30102,228,83101,1001,"00",25,"E3713","19.0",0,3,null,20200401,20200630,24946.080000000002,0]
[null,"CHIHUAHUA","08DPT0001C",120,"CAAI5611206JA","CAAI561120MCHSRD05","IDELIA CASTRO ARMENDARIZ",30102,240,83101,1001,"00",25,"E3725","20.0",0,3,null,20200401,20200630,30303,0]
[null,"CHIHUAHUA","08DPT0001C",200,"CAFL660707EI1","CAFL660707MCHZLY06","LYDIA CAZARES  FLORES",30102,180,83101,1001,"00",25,"E3713","15.0",0,3,null,20200401,20200630,19694.280000000002,0]
[null,"CHIHUAHUA","08DPT0001C",200,"CEBE680921RL5","CEBE680921HCHNCL06","ELEAZAR  MATEO CENICEROS  BECERRA",30102,228,83101,1001,"00",25,"E3725","19.0",0,3,null,20200401,20200630,28787.879999999997,0]
[null,"CHIHUAHUA","08DPT0001C",200,"CEMC581222Q78","CEMC581222MCHRLL09","CLARA CERVANTES  MELENDEZ",30102,156,83101,1001,"00",25,"E3725","13.0",0,3,null,20200401,20200630,19696.980000000003,0]
[null,"CHIHUAHUA","08DPT0001C",200,"CAJF670208887","CAJF670208HCHHRR03","FERNANDO CHACON JURADO",30102,216,83101,1001,"00",25,"E3725","18.0",0,3,null,20200401,20200630,27272.7,0]
[null,"CHIHUAHUA","08DPT0001C",100,"CAGL640918UT9","CAGL640918MCHHMR07","MARIA DE LOURDES CHAVIRA GOMEZ",30102,180,83101,1001,"00",25,"E3725","15.0",0,3,null,20200401,20200630,22727.280000000002,0]
[null,"CHIHUAHUA","08DPT0001C",100,"CULT860821MM2","CULT860821MDFDGN17","TANIA CUADROS LUGO",30102,180,83101,1001,"00",25,"E3711","15.0",0,3,null,20200401,20200630,14602.5,0]
[null,"CHIHUAHUA","08DPT0001C",100,"DOTM5605051B1","DOTM560505MCHMRR05","MARGARITA DOMINGUEZ  TREVIZO",30102,144,83101,1001,"00",25,"E3725","12.0",0,3,null,20200401,20200630,18181.8,0]
[null,"CHIHUAHUA","08DPT0001C",200,"EARE580710MW7","EARE580710MDFRQL19","ELSA AMALIA ERRASQUIN  ROQUE",30102,180,83101,1001,"00",25,"E3725","15.0",0,3,null,20200401,20200630,18181.8,0]
[null,"CHIHUAHUA","08DPT0001C",100,"EOOC700117F69","EOOC700117HCHSRR08","CARLOS ESCOBEDO ORTEGA",30102,228,83101,1001,"00",25,"E3725","19.0",0,3,null,20200401,20200630,28787.879999999997,0]
[null,"CHIHUAHUA","08DPT0001C",100,"EACM621211KN0","EACM621211HCHSHR04","MARTIN ESPARZA  CHAVEZ",30102,216,83101,1001,"00",25,"E3725","18.0",0,3,null,20200401,20200630,27272.7,0]
[null,"CHIHUAHUA","08DPT0001C",100,"EADR661019BU9","EADR661019HCHSZM08","ESPARZA DIAZ RAMON",30102,132,83101,1001,"00",25,"E3713","11.0",0,3,null,20200401,20200630,14442.48,0]
[null,"CHIHUAHUA","08DPT0001C",200,"EILJ680419MG0","EILJ680419HCHSNR05","JORGE ALBERTO  ESPINOZA  LUNA",30102,192,83101,1001,"00",25,"E3725","16.0",0,3,null,20200401,20200630,24242.400000000001,0]
[null,"CHIHUAHUA","08DPT0001C",200,"FECA6103137A4","FECA610313HDFRLB09","ABELARDO FERNANDEZ  CALDERON",30102,216,83101,1001,"00",25,"E3713","18.0",0,3,null,20200401,20200630,23633.1,0]
[null,"CHIHUAHUA","08DPT0001C",200,"FOFL641113DP1","FOFL641113HCHLLS06","LUIS ALBERTO FLORES  FLORES",30102,240,83101,1001,"00",25,"E3725","20.0",0,3,null,20200401,20200630,30303,0]
[null,"CHIHUAHUA","08DPT0001C",100,"GAMR760920E78","GAMR760920MCHLNT06","RUTH GALLEGOS  MONARCA",30102,192,83101,1001,"00",25,"E3725","16.0",0,3,null,20200401,20200630,24242.400000000001,0]
[null,"CHIHUAHUA","08DPT0001C",200,"GAVF750826318","GAVF750826HCHLLR05","FRANCISCO AGUSTIN GALLEGOS  VILLASEÑOR",30102,120,83101,1001,"00",25,"E3725","10.0",0,3,null,20200401,20200630,15151.5,0]
[null,"CHIHUAHUA","08DPT0001C",100,"GALR830327972","GALR830327MCHRYS00","ROSA HERLINADA GARCIA LOYA",30102,180,83101,1001,"00",25,"E3725","15.0",0,3,null,20200401,20200630,22727.280000000002,0]
[null,"CHIHUAHUA","08DPT0001C",120,"GALJ810323DN3","GALJ810323HCHRZS03","JESUS SAUL GARCIA  LOZANO",30102,216,83101,1001,"00",25,"E3725","18.0",0,3,null,20200401,20200630,27272.7,0]
[null,"CHIHUAHUA","08DPT0001C",200,"GAMG821026JM8","GAMG821026HDGRRB08","GABINO GARCIA  MARRUFO",30102,240,83101,1001,"00",25,"E3725","20.0",0,3,null,20200401,20200630,30303,0]
[null,"CHIHUAHUA","08DPT0001C",120,"GAOM870316CN9","GAOM870316HCHRRG00","JOSE MIGUEL GARCIA ORTIZ",30102,240,83101,1001,"00",25,"E3725","20.0",0,3,null,20200401,20200630,30303,0]
[null,"CHIHUAHUA","08DPT0001C",100,"GAVV7810103W7","GAVV781010MCHRSR04","VERONICA GARDEA  VAZQUEZ",30102,240,83101,1001,"00",25,"E3725","20.0",0,3,null,20200401,20200630,30303,0]
[null,"CHIHUAHUA","08DPT0001C",200,"GOAC860518J59","GOAC860518HCHMVR06","CARLOS JOEL GOMEZ AVILA",30102,228,83101,1001,"00",25,"E3725","19.0",0,3,null,20200401,20200630,28787.879999999997,0]
[null,"CHIHUAHUA","08DPT0001C",120,"GOHS731228LU7","GOHS731228HCHNLM00","GONZALEZ HOLGUIN SIMON",30102,204,83101,1001,"00",25,"E3725","17.0",0,3,null,20200401,20200630,25757.58,0]
[null,"CHIHUAHUA","08DPT0001C",120,"HEAM7409112X6","HEAM740911MCHRRR00","MARCELA HERNANDEZ ARMENDARIZ",30102,180,83101,1001,"00",25,"E3725","15.0",0,3,null,20200401,20200630,22727.280000000002,0]
[null,"CHIHUAHUA","08DPT0001C",100,"HERA781214D5A","HERA781214HCHRMR02","AARON TERCERO HERNANDEZ ROMO",30102,216,83101,1001,"00",25,"E3725","18.0",0,3,null,20200401,20200630,27272.7,0]
[null,"CHIHUAHUA","08DPT0001C",120,"HESM4812063X7","HESM481206HDFRGR09","MARIO HERNANDEZ SEGURA",30102,240,83101,1001,"00",25,"E3725","20.0",0,3,null,20200401,20200630,30303,0]
[null,"CHIHUAHUA","08DPT0001C",120,"HEMB811018BN2","HEMB811018MCHRNT06","BEATRIZ ELENA HERRERA  MENDOZA",30102,216,83101,1001,"00",25,"E3725",18,0,3,null,20200401,20200630,27272.7,0]
[null,"CHIHUAHUA","08DPT0001C",100,"JIVG670122BN0","JIVG670122HCHMLD01","GAUDENCIO JIMENEZ VALENTIN",30102,240,83101,1001,"00",25,"E3725","20.0",0,3,null,20200401,20200630,30303,0]
[null,"CHIHUAHUA","08DPT0001C",120,"LESO760401T71","LESO760401HCHLXM07","OMAR LEAL SEAÑEZ",30102,108,83101,1001,"00",25,"E3725","9.0",0,3,null,20200401,20200630,13636.38,0]
[null,"CHIHUAHUA","08DPT0001C",100,"LOGM811218IW7","LOGM811218MCHRNY01","MYRNA GUADALUPE LOERA GONZALEZ",30102,240,83101,1001,"00",25,"E3725","20.0",0,3,null,20200401,20200630,30303,0]
[null,"CHIHUAHUA","08DPT0001C",200,"LOMM630709QH3","LOMM630709MCHPRR06","MIRIAM LOPEZ  MARQUEZ",30102,192,83101,1001,"00",25,"E3725",16,0,3,null,20200401,20200630,24242.400000000001,0]
[null,"CHIHUAHUA","08DPT0001C",200,"LOCJ610711AFA","LOCJ610711HCHYHV06","JAVIER BENJAMIN LOYA CHAVIRA",30102,216,83101,1001,"00",25,"E3725","18.0",0,3,null,20200401,20200630,27272.7,0]
[null,"CHIHUAHUA","08DPT0001C",200,"LOHL711219AQ3","LOHL711219MCHYRL02","LILIANA IVONNE LOYA  HERNANDEZ",30102,180,83101,1001,"00",25,"E3725","15.0",0,3,null,20200401,20200630,22727.280000000002,0]
[null,"CHIHUAHUA","08DPT0001C",100,"MAGP631129C83","MAGP631129HCHRNR03","PERFECTO MARQUEZ GONZALEZ",30102,216,83101,1001,"00",25,"E3713","18.0",0,3,null,20200401,20200630,23633.1,0]
[null,"CHIHUAHUA","08DPT0001C",200,"MACC861013NB9","MACC861013HCHRLR03","CARLOS ISAAC MARRUFO CALDERON",30102,180,83101,1001,"00",25,"E3725","15.0",0,3,null,20200401,20200630,22727.280000000002,0]
[null,"CHIHUAHUA","08DPT0001C",200,"MEPP891226PB1","MEPP891226MCHNZT02","PATSY MENDEZ PAZ",30102,156,83102,1001,"00",25,"E3711","13.0",0,3,null,20200401,20200630,15186.6,0]
[null,"CHIHUAHUA","08DPT0001C",200,"MEMM770410518","MEMM770410HCHRNN08","MANUEL MERAZ MENDEZ",30102,192,83101,1001,"00",25,"E3725","16.0",0,3,null,20200401,20200630,24242.400000000001,0]
[null,"CHIHUAHUA","08DPT0001C",100,"MURE810806BI4","MURE810806HCHXJM09","MUÑOZ ROJAS EMMANUEL",30102,240,83101,1001,"00",25,"E3725","20.0",0,3,null,20200401,20200630,30303,0]
[null,"CHIHUAHUA","08DPT0001C",100,"NAME521010PW5","NAME521010HCHVNN03","ENRIQUE NAVARRO MENDOZA",30102,240,83101,1001,"00",25,"E3725","20.0",0,3,null,20200401,20200630,30303,0]
[null,"CHIHUAHUA","08DPT0001C",200,"OIAO791026IM2","OIAO791026HCHLPS00","OSCAR ERNESTO OLIVAS APONTE",30102,120,83101,1001,"00",25,"E3725","10.0",0,3,null,20200401,20200630,15151.5,0]
[null,"CHIHUAHUA","08DPT0001C",120,"OEZH720627D54","OEZH720627HCHRBG04","HUGO ORTEGA ZUBIATE",30102,180,83101,1001,"00",25,"E3725","15.0",0,3,null,20200401,20200630,22727.280000000002,0]
[null,"CHIHUAHUA","08DPT0001C",200,"PARM520707MY1","PARM520707HPLLCG03","MIGUEL ANGEL PALMA ROCHA",30102,96,83101,1001,"00",25,"E3711","8.0",0,3,null,20200401,20200630,9345.6,0]
[null,"CHIHUAHUA","08DPT0001C",100,"PAGM7008098P1","PAGM700809HCHRRR01","MAURO RUBEN PARADA GRANADOS",30102,96,83101,1001,"00",25,"E3725","8.0",0,3,null,20200401,20200630,12121.2,0]
[null,"CHIHUAHUA","08DPT0001C",120,"PARF590815ED3","PARF590815MVZVSL20","FELICITAS  PAVON ROSAS",30102,180,83101,1001,"00",25,"E3713","15.0",0,3,null,20200401,20200630,19694.280000000002,0]
[null,"CHIHUAHUA","08DPT0001C",100,"PAVE830228SH0","PAVE830228HCHZLN00","ENRIQUE PAZOS VALLES",30102,240,83101,1001,"00",25,"E3713",20,0,3,null,20200401,20200630,26259,0]
[null,"CHIHUAHUA","08DPT0001C",200,"PECA750727I8A","PECA750727HJCRRL03","ALEJANDRO PEREZ CORTES",30102,180,83101,1001,"00",25,"E3725","15.0",0,3,null,20200401,20200630,22727.280000000002,0]
[null,"CHIHUAHUA","08DPT0001C",200,"PICN620328PA0","PICN620328HVZNRR07","JOSE NORBERTO PINEDA CRUZ",30102,144,83101,1001,"00",25,"E3725",12,0,3,null,20200401,20200630,18181.8,0]
[null,"CHIHUAHUA","08DPT0001C",100,"PIRL7804262E7","PIRL780426MCHXZZ09","MARIA LIZETH PIÑON RUIZ",30102,240,83101,1001,"00",25,"E3725","20.0",0,3,null,20200401,20200630,30303,0]
[null,"CHIHUAHUA","08DPT0001C",200,"QURM640822CE7","QURM640822MCHNZR02","MARTINA LILIA QUINTANA  RUIZ",30102,240,83101,1001,"00",25,"E3725","20.0",0,3,null,20200401,20200630,30303,0]
[null,"CHIHUAHUA","08DPT0001C",200,"RAGG600206G85","RAGG600206MCHMTR04","GRACIELA RAMIREZ  GUTIERREZ",30102,168,83101,1001,"00",25,"E3725","14.0",0,3,null,20200401,20200630,21212.1,0]
[null,"CHIHUAHUA","08DPT0001C",120,"RAMA741011N9A","RAMA741011MCHMRN00","ANABEL RAMOS  MORALES",30102,180,83101,1001,"00",25,"E3725","15.0",0,3,null,20200401,20200630,22727.280000000002,0]
[null,"CHIHUAHUA","08DPT0001C",200,"RARN711008BK5","RARN711008MCHSMR09","NORMA PATRICIA RASCON RAMIREZ",30102,204,83101,1001,"00",25,"E3725","17.0",0,3,null,20200401,20200630,25757.58,0]
[null,"CHIHUAHUA","08DPT0001C",100,"RECN560808KM6","RECN560808MCHYRR00","MARIA NORMA REYES CARREON",30102,192,83101,1001,"00",25,"E3725",16,0,3,null,20200401,20200630,24242.400000000001,0]
[null,"CHIHUAHUA","08DPT0001C",100,"REOL730620M72","REOL730620MCHYRC05","LUCIA REYES ORTIZ",30102,240,83101,1001,"00",25,"E3725","20.0",0,3,null,20200401,20200630,30303,0]
[null,"CHIHUAHUA","08DPT0001C",200,"RIMI820220GQ7","RIMI820220HCHVCV02","RIVERA MACIAS IVAN JOEL",30102,180,83101,1001,"00",25,"E3725",15,0,3,null,20200401,20200630,22727.280000000002,0]
[null,"CHIHUAHUA","08DPT0001C",100,"ROSL660422DP2","ROSL660422HCHDLZ09","MARIA DE LA LUZ  RODARTE  SOLIS",30102,180,83101,1001,"00",25,"E3725","15.0",0,3,null,20200401,20200630,22727.280000000002,0]
[null,"CHIHUAHUA","08DPT0001C",100,"ROAA871025FU9","ROAA871025HCHDGL07","ALBERTO RODRIGUEZ AGUIRRE",30102,240,83101,1001,"00",25,"E3713","20.0",0,3,null,20200401,20200630,26259,0]
[null,"CHIHUAHUA","08DPT0001C",120,"ROGJ6301201E0","ROGJ630120MCHDZS08","MARIA DE JESUS RODRIGUEZ GUZMAN",30102,240,83101,1001,"00",25,"E3725","20.0",0,3,null,20200401,20200630,30303,0]
[null,"CHIHUAHUA","08DPT0001C",100,"ROAL730412EQ6","ROAL730412HCHJRS01","LUIS JAVIER ROJAS ARAGONEZ",30102,240,83101,1001,"00",25,"E3725","20.0",0,3,null,20200401,20200630,30303,0]
[null,"CHIHUAHUA","08DPT0001C",200,"ROPV750812QL5","ROPV750812HCHMCC00","VICTOR MANUEL ROMERO PACHECO",30102,144,83101,1001,"00",25,"E3713","12.0",0,3,null,20200401,20200630,15755.4,0]
[null,"CHIHUAHUA","08DPT0001C",200,"ROTO850629550","ROTO850629HCHNRS06","OSCAR ARMANDO RONQUILLO TERAN ",30102,180,83101,1001,"00",25,"E3713",15,0,3,null,20200401,20200630,19694.280000000002,0]
[null,"CHIHUAHUA","08DPT0001C",120,"ROVI820310797","ROVI820310MCLNLV07","IVAN RAMON RONQUILLO VILLALBA",30102,240,83101,1001,"00",25,"E3725","20.0",0,3,null,20200401,20200630,30303,0]
[null,"CHIHUAHUA","08DPT0001C",100,"RUNH860818SE6","RUNH860818HCHBJM07","HUMERTO ALONSO RUBIO NAJERA",30102,120,83101,1001,"00",25,"E3711","10.0",0,3,null,20200401,20200630,11682,0]
[null,"CHIHUAHUA","08DPT0001C",100,"RUMS740226UR4","RUMS740226MCHZRL09","MARIA SOLEDAD RUIZ MARQUEZ",30102,180,83101,1001,"00",25,"E3725","15.0",0,3,null,20200401,20200630,22727.280000000002,0]
[null,"CHIHUAHUA","08DPT0001C",100,"SAQG720512BW2","SAQG720512MCHNXD07","GUADALUPE   SAENZ  QUIÑONEZ",30102,240,83101,1001,"00",25,"E3725",20,0,3,null,20200401,20200630,30303,0]
[null,"CHIHUAHUA","08DPT0001C",120,"SIML5803182A8","SIML580318HCHLJS14","JOSE LUIS CARLOS SILVEYRA MEJIA",30102,240,83101,1001,"00",25,"E3725",20,0,3,null,20200401,20200630,30303,0]
[null,"CHIHUAHUA","08DPT0001C",200,"TAAD800122GU1","TAAD800122HCHRRL07","DELFINO TARIN ARMENDARIZ",30102,144,83101,1001,"00",25,"E3725","12.0",0,3,null,20200401,20200630,18181.8,0]
[null,"CHIHUAHUA","08DPT0001C",100,"UIOM910617AH6","UIOM910617MCHRRR00","URIZA ORTIZ MARIBEL",30102,204,83101,1001,"00",25,"E3725","17.0",0,3,null,20200401,20200630,25757.58,0]
[null,"CHIHUAHUA","08DPT0001C",200,"VACA610212RT2","VXCA610212HCHLHD03","ADOLFO VALLES  CHAVEZ",30102,180,83101,1001,"00",25,"E3725","15.0",0,3,null,20200401,20200630,22727.280000000002,0]
[null,"CHIHUAHUA","08DPT0001C",100,"VADS631230CN3","VADS631230MCHLVL06","SILVIA LETICIA VALVERDE DAVILA",30102,240,83101,1001,"00",25,"E3725",20,0,3,null,20200401,20200630,30303,0]
[null,"CHIHUAHUA","08DPT0001C",100,"VIRR710926945","VIRR710926HCHLDB12","RUBEN   VILLALOBOS RODRIGUEZ",30102,240,83101,1001,"00",25,"E3725","20.0",0,3,null,20200401,20200630,30303,0]
[null,"CHIHUAHUA","08DPT0001C",200,"VIPR570927K44","VIPR570927HCHLYF07","RAFAEL JESUS VILLEGAS PAYAN",30102,240,83101,1001,"00",25,"E3725","20.0",0,3,null,20200401,20200630,30303,0]
[null,"CHIHUAHUA","08DPT0002B",200,"AARL701222GC6","AARL701222MCHRVB04","LIBIA GABRIELA ARAGON RIVERA",30102,240,83101,1001,"00",26,"E3725",20,0,3,null,20200401,20200630,36660,0]
[null,"CHIHUAHUA","08DPT0002B",200,"BAGR640911VB4","BAGR640911HCHRND09","RODOLFO ELI BARONA GONZALEZ",30102,120,83101,1001,"00",26,"E3713",10,0,3,null,20200401,20200630,15931.5,0]
[null,"CHIHUAHUA","08DPT0002B",100,"BOAI840527A86","BOAI840527MCHRGN00","MARIA INES BORUNDA AGUILAR",30102,240,83101,1001,"00",26,"E3725",20,0,3,null,20200401,20200630,36660,0]
[null,"CHIHUAHUA","08DPT0002B",200,"CACS480226NE5","CACS480226HGTMPL06","SALVADOR CAMPOS CAPETILLO",30102,216,83101,1001,"00",26,"E3725",18,0,3,null,20200401,20200630,32994,0]
[null,"CHIHUAHUA","08DPT0002B",100,"CAPH630209KZ0","CAPH630209MCHRSL06","HILDA MARGARITA CARRASCO POSADA",30102,120,83101,1001,"00",26,"E3725",10,0,3,null,20200401,20200630,18330,0]
[null,"CHIHUAHUA","08DPT0002B",100,"COCD901004DB8","COCD901004MCHRHN09","DAINA ROCIO CORTES CHAVEZ",30102,216,83101,1001,"00",26,"E3725",18,0,3,null,20200401,20200630,32994,0]
[null,"CHIHUAHUA","08DPT0002B",100,"EABM680229EQ9","EABM680229MCHSDR08","MARTHA GUADALUPE ESCALANTE BADILLO",30102,216,83101,1001,"00",26,"E3725",18,0,3,null,20200401,20200630,32994,0]
[null,"CHIHUAHUA","08DPT0002B",200,"EOHA790831RH0","EOHA790831MZSSRN01","MARIA DE LOS ANGELES ESCOBAR DE HARO",30102,240,83101,1001,"00",26,"E3725",20,0,3,null,20200401,20200630,36660,0]
[null,"CHIHUAHUA","08DPT0002B",100,"FAMA641105R5A","FAMA641105MCHVRL07","ALMA ISABEL FAVELA MARTINEZ",30102,240,83101,1001,"00",26,"E3725",20,0,3,null,20200401,20200630,36660,0]
[null,"CHIHUAHUA","08DPT0002B",100,"FOLS800726I38","FOLS800726MCHLCN07","SANDYANA FLORES LUCERO",30102,240,83101,1001,"00",26,"E3725",20,0,3,null,20200401,20200630,36660,0]
[null,"CHIHUAHUA","08DPT0002B",100,"FONE671109ME3","FONE671109MCHLVS06","ESPERANZA FLORES NAVARRO",30102,216,83101,1001,"00",26,"E3725",18,0,3,null,20200401,20200630,32994,0]
[null,"CHIHUAHUA","08DPT0002B",200,"GAGC810607AX3","GAGC810607MCHRRH07","CHRISTIAN BELEN GARCIA GARCIA",30102,240,83101,1001,"00",26,"E3725",20,0,3,null,20200401,20200630,36660,0]
[null,"CHIHUAHUA","08DPT0002B",100,"GOLC890608AQ0","GOLC890608MCHMRY05","CYNTHIA LILIANA GOMEZ LARA",30102,240,83101,1001,"00",26,"E3713",20,0,3,null,20200401,20200630,31863,0]
[null,"CHIHUAHUA","08DPT0002B",200,"GOAJ891103DFA","GOAJ891103HCHNLR08","JORGE OMAR GONZALEZ ALVIDREZ",30102,216,83101,1001,"00",26,"E3711",18,0,3,null,20200401,20200630,25374.6,0]
[null,"CHIHUAHUA","08DPT0002B",200,"GOCY840110NQ4","GOCY840110MCHNLS07","YSELA GONZALEZ CALDERA",30102,216,83101,1001,"00",26,"E3725",18,0,3,null,20200401,20200630,32994,0]
[null,"CHIHUAHUA","08DPT0002B",200,"GOMA851115JC8","GOMA851115HCHNRR07","AARON ROBERTO GONZALEZ MORAN",30102,204,83101,1001,"00",26,"E3725",17,0,3,null,20200401,20200630,31161,0]
[null,"CHIHUAHUA","08DPT0002B",100,"GOPS780818LH4","GOPS780818HCHNRR01","SERGIO GONZALEZ PEREZ",30102,240,83101,1001,"00",26,"E3725",20,0,3,null,20200401,20200630,36660,0]
[null,"CHIHUAHUA","08DPT0002B",100,"GOCE790701I32","GOXC790701MCHNXL06","CELIA BRISA GONZALEZ ",30102,192,83101,1001,"00",26,"E3725",16,0,3,null,20200401,20200630,29328,0]
[null,"CHIHUAHUA","08DPT0002B",100,"GUFD63111111A","GUFD631111MSLVRN17","DINA YESENIA GUEVARA FIERRO",30102,240,83101,1001,"00",26,"E3725",20,0,3,null,20200401,20200630,36660,0]
[null,"CHIHUAHUA","08DPT0002B",100,"HEDC640302NR2","HEDC640302HZSRZR01","CARLOS HERNANDEZ DIAZ",30102,240,83101,1001,"00",26,"E3725",20,0,3,null,20200401,20200630,36660,0]
[null,"CHIHUAHUA","08DPT0002B",200,"IARL8304031L7","IARL830403HZSBMS09","LUIS ROMAN IBARRA  RAMOS",30102,240,83101,1001,"00",26,"E3725",20,0,3,null,20200401,20200630,36660,0]
[null,"CHIHUAHUA","08DPT0002B",200,"JAAZ890626IJ1","JAAZ890626MCHSVM08","ZIMRI DANIEL JASSO AVILA",30102,228,83101,1001,"00",26,"E3713",19,0,3,null,20200401,20200630,30269.879999999997,0]
[null,"CHIHUAHUA","08DPT0002B",120,"LAOE880302RW2","LAOE880302MCHZRL08","ELIZA ARELY LAZALDE ORTIZ",30102,228,83101,1001,"00",26,"E3725",19,0,3,null,20200401,20200630,34827,0]
[null,"CHIHUAHUA","08DPT0002B",200,"LEGF590530LW9","LEGF590530HCHNTR00","FERNANDO LEON GUTIERREZ",30102,240,83101,1001,"00",26,"E3725",20,0,3,null,20200401,20200630,36660,0]
[null,"CHIHUAHUA","08DPT0002B",120,"LOCA790201FP3","LXCA790201HCHRSD09","ADRIAN FRANCISCO LOERA  CASTRO",30102,240,83101,1001,"00",26,"E3725",20,0,3,null,20200401,20200630,36660,0]
[null,"CHIHUAHUA","08DPT0002B",200,"LORF830406762","LORF830406HCHPML02","FELIPE LOPEZ RAMIREZ",30102,216,83101,1001,"00",26,"E3713",18,0,3,null,20200401,20200630,28676.7,0]
[null,"CHIHUAHUA","08DPT0002B",100,"LURG880415UKA","LURG880415MCHNVB04","GABRIELA ALEJANDRA LUNA  RIVAS",30102,216,83101,1001,"00",26,"E3725",18,0,3,null,20200401,20200630,32994,0]
[null,"CHIHUAHUA","08DPT0002B",200,"LURY8009223V9","LURY800922MSPNBJ02","YAJAIRA ALEJANDRA LUNA ROBLEDO",30102,168,83101,1001,"00",26,"E3711",14,0,3,null,20200401,20200615,13157.2,0]
[null,"CHIHUAHUA","08DPT0002B",200,"MARJ6706253G1","MARJ670625HCHRSN08","JUAN FRANCISCO MARQUEZ DE LA ROSA",30102,240,83101,1001,"00",26,"E3713",20,0,3,null,20200401,20200630,31863,0]
[null,"CHIHUAHUA","08DPT0002B",200,"MAHR7303052U1","MAHR730305HCHRRG05","RIGOBERTO MARTINEZ HERNANDEZ",30102,240,83101,1001,"00",26,"E3725",20,0,3,null,20200401,20200630,36660,0]
[null,"CHIHUAHUA","08DPT0002B",200,"MARE920423KX8","MARE920423MCHRNR05","ERIKA ELIZABETH MARTINEZ RANGEL",30102,216,83101,1001,"00",26,"E3725",18,0,3,null,20200401,20200630,32994,0]
[null,"CHIHUAHUA","08DPT0002B",100,"MAER7001128F3","MAER700112MCHTSQ04","RAQUEL  MATA ESPARZA",30102,216,83101,1001,"00",26,"E3725",18,0,3,null,20200401,20200630,32994,0]
[null,"CHIHUAHUA","08DPT0002B",200,"MEMA740518TM8","MEMA740518HCHLLL03","ALFONSO NATANAEL MELENDEZ MELENDEZ",30102,228,83101,1001,"00",26,"E3725",19,0,3,null,20200401,20200630,34827,0]
[null,"CHIHUAHUA","08DPT0002B",200,"MEPF691219UT3","MEPF691219HCHLRR06","FRANCISCO JAVIER MELENDEZ PEREYRA",30102,216,83101,1001,"00",26,"E3725",18,0,3,null,20200401,20200630,32994,0]
[null,"CHIHUAHUA","08DPT0002B",120,"MERE811126DU3","MERE811126MCHLMD02","EDNA MELINA MELERO RAMIREZ",30102,216,83101,1001,"00",26,"E3725",18,0,3,null,20200401,20200630,32994,0]
[null,"CHIHUAHUA","08DPT0002B",100,"MEMN800616CH0","MEMN800616MZSNRR04","NORA DE LOURDES MENDEZ MARRUFO",30102,240,83101,1001,"00",26,"E3725",20,0,3,null,20200401,20200630,36660,0]
[null,"CHIHUAHUA","08DPT0002B",120,"MEPM521007BW0","MEPM521007MSPNTR05","MARINA MENDOZA PATIÑO",30102,240,83101,1001,"00",26,"E3725",20,0,3,null,20200401,20200630,36660,0]
[null,"CHIHUAHUA","08DPT0002B",100,"MEHE771226AK0","MEHE771226MCHZRM07","EMMA MARINA MEZA HERNANDEZ",30102,228,83101,1001,"00",26,"E3725",19,0,3,null,20200401,20200630,34827,0]
[null,"CHIHUAHUA","08DPT0002B",100,"MONJ730522LH4","MONJ730522HCHLXN04","JUAN BENJAMIN MOLINA NUÑEZ",30102,216,83101,1001,"00",26,"E3711",18,0,3,null,20200401,20200630,25374.6,0]
[null,"CHIHUAHUA","08DPT0002B",200,"MOAI970902SU8","MOAI970902HCHNRS09","ISAAC MONREAL ARVIZU",30102,144,83101,1001,"00",26,"E3701",12,0,3,null,20200401,20200615,8368.7999999999993,0]
[null,"CHIHUAHUA","08DPT0002B",200,"MOMC840319BC9","MOMC840319MCHRRR01","CARMINA SARA MORENO MORALES",30102,180,83101,1001,"00",26,"E3713",15,0,3,null,20200401,20200630,23897.280000000002,0]
[null,"CHIHUAHUA","08DPT0002B",200,"NARE6212101N2","NARE621210HCHVDL15","ELISEO MANUEL NAVA RODRIGUEZ",30102,192,83101,1001,"00",26,"E3725",16,0,3,null,20200401,20200630,29328,0]
[null,"CHIHUAHUA","08DPT0002B",100,"NAMR911217QR2","NAMR911217MCHVRY09","REYNA GUADALUPE NAVARRETE MARROQUIN",30102,228,83101,1001,"00",26,"E3713",19,0,3,null,20200401,20200630,30269.879999999997,0]
[null,"CHIHUAHUA","08DPT0002B",100,"OICT750827I13","OICT750827MCHLRR05","MARIA TERESA OLIVAS  CORONADO",30102,168,83101,1001,"00",26,"E3725",14,0,3,null,20200401,20200630,25662,0]
[null,"CHIHUAHUA","08DPT0002B",200,"OEZA770117EH9","OEZA770117HCHRPL04","ALFREDO LORENZO ORTEGA ZEPEDA",30102,228,83101,1001,"00",26,"E3725",19,0,3,null,20200401,20200630,34827,0]
[null,"CHIHUAHUA","08DPT0002B",200,"PAVM750409GD9","PAVM750409HCLLRR05","JOSE MARIA PALACIOS VARELA",30102,144,83101,1001,"00",26,"E3711",12,0,3,null,20200401,20200630,16916.400000000001,0]
[null,"CHIHUAHUA","08DPT0002B",200,"PACJ951020J55","PACJ951020HCHZRN09","JUAN ANTONIO PAZ CERON",30102,156,83101,1001,"00",26,"E3711",13,0,3,null,20200401,20200615,12217.4,0]
[null,"CHIHUAHUA","08DPT0002B",120,"PEGF4912049U3","PEGF491204HCHRRR02","FRANCISCO PEREZ GUERRERO",30102,228,83101,1001,"00",26,"E3725",19,0,3,null,20200401,20200630,34827,0]
[null,"CHIHUAHUA","08DPT0002B",100,"PIMR770113LW6","PIMR770113MCLNXC04","ROCIO PINTO MUÑOZ",30102,240,83101,1001,"00",26,"E3725",20,0,3,null,20200401,20200630,36660,0]
[null,"CHIHUAHUA","08DPT0002B",200,"POGH680928E46","POGH680928HCHRTC09","HECTOR MIGUEL PORRAS GUTIERREZ",30102,240,83101,1001,"00",26,"E3725",20,0,3,null,20200401,20200630,36660,0]
[null,"CHIHUAHUA","08DPT0002B",100,"RABM8107186R9","RABM810718MCHMRR16","MIRIAM SUSANA RAMIREZ BARRERA",30102,240,83101,1001,"00",26,"E3725",20,0,3,null,20200401,20200630,36660,0]
[null,"CHIHUAHUA","08DPT0002B",200,"RACJ670625F74","RACJ670625HCHMRN00","JUAN RAMON RAMIREZ CORRAL",30102,180,83101,1001,"00",26,"E3725",15,0,3,null,20200401,20200630,27495,0]
[null,"CHIHUAHUA","08DPT0002B",100,"RAVJ750924S61","RAVJ750924HCHMLN06","JUAN GABRIEL RAMIREZ VELA",30102,240,83101,1001,"00",26,"E3713",20,0,3,null,20200401,20200630,31863,0]
[null,"CHIHUAHUA","08DPT0002B",100,"REFG8206303T2","REFG820630MCLYLR05","GRISELDA REYES FLORES",30102,180,83101,1001,"00",26,"E3711",15,0,3,null,20200401,20200630,21145.5,0]
[null,"CHIHUAHUA","08DPT0002B",100,"RIOH600504T14","RIOH600504HCHVLC08","HECTOR RAMON RIVERA OLIVAS",30102,192,83101,1001,"00",26,"E3725",16,0,3,null,20200401,20200630,29328,0]
[null,"CHIHUAHUA","08DPT0002B",100,"ROAL7201241P5","ROAL720124MCHDVD01","LIDIA ANGELICA RODRIGUEZ AVILA",30102,228,83101,1001,"00",26,"E3725",19,0,3,null,20200401,20200630,34827,0]
[null,"CHIHUAHUA","08DPT0002B",100,"ROMM8706134U5","ROMM870613HCHDNN05","MANUEL ANTONIO RODRIGUEZ MONREAL",30102,108,83101,1001,"00",26,"E3711",9,0,3,null,20200401,20200715,10572.75,0]
[null,"CHIHUAHUA","08DPT0002B",100,"ROPE5908038V9","ROPE590803HCHDRL01","ELIGIO RODRIGUEZ PRIETO",30102,240,83101,1001,"00",26,"E3713",20,0,3,null,20200401,20200630,31863,0]
[null,"CHIHUAHUA","08DPT0002B",120,"ROVM860804PC7","ROVM860804HCHDLN05","JOSE MANUEL RODRIGUEZ VILLA",30102,240,83101,1001,"00",26,"E3713",20,0,3,null,20200401,20200630,31863,0]
[null,"CHIHUAHUA","08DPT0002B",200,"SAGR890912TX9","SAGR890912HCHVTC08","RICARDO SAAVEDRA GUTIERREZ",30102,240,83101,1001,"00",26,"E3711",20,0,3,null,20200401,20200615,18796,0]
[null,"CHIHUAHUA","08DPT0002B",200,"SAVY820923BCA","SAVY820923MCHLLM00","YAMET VERENICE SALAZAR VELAZQUEZ",30102,240,83101,1001,"00",26,"E3725",20,0,3,null,20200401,20200630,36660,0]
[null,"CHIHUAHUA","08DPT0002B",200,"SELV800114DJ4","SELV800114HCHGZC03","VICTOR ANDRES SEGOVIA LOZOYA",30102,240,83101,1001,"00",26,"E3725",20,0,3,null,20200401,20200630,36660,0]
[null,"CHIHUAHUA","08DPT0002B",100,"SOOA7210299X8","SOOA721029MCHLLN06","ANA LUISA SOLIS OLIVAS",30102,120,83101,1001,"00",26,"E3725",10,0,3,null,20200401,20200630,18330,0]
[null,"CHIHUAHUA","08DPT0002B",100,"SORA920618QC4","SORA920618HVZTYL06","JOSE ALBERTO SOTO REYES",30102,192,83101,1001,"00",26,"E3701",16,0,3,null,20200401,20200615,11158.4,0]
[null,"CHIHUAHUA","08DPT0002B",120,"TERG520428J43","TERG520428HDFLVL09","GUILLERMO TELLEZ REVILLA",30102,120,83101,1001,"00",26,"E3725",10,0,3,null,20200401,20200630,18330,0]
[null,"CHIHUAHUA","08DPT0002B",100,"VAOA630813IE8","VAOA630813MDGLRN07","ANGELA MARIA VALTIERRA  ORTEGA",30102,192,83101,1001,"00",26,"E3725",16,0,3,null,20200401,20200630,29328,0]
[null,"CHIHUAHUA","08DPT0002B",200,"VEGD970725699","VEGD970725HCHNNN08","DANIEL ARTURO VENZOR GONZALEZ",30102,120,83101,1001,"00",26,"E3701",10,0,3,null,20200401,20200630,10461,0]
[null,"CHIHUAHUA","08DPT0002B",200,"YAGC851128SX6","YAGC851128MCHXNY03","CYNTHIA AURORA YAÑEZ GONZALEZ",30102,216,83101,1001,"00",26,"E3725",18,0,3,null,20200401,20200630,32994,0]
[null,"08DPT0002B","08DPT0002B",125,"AUPC720823662","AUPC720823MZSGLL09","CLARA AGÜERO PALACIOS",20214,480,"83101","1003","00","26","CF34201","00.0",11119,"2",null,20200401,20200630,38140,0]
[null,"CHIHUAHUA","08DPT0002B",100,"AUSL630319SG0","AUSL630319HZSGFC09","JOSE LUCIANO AGUILERA SIFUENTES","20101",480,83101,1003,"00",26,"CF33206","00.0",13754,2,null,20200401,20200630,138182.27000000002,0]
[null,"CHIHUAHUA","08DPT0002B",200,"AAAJ9101208M3","AAAJ910120HCHLCS03","JESUS FABIAN ALVARADO  ACOSTA",20216,480,83101,1003,"00",26,"CF19201","00.0",2451,2,null,20200401,20200630,46116.47,0]
[null,"CHIHUAHUA","08DPT0002B",100,"AAAN671110TZ0","AAAN671110MCHLCC06","NICOLASA ALVARADO  ACOSTA","20201",480,83101,1003,"00",26,"CF33204","00.0",9182,2,null,20200401,20200630,123493.81,0]
[null,"CHIHUAHUA","08DPT0002B",200,"AAEM620508I55","AAEM620508HCLLSG04","MIGUEL ANGEL ALVARADO  ESPARZA",20216,480,83101,1003,"00",26,"CF19201","00.0",2447,2,null,20200401,20200630,46894.61,0]
[null,"CHIHUAHUA","08DPT0002B",100,"AISJ790419494","AISJ790419HCHRTN04","JUAN MANUEL ARIAS  SOTELO","20206",480,83101,1003,"00",26,"CF33204","00.0",2435,2,null,20200401,20200630,89334.290000000008,0]
[null,"CHIHUAHUA","08DPT0002B",100,"AIBC800120C20","AIBC800120HCHVLS02","CESAR NOE AVILA BOLIVAR",20401,480,83101,1003,"00",26,"S01201","00.0",2440,2,null,20200401,20200630,33672.89,0]
[null,"CHIHUAHUA","08DPT0002B",100,"BAML650601B92","BAML650601HDFRLS03","JOSE LUIS  BARRIENTOS MILAN","20401",480,83101,1003,"00",26,"S01202","00.0",2455,2,null,20200401,20200630,41202.19000000001,0]
[null,"CHIHUAHUA","08DPT0002B",100,"BOMA6710214E1","BOMA671021HDFLXR07","ARMANDO BOLAÑOS MUÑOZ",20201,480,83101,1003,"00",26,"CF33206","00.0",2432,2,null,20200401,20200630,110652.32,0]
[null,"CHIHUAHUA","08DPT0002B",100,"CAPL820818LQ5","CAPL820818HCHMRS04","LUIS ROBERTO CAMPOS PORTILLO","20206",480,83101,1003,"00",26,"S01202","00.0",10590,2,null,20200401,20200630,45044.13,0]
[null,"CHIHUAHUA","08DPT0002B",100,"CACL731031A17","CACL731031MCHRNR01","LORENA CARRILLO CANO",20211,480,83101,1003,"00",26,"S01202","00.0",2430,2,null,20200401,20200630,41111.42,0]
[null,"CHIHUAHUA","08DPT0002B",100,"CARJ6012178GA","CARJ601217HCHRLS07","JOSE DE JESUS CARRILLO RUELAS",20401,480,83101,1003,"00",26,"CF18203","00.0",2442,2,null,20200401,20200630,60784.680000000008,0]
[null,"CHIHUAHUA","08DPT0002B",100,"CARP8408274S7","CARP840827MCHHCR02","PERLA CHAVEZ ROCHA",20215,480,83101,1003,"00",26,"CF33204","00.0",2441,2,null,20200401,20200630,91240.15,0]
[null,"CHIHUAHUA","08DPT0002B",125,"CIBA710920FVA","CIBA710920MDGTRL04","ALMA ROSA CITAL BERTAHUD","20101",480,83101,1003,"00",26,"CF33206","00.0",14304,2,null,20200401,20200630,130807.73000000001,0]
[null,"CHIHUAHUA","08DPT0002B",125,"COMA6908143J5","COXM690814HCHNXR11","MARIO CONTRERAS N/A",20214,480,83101,1003,"00",26,"CF18203","00.0",2420,2,null,20200401,20200630,62851.939999999995,0]
[null,"CHIHUAHUA","08DPT0002B",100,"COCR830702UW4","COCR830702HVZRDB00","RUBEN OMAR CORTEZ CADENA",20401,480,83101,1003,"00",26,"CF18201","00.0",2422,2,null,20200401,20200630,33023.659999999996,0]
[null,"CHIHUAHUA","08DPT0002B",125,"DEMA661118M56","DEMA661118HCHLRB07","JOSE ABELARDO DELGADO  MORALES",20211,480,83101,1003,"00",26,"CF33204","00.0",2429,2,null,20200401,20200630,103865.51000000001,0]
[null,"CHIHUAHUA","08DPT0002B",100,"EAGK7806257R9","EAGK780625MCHSBR04","KARLA ESPARZA GABALDON",20101,480,83101,1003,"00",26,"CF33206","00.0",13756,2,null,20200401,20200630,109093.01000000001,0]
[null,"CHIHUAHUA","08DPT0002B",100,"FACF8611101I7","FACF861110HCHVNR02","FERNANDO FAVELA  CONTRERAS",20205,480,83101,1003,"00",26,"CF04201","00.0",2418,2,null,20200401,20200630,45056.87,0]
[null,"CHIHUAHUA","08DPT0002B",100,"FIGS610608SA8","FIGS610608MJCGNL02","SILVIA FIGUEROA GONZALEZ","20206",480,83101,1003,"00",26,"CF33204","00.0",2433,2,null,20200401,20200630,99616.939999999973,0]
[null,"CHIHUAHUA","08DPT0002B",200,"FOLC990507BF2","FOLC990507HCHLRS02","CESAR ARTURO FLORES LARES",20401,480,83101,1003,"00",26,"S01201","00.0",2444,2,null,20200401,20200630,26575.62,0]
[null,"CHIHUAHUA","08DPT0002B",200,"GACA790108U50","GACA790108MCLLRN00","ANA LILIANA GALLARDO DE LA CRUZ",20401,480,83101,1003,"00",26,"S01201","00.0",2428,2,null,20200401,20200630,26575.62,0]
[null,"CHIHUAHUA","08DPT0002B",100,"GAAD780823AVA","GAAD780823MCHRLL01","DULCE AURORA DEL CONSUELO GARCIA ALEMAN",20214,480,83101,1003,"00",26,"CF33204","00.0",10007,2,null,20200401,20200630,69246.319999999992,0]
[null,"CHIHUAHUA","08DPT0002B",100,"GALE580105G5A","GALE580105HCHRNN03","ENRIQUE GARCIA DE LUNA",20206,480,83101,1003,"00",26,"S01202","00.0",2421,2,null,20200401,20200630,47438.25,0]
[null,"CHIHUAHUA","08DPT0002B",200,"LIHJ9107073M0","LIHJ910707HCHRRS09","JASSON RAYMUNDO LIRA HERRERA",20406,480,83101,1003,"00",26,"CF34202","00.0",2428,2,null,20200401,20200630,44992.130000000005,0]
[null,"CHIHUAHUA","08DPT0002B",100,"LOCJ6307091T8","LOCJ630709HCHPRS08","JESUS MARTIN LOPEZ CARO","20102",480,83101,1003,"00",26,"CF33206","00.0",13757,2,null,20200401,20200630,130053.49000000002,0]
[null,"CHIHUAHUA","08DPT0002B",100,"LORE9304089K5","LORE930408HCHYSR01","EARVIN MANUEL LOYA  RIOS",20211,480,83101,1003,"00",26,"CF18201","00.0",2453,2,null,20200401,20200630,36341.040000000001,0]
[null,"CHIHUAHUA","08DPT0002B",200,"LOCJ681030V96","LOCJ681030HCHZLS07","JESUS EDUARDO LOZOYA  CALDERON","20302",480,83101,1003,"00",26,"A03202","00.0",2419,2,null,20200401,20200630,50052.950000000004,0]
[null,"CHIHUAHUA","08DPT0002B",100,"MOMN850815I1A","MOMN850815HCLNRX07","NOE MONSIVAIS MARIN",20401,480,83101,1003,"00",26,"S01201","00.0",2428,2,null,20200401,20200630,26575.62,0]
[null,"CHIHUAHUA","08DPT0002B",125,"MODC711228F67","MODC711228HCLNRR07","CARLOS EDUARDO MONTANO DURAN",50201,480,83101,1003,"00",26,"CF02103","00.0",2434,5,null,20200401,20200630,100611.18,0]
[null,"CHIHUAHUA","08DPT0002B",100,"MOSG761016858","MOSG761016HCLNNR06","GERARDO MONTOYA SANCHEZ",20216,480,83101,1003,"00",26,"S01202","00.0",2440,2,null,20200401,20200630,44293.100000000006,0]
[null,"CHIHUAHUA","08DPT0002B",200,"OOGL660522NA4","OOGL660522HCHCRS08","LUIS FELIX OCHOA GARCIA",50101,480,83101,1003,"00",26,"CF02105","00.0",2442,5,null,20200401,20200630,66459.899999999994,0]
[null,"CHIHUAHUA","08DPT0002B",100,"OORE7405071DA","OORE740507MCHRYS00","MARIA ESTHER OROZCO REYES",20212,480,83101,1003,"00",26,"ED01201","00.0",2424,2,null,20200401,20200630,52325.360000000008,0]
[null,"CHIHUAHUA","08DPT0002B",100,"RARF8407015TA","RARF840701MCHMML00","FLOR MINERVA RAMIREZ RAMIREZ",20211,480,83101,1003,"00",26,"CF18203","00.0",131,2,null,20200401,20200630,55824.070000000007,0]
[null,"CHIHUAHUA","08DPT0002B",100,"ROGM631230AD4","ROGM631230MCHMRR18","MARCIA IMELDA ROMERO GARCIA",20216,480,83101,1003,"00",26,"S01202","00.0",2436,2,null,20200401,20200630,48768.29,0]
[null,"CHIHUAHUA","08DPT0002B",100,"SAPP7109042V0","SAPP710904HCHLLD06","PEDRO SALAS PALOMINO",20305,480,83101,1003,"00",26,"CF33204","00.0",2459,2,null,20200401,20200630,103865.51000000001,0]
[null,"CHIHUAHUA","08DPT0002B",125,"TULO5510064A6","TULO551006MCHDYL01","OLGA ESPERANZA TUDA LEYVA",20109,480,83101,1003,"00",26,"CF33206","00.0",9278,2,null,20200401,20200630,92351.510000000009,0]
[null,"CHIHUAHUA","08DPT0002B",100,"VASC8109266G6","VASC810926MCHLLL08","CLAUDIA VALVERDE SALAZAR","20211",480,83101,1003,"00",26,"ED01201","00.0",2445,2,null,20200401,20200630,52066.010000000009,0]
[null,"CHIHUAHUA","08DPT0002B",100,"VAFM681203S84","VAFM681203MCHZGR05","MARICRUZ VAZQUEZ FIGUEROA","20203",480,83101,1003,"00",26,"CF33204","00.0",2451,2,null,20200401,20200630,91240.15,0]
[null,"CHIHUAHUA","08DPT0003A",120,"AUVJ9103083J2","AUVJ910308HCHGLN15","JUAN DE DIOS AGUIRRE VILLARREAL ",20401,480,83101,1003,"01",56,"S01201",0,7494,2,null,20200401,20200630,30058.27,0]
[null,"CHIHUAHUA","08DPT0003A",120,"AAIV730701KH6","AAIV730701MCHLTR08","VERONICA ALARCON ITURRALDE",50401,480,83101,1003,"01",56,"CF33206",0,14306,5,null,20200401,20200630,66459.899999999994,0]
[null,"CHIHUAHUA","08DPT0003A",120,"AOOC791125GF8","AOOC791125HCHLRR17","CRISTHIAN OMAR ALOR ORTEGA ",20109,480,83101,1003,"01",56,"CF33206",0,13763,2,null,20200401,20200630,85990.02,0]
[null,"CHIHUAHUA","08DPT0003A",120,"AEHL721013358","AEHL721013MCHRRR04","LAURA ELENA ARMENDARIZ HUERTA ",20216,480,83101,1003,"01",56,"CF19201",0,7495,2,null,20200401,20200630,45496.92,0]
[null,"CHIHUAHUA","08DPT0003A",120,"AOGA850323MS8","AOGA850323MCHRRD09","ADRIANA ARZOLA GARIBAY ",20216,480,83101,1003,"01",56,"CF33203",0,7484,2,null,20200401,20200630,46289.37,0]
[null,"CHIHUAHUA","08DPT0003A",120,"BALJ741015QJ5","BALJ741015HNTCPR09","JORGE GERARDO BACA LOPEZ ",50401,480,83101,1003,"01",56,"CF02103",0,12683,5,null,20200401,20200630,85992.48,0]
[null,"CHIHUAHUA","08DPT0003A",120,"CALS630411D26","CALS630411HCHNSL01","SALVADOR CANO LEOS",20206,480,83101,1003,"01",56,"CF02103",0,12683,2,null,20200401,20200630,103563.82,0]
[null,"CHIHUAHUA","08DPT0003A",120,"COSC761202AU8","COSC761202MCHRNL00","CLAUDIA CORONADO SAENZ ",20215,480,83101,1003,"01",56,"CF02105",0,14575,2,null,20200401,20200630,47084.93,0]
[null,"CHIHUAHUA","08DPT0003A",120,"CORE740806FH5","CORE740806HCHRYN08","ENCARNACION CORRAL REYES ",20401,480,83101,1003,"01",56,"CF34202",0,7498,2,null,20200401,20200630,36811.93,0]
[null,"CHIHUAHUA","08DPT0003A",120,"EABJ810502G45","EABJ810502HCHSYR08","JORGE HUMBERTO ESPARZA BAYLON ",20215,480,83101,1003,"01",56,"S01201",0,7498,2,null,20200401,20200630,35897.33,0]
[null,"CHIHUAHUA","08DPT0003A",120,"EIHE740513ST9","EIHE740513MCHSRV03","EVA CELINA ESPINOSA HERNANDEZ ",20216,480,83101,1003,"01",56,"CF33206",0,14307,2,null,20200401,20200630,81893.89,0]
[null,"CHIHUAHUA","08DPT0003A",120,"GAFS650908R84","GAFS650908HCHRLR07","SERGIO MARTIN GARCIA FLORES ",20212,480,83101,1003,"01",56,"A03202",0,7472,2,null,20200401,20200630,59450.8,0]
[null,"CHIHUAHUA","08DPT0003A",120,"GAAV670716S40","GAAV670716HCHRRC06","VICTOR MANUEL GARDEA ARREDONDO ",20206,480,83101,1003,"01",56,"CF34201",0,7504,2,null,20200401,20200630,78074.399999999994,0]
[null,"CHIHUAHUA","08DPT0003A",120,"GAHA8701284V2","GAHA870128HCHRRL07","ALVARO GARDEA HEREDIA",20401,480,83101,1003,"01",56,"S01201",0,7480,2,null,20200401,20200630,33593.81,0]
[null,"CHIHUAHUA","08DPT0003A",120,"GOSM730702M55","GOSM730702HCHMNS00","MOISES OCTAVIO GOMEZ SAENZ",20401,480,83101,1003,"01",56,"S01201",0,7494,2,null,20200401,20200630,22755.119999999999,0]
[null,"CHIHUAHUA","08DPT0003A",120,"GOVJ720801R43","GOVJ720801MCHNLD09","JUDITH GONZALEZ VALLES ",20201,480,83101,1003,"01",56,"CF33204",0,7493,2,null,20200401,20200630,132211.92000000001,0]
[null,"CHIHUAHUA","08DPT0003A",120,"HECG831209L74","HECG831209MCHRBB09","GABRIELA JUDITH HEREDIA CABALLERO ",20401,480,83101,1003,"01",56,"S01201",0,7494,2,null,20200401,20200630,30037.13,0]
[null,"CHIHUAHUA","08DPT0003A",120,"HESH611022NF3","HESH611022HCHRNL03","HILADRIO HEREDIA SAENZ ",20401,480,83101,1003,"01",56,"S01201",0,7485,2,null,20200401,20200630,43554.37,0]
[null,"CHIHUAHUA","08DPT0003A",120,"HEGM7510295L3","HEGM751029MCHRTY07","MAYRA VERONICA HERNANDEZ GUTIERREZ ",20215,480,83101,1003,"01",56,"CF33206",0,13762,2,null,20200401,20200630,50564.75,0]
[null,"CHIHUAHUA","08DPT0003A",120,"MEHP811017GD5","MEHP811017HCHNRL02","PAUL ALONSO MENDEZ HERRERA ",20402,480,83101,1003,"01",56,"S01201",0,7479,2,null,20200401,20200630,37173.910000000003,0]
[null,"CHIHUAHUA","08DPT0003A",120,"MEMD550401S32","MEMD550401HCHNTL01","JOSE DOLORES MENDEZ MOTA",20401,480,83101,1003,"01",56,"CF04201",0,10159,2,null,20200401,20200630,37913.949999999997,0]
[null,"CHIHUAHUA","08DPT0003A",120,"MOIR7306072Z5","MOIR730607HCHLBM08","RAMON HUMBERTO MOLINA IBARRA ",20401,480,83101,1003,"01",56,"CF18201",0,7491,2,null,20200401,20200630,34840.85,0]
[null,"CHIHUAHUA","08DPT0003A",120,"MOME900109M68","MOHR810216HCHNLN06","RENE GUADALUPE MONTES HOLGUIN ",20401,480,83101,1003,"01",56,"S01201",0,7494,2,null,20200401,20200630,33898.25,0]
[null,"CHIHUAHUA","08DPT0003A",120,"MOHR810216267","MOME900109MCHNNS03","ESMERALDA JANETH MONTES MONTES ",20401,480,83101,1003,"01",56,"A03202",0,7472,2,null,20200401,20200630,37255.949999999997,0]
[null,"CHIHUAHUA","08DPT0003A",120,"MOCY820701FR6","MOCY820701MCHRHS01","MARTHA ELVIRA ORTIZ CHAVEZ ",20201,480,83101,1003,"01",56,"S01201",0,7492,2,null,20200401,20200630,61930.17,0]
[null,"CHIHUAHUA","08DPT0003A",120,"PESB570420393","PESB570420HCHRSN03","BENJAMIN PEREZ SOSA ",20401,480,83101,1003,"01",56,"CF21202",0,7499,2,null,20200401,20200630,45711.45,0]
[null,"CHIHUAHUA","08DPT0003A",120,"QURM641112699","QURM641112HCHXMR08","MARTIN RENE QUIÑONEZ RAMIREZ ",20302,480,83101,1003,"01",56,"S01202",0,7500,2,null,20200401,20200630,39106.21,0]
[null,"CHIHUAHUA","08DPT0003A",120,"QUYA890925Q52","QUYA890925MCHXXN07","ANABEL QUIÑONEZ YAÑEZ ",20215,480,83101,1003,"01",56,"S01202",0,7501,2,null,20200401,20200630,50075.31,0]
[null,"CHIHUAHUA","08DPT0003A",120,"SUCM720601QH7","SUCM720601MCHRRY01","MYRNA MANUELA SUAREZ CORRAL ",20214,480,83101,1003,"01",56,"CF33206",0,14306,2,null,20200401,20200630,90141.03,0]
[null,"CHIHUAHUA","08DPT0003A",120,"UIRL701220D40","UIRL701220MCHRMR07","MARIA DE LOURDES URBINA RAMIREZ",20216,480,83101,1003,"01",56,"CF33206",0,13765,2,null,20200401,20200630,70468.92,0]
[null,"CHIHUAHUA","08DPT0003A",120,"VATA751225F38","VATA751225HCHLRL00","ALFREDO VALLES TORRES ",20205,480,83101,1003,"01",56,"A03202",0,7470,2,null,20200401,20200630,79779.16,0]
[null,"CHIHUAHUA","08DPT0003A",120,"YADR7710046J3","YADR771004MCHXZS02","ROSA IVONNE YAÑEZ DIAZ ",20214,480,83101,1003,"01",56,"CF33204",0,7487,2,null,20200401,20200630,68101.73,0]
[null,"CHIHUAHUA","08DPT0003A",100,"AOCF7610047IA","AOCF761204HCHCBR06","FRANCISCO ACOSTA CONTRERAS",30102,240,83101,1001,"01",56,"E3725",20,0,3,null,20200401,20200630,30303,0]
[null,"CHIHUAHUA","08DPT0003A",120,"AOMM7702115QA","AOMM770211MCHCRD18","MIDIAM LOURDES ACOSTA MERAZ",30102,192,83101,1001,"01",56,"E3713",16,0,3,null,20200401,20200630,21007.200000000001,0]
[null,"CHIHUAHUA","08DPT0003A",120,"AUQN701229G72","AUQN701229MCHGNR05","NORMA AGUIRRE QUINTANA ",30102,240,83101,1001,"01",56,"E3713",20,0,3,null,20200401,20200630,26259,0]
[null,"CHIHUAHUA","08DPT0003A",100,"AAHE730629HA8","AAHE730629HDGLRD05","EDGAR JESUS ALBA HERNANDEZ",30102,192,83101,1001,"01",56,"E3725",16,0,3,null,20200401,20200630,24242.400000000001,0]
[null,"CHIHUAHUA","08DPT0003A",200,"AEOP850816BU5","AEOP850816HCHRLD08","PEDRO RAFAEL ARMENDARIZ OLIVAS",30102,192,83101,1001,"01",56,"E3725",16,0,3,null,20200401,20200630,24242.400000000001,0]
[null,"CHIHUAHUA","08DPT0003A",120,"AERG670801H43","AERG670801HCHRVB09","GABRIEL ARMENDARIZ RIVAS",30102,216,83101,1001,"01",56,"E3725",18,0,3,null,20200401,20200630,27272.7,0]
[null,"CHIHUAHUA","08DPT0003A",120,"AERH6411189A9","AERH641118HCHRNG06","HUGO FRANCISCO ARMENDARIZ RONQUILLO",30102,120,83101,1001,"01",56,"E3711",10,0,3,null,20200401,20200630,11682,0]
[null,"CHIHUAHUA","08DPT0003A",200,"BASJ720920637","BASJ720920HCHCMV04","JAVIER BACA SAMPER",30102,216,83101,1001,"01",56,"E3725",18,0,3,null,20200401,20200630,27272.7,0]
[null,"CHIHUAHUA","08DPT0003A",100,"BAMF820909BC1","BAMF820909MCHLRT08","FATIMA DEL CARMEN BALDERAS MORALES",30102,216,83101,1001,"01",56,"E3725",18,0,3,null,20200401,20200630,27272.7,0]
[null,"CHIHUAHUA","08DPT0003A",200,"CACF650131IUA","CACF650131HCHNHL00","FILIBERTO CANO CHAVEZ",30102,240,83101,1001,"01",56,"E3711",20,0,3,null,20200401,20200630,23364,0]
[null,"CHIHUAHUA","08DPT0003A",100,"CALA591128150","CALA591128HCHNSB00","ABRAHAM CANO LEOS",30102,120,83101,1001,"01",56,"E3725",10,0,3,null,20200401,20200630,15151.5,0]
[null,"CHIHUAHUA","08DPT0003A",200,"CATI910806HS0","CATI910806HCHRRV03","IVAN DOROTEO CARRERA DE LA TORRE",30102,216,83101,1001,"01",56,"E3725",18,0,3,null,20200401,20200630,27272.7,0]
[null,"CHIHUAHUA","08DPT0003A",200,"CATN8302135X1","CATN830213MCHRRD06","NADIA BEATRIZ CARRERA DE LA TORRE",30102,216,83101,1001,"01",56,"E3725",18,0,3,null,20200401,20200630,27272.7,0]
[null,"CHIHUAHUA","08DPT0003A",100,"CAGG681119QE9","CAGG681119MCHRRB25","MARIA GABRIELA CARRILLO GARDEA",30102,204,83101,1001,"01",56,"E3725",17,0,3,null,20200401,20200630,25757.58,0]
[null,"CHIHUAHUA","08DPT0003A",120,"CATA900830PFA","CATA900830MCHRRL03","ALEJANDRA IVETTE  CARRILLO TRUJILLO",30102,240,83101,1001,"01",56,"E3725",20,0,3,null,20200401,20200630,30303,0]
[null,"CHIHUAHUA","08DPT0003A",100,"CATI851219KEA","CATI851219MCHRRR12","IRMA RAQUEL CARRILLO TRUJILLO",30102,96,83101,1001,"01",56,"E3725",8,0,3,null,20200401,20200630,12121.2,0]
[null,"CHIHUAHUA","08DPT0003A",100,"CAGL680404GU5","CAGL680404MCHSTT08","LETICIA CASILLAS GUTIERREZ",30102,192,83101,1001,"01",56,"E3725",16,0,3,null,20200401,20200630,24242.400000000001,0]
[null,"CHIHUAHUA","08DPT0003A",100,"CEBC880121MJ0","CEBC880121MCHBCL06","CLAUDIA INES CEBALLOS BACA",30102,240,83101,1001,"01",56,"E3725",20,0,3,null,20200401,20200630,30303,0]
[null,"CHIHUAHUA","08DPT0003A",200,"CEHF701204P69","CEHF701204HDGRRR02","FRANCISCO JAVIER CERENIL HERRERA",30102,216,83101,1001,"01",56,"E3725",18,0,3,null,20200401,20200630,27272.7,0]
[null,"CHIHUAHUA","08DPT0003A",100,"CASC781201J96","CASC781201MCHHNR02","CORINA CHAVEZ SANCHEZ",30102,216,83101,1001,"01",56,"E3725",18,0,3,null,20200401,20200630,27272.7,0]
[null,"CHIHUAHUA","08DPT0003A",200,"DERI7801118J5","DEXR780111HCHLXC03","RICARDO DELGADO",30102,228,83101,1001,"01",56,"E3725",19,0,3,null,20200401,20200630,23633.1,0]
[null,"CHIHUAHUA","08DPT0003A",200,"LEPJ860727765","LEPJ860727HCHNRV08","JAVIER EDUVIGES DE LEON PARADA",30102,216,83101,1001,"01",56,"E3713",18,0,3,null,20200401,20200630,28787.88,0]
[null,"CHIHUAHUA","08DPT0003A",100,"EARD8007284EA","EARD800728MCHSCL06","DULCE MARGARITA ELIZABETH ESCALANTE ROCHA",30102,240,83101,1001,"01",56,"E3725",20,0,3,null,20200401,20200630,30303,0]
[null,"CHIHUAHUA","08DPT0003A",100,"FEAL8707295J5","DUPB710508MCHRRR02","LUIS RAUL FERNANDEZ ACOSTA",30102,180,83101,1001,"01",56,"E3725",15,0,3,null,20200401,20200630,22727.279999999999,0]
[null,"CHIHUAHUA","08DPT0003A",200,"GAQL770122HI2","GAQL770122MCHLXZ06","LUZ ELIZABETH GALVAN QUIÑONEZ",30102,216,83101,1001,"01",56,"E3725",18,0,3,null,20200401,20200630,27272.7,0]
[null,"CHIHUAHUA","08DPT0003A",120,"GACP590517MU6","GACP590517MCHRHT05","PATRICIA EUGENIA GARCIA CHAVEZ",30102,216,83101,1001,"01",56,"E3725",18,0,3,null,20200401,20200630,27272.7,0]
[null,"CHIHUAHUA","08DPT0003A",100,"GARJ67122131A","GARJ671221HCHRZM09","JAIME GARCIA RUIZ",30102,240,83101,1001,"01",56,"E3725",20,0,3,null,20200401,20200630,30303,0]
[null,"CHIHUAHUA","08DPT0003A",100,"GODK810903VC5","GODK810903MCHNVN04","KENIS GONZALEZ DAVILA",30102,204,82101,1001,"01",56,"E3725",17,0,3,null,20200401,20200630,25757.58,0]
[null,"CHIHUAHUA","08DPT0003A",200,"GOGA810922999","GOGA810922HCHNRG02","AGUSTIN GONZALEZ GARCIA",30102,240,83101,1001,"01",56,"E3725",20,0,3,null,20200401,20200630,30303,0]
[null,"CHIHUAHUA","08DPT0003A",100,"GOGJ8811064X6","GOGJ881106MCHNTS09","JESSICA JANETH GONZALEZ GUTIERREZ",30102,240,83101,1001,"01",56,"E3725",20,0,3,null,20200401,20200630,30303,0]
[null,"CHIHUAHUA","08DPT0003A",200,"GOHD580525IP0","GOHD580525HCHNRV01","DAVID GONZALEZ HERNANDEZ",30102,240,83101,1001,"01",56,"E3713",20,0,3,null,20200401,20200630,26259,0]
[null,"CHIHUAHUA","08DPT0003A",120,"GUCG610126B56","GUCG610126HCHTNR03","JOSE GERARDO GUTIERREZ CONTRERAS",30102,144,83101,1001,"01",56,"E3725",12,0,3,null,20200401,20200630,18181.8,0]
[null,"CHIHUAHUA","08DPT0003A",100,"HEAV711202QZ8","HEAV711202MCHRGV01","VIVIANA HERNANDEZ AGUILERA",30102,108,83101,1001,"01",56,"E3725",9,0,3,null,20200401,20200630,13636.38,0]
[null,"CHIHUAHUA","08DPT0003A",200,"HEAA900716PY3","HEAA900716HCHRGL00","ALFREDO HERNANDEZ AGUIRRE",30102,204,83101,1001,"01",56,"E3713",17,0,3,null,20200401,20200630,22320.18,0]
[null,"CHIHUAHUA","08DPT0003A",200,"HEAA881029IG6","HEAA881029MCHRNN04","ANGELICA HERNANDEZ ANGEL",30102,216,83101,1001,"01",56,"E3725",18,0,3,null,20200401,20200630,27272.7,0]
[null,"CHIHUAHUA","08DPT0003A",200,"HISE750912LP7","HISE750912MCHNNT05","ETHEL JANETH HINOJOS SANCHEZ",30102,240,83101,1001,"01",56,"E3725",20,0,3,null,20200401,20200630,30303,0]
[null,"CHIHUAHUA","08DPT0003A",200,"HOOJ841127R23","HOOJ841127HCHLJS04","JESUS MANUEL HOLGUIN OJEDA",30102,240,83101,1001,"01",56,"E3725",20,0,3,null,20200401,20200630,30303,0]
[null,"CHIHUAHUA","08DPT0003A",100,"HOQS841119E44","HOQS841119MCHLNL02","SILVIA HOLGUIN QUINTANA",30102,240,83101,1001,"01",56,"E3725",20,0,3,null,20200401,20200630,30303,0]
[null,"CHIHUAHUA","08DPT0003A",100,"IEPA690710Q2A","IEPA690710HZSRRL07","ALEJANDRO IRENE PEREZ",30102,228,83101,1001,"01",56,"E3725",19,0,3,null,20200401,20200630,28787.88,0]
[null,"CHIHUAHUA","08DPT0003A",100,"JUEM870729SW2","JUEM870729MCHRSR04","MARINA JUAREZ ESPARZA",30102,96,83101,1001,"01",56,"E3711",8,0,3,null,20200401,20200630,9345.6,0]
[null,"CHIHUAHUA","08DPT0003A",120,"JUGE790622JJ2","JUGE790622HCHRRD03","EDGAR ELIEL JUAREZ GRAJEDA",30102,240,83101,1001,"01",56,"E3725",20,0,3,null,20200401,20200630,30303,0]
[null,"CHIHUAHUA","08DPT0003A",200,"LARJ611212G44","LARJ611212HCHZDL03","JOEL GUADALUPE LAZCANO RODRIGUEZ",30102,180,83101,1001,"01",56,"E3711",15,0,3,null,20200401,20200630,17523,0]
[null,"CHIHUAHUA","08DPT0003A",200,"LISA761208237","LISA761208HCHCLN05","ANGEL LICERIO SILVEYRA",30102,228,83101,1001,"01",56,"E3711",19,0,3,null,20200401,20200630,22195.8,0]
[null,"CHIHUAHUA","08DPT0003A",100,"LOGJ770422620","LOGJ770422HCHPRL08","JOEL ALONSO LOPEZ GRANADOS",30102,228,83101,1001,"01",56,"E3725",19,0,3,null,20200401,20200630,28787.88,0]
[null,"CHIHUAHUA","08DPT0003A",100,"LOSS7606157X9","LOSS760615MCHPLL02","SILVIA LOPEZ SALCIDO",30102,180,83101,1001,"01",56,"E3725",15,0,3,null,20200401,20200630,22727.279999999999,0]
[null,"CHIHUAHUA","08DPT0003A",200,"LOCM7912081Q9","LOCM791208MCHYLR09","MARTHA LAURA LOYA CELESTIN",30102,216,83101,1001,"01",56,"E3725",18,0,3,null,20200401,20200630,27272.7,0]
[null,"CHIHUAHUA","08DPT0003A",200,"MAAK800331I60","MAAK800331MCHCGR00","KAREN LOURDES MACIAS AGUIRRE",30102,180,83101,1001,"01",56,"E3725",15,0,3,null,20200401,20200630,22727.279999999999,0]
[null,"CHIHUAHUA","08DPT0003A",100,"MAMF571028UH3","MAMF571028HCHRCR08","FRANCISCO ROBERTO MARTINEZ MACIAS",30102,240,83101,1001,"01",56,"E3725",20,0,3,null,20200401,20200630,30303,0]
[null,"CHIHUAHUA","08DPT0003A",100,"MAMS761009L43","MAMS761009HCHRCR04","SERGIO RENE MARTINEZ MACIAS",30102,204,83101,1001,"01",56,"E3713",17,0,3,null,20200401,20200630,22320.18,0]
[null,"CHIHUAHUA","08DPT0003A",200,"MAML781222TP2","MAML781222MCHRNR05","LAURA GABRIELA MARTINEZ MONARREZ",30102,192,83101,1001,"01",56,"E3725",16,0,3,null,20200401,20200630,24242.400000000001,0]
[null,"CHIHUAHUA","08DPT0003A",100,"MAPJ881207NN8","MAPJ881207MCHRRN07","JANETH DERAT MARTINEZ PROSPERO",30102,216,83101,1001,"01",56,"E3725",18,0,3,null,20200401,20200630,27272.7,0]
[null,"CHIHUAHUA","08DPT0003A",100,"MARB780909MG5","MARB780909MCHRSR07","BRENDA SOCORRO MARTINEZ RIOS",30102,240,83101,1001,"01",56,"E3725",20,0,3,null,20200401,20200630,30303,0]
[null,"CHIHUAHUA","08DPT0003A",100,"MEMP850117HB8","MEMP850117MCHNNL01","PALOMA DEL CARMEN MENDEZ MENDEZ",30102,240,83101,1001,"01",56,"E3725",20,0,3,null,20200401,20200630,30303,0]
[null,"CHIHUAHUA","08DPT0003A",100,"MOHE7612192R9","MOHE761219HCHNLD06","EDGAR OBEK MONTES HOLGUIN",30102,192,83101,1001,"01",56,"E3725",16,0,3,null,20200401,20200630,24242.400000000001,0]
[null,"CHIHUAHUA","08DPT0003A",100,"MOMA830930QR2","MOMA830930MCHRRN04","ANTONIA MORENO MORALES",30102,216,83101,1001,"01",56,"E3725",18,0,3,null,20200401,20200630,27272.7,0]
[null,"CHIHUAHUA","08DPT0003A",120,"NAMR830722I63","NAMR830722MCHXNB01","REBECA DIANA NANEZ MENDOZA",30102,240,83101,1001,"01",56,"E3713",20,0,3,null,20200401,20200630,26259,0]
[null,"CHIHUAHUA","08DPT0003A",100,"PAQR840612BHA","PAQR840612HCHLXM03","JOSE RAMON PALMA QUIÑONEZ",30102,240,83101,1001,"01",56,"E3713",20,0,3,null,20200401,20200630,26259,0]
[null,"CHIHUAHUA","08DPT0003A",120,"PAMZ880803S42","PAMZ880803MCHTRM09","ZAMISH GABRIELA PATIÑO MORALES",30102,216,83101,1001,"01",56,"E3711",18,0,3,null,20200401,20200630,21837.599999999999,0]
[null,"CHIHUAHUA","08DPT0003A",200,"PERO820514295","PERO820514HCHRMM06","OMAR ARMANDO PEREZ RAMIREZ",30102,240,83101,1001,"01",56,"E3725",20,0,3,null,20200401,20200630,30303,0]
[null,"CHIHUAHUA","08DPT0003A",120,"QUVC860208IX4","QUVC860208MCHNLR06","CRISTINA QUINTANA VILLEGAS",30102,204,83101,1001,"01",56,"E3713",17,0,3,null,20200401,20200630,22320.18,0]
[null,"CHIHUAHUA","08DPT0003A",100,"QUGG830326LY2","QUGG830326MCHXRR05","GEORGINA ALHELI QUIÑONEZ GARCIA",30102,240,83101,1001,"01",56,"E3725",20,0,3,null,20200401,20200630,30303,0]
[null,"CHIHUAHUA","08DPT0003A",100,"QUYD920620SG7","QUYD920620MCHXXN07","DANIA ANGELICA QUIÑONEZ YAÑEZ",30102,240,83101,1001,"01",56,"E3713",20,0,3,null,20200401,20200630,26259,0]
[null,"CHIHUAHUA","08DPT0003A",100,"RACG650805Q12","RACG650805HSRMNM07","GAMALIEL RAMOS CONTRERAS",30102,216,83101,1001,"01",56,"E3725",18,0,3,null,20200401,20200630,27272.7,0]
[null,"CHIHUAHUA","08DPT0003A",200,"RACA620817IU7","RACA620817HCHSHN09","ANTONIO RASCON CHAVEZ",30102,240,83101,1001,"01",56,"E3711",20,0,3,null,20200401,20200630,23364,0]
[null,"CHIHUAHUA","08DPT0003A",200,"RERH8005305SA","RERH800530HCHNDC03","HECTOR RAUL RENTERIA RODRIGUEZ",30102,216,83101,1001,"01",56,"E3713",18,0,3,null,20200401,20200630,23633.1,0]
[null,"CHIHUAHUA","08DPT0003A",100,"RIPS680731I67","RIPS680731HCHCRR07","SERGIO RICO PEREZ",30102,240,83101,1001,"01",56,"E3711",20,0,3,null,20200401,20200630,23364,0]
[null,"CHIHUAHUA","08DPT0003A",200,"RIAJ830525SU3","RIAJ830525HCHVCM08","JAIME MICHAEL RIVERA ACOSTA",30102,228,83101,1001,"01",56,"E3725",19,0,3,null,20200401,20200630,28787.88,0]
[null,"CHIHUAHUA","08DPT0003A",200,"ROSL891018R33","ROSL891018HCHDNS03","LUIS ISIDRO RODRIGUEZ SAENZ",30102,204,83101,1001,"01",56,"E3725",17,0,3,null,20200401,20200630,25757.58,0]
[null,"CHIHUAHUA","08DPT0003A",200,"ROSL8112066G9","ROSL811206HCHDFS05","LUIS CARLOS RODRIGUEZ SIFUENTES",30102,240,83101,1001,"01",56,"E3725",20,0,3,null,20200401,20200630,30303,0]
[null,"CHIHUAHUA","08DPT0003A",100,"ROMC790529SQ8","ROMC790529HCHJZR03","CARLOS GERMAN ROJAS MEZA",30102,240,83101,1001,"01",56,"E3725",20,0,3,null,20200401,20200630,30303,0]
[null,"CHIHUAHUA","08DPT0003A",100,"ROMJ820824341","ROMJ820824HCHMRN09","JUAN PABLO ROMO MARTINEZ",30102,120,83101,1001,"01",56,"E3725",10,0,3,null,20200401,20200630,15151.5,0]
[null,"CHIHUAHUA","08DPT0003A",100,"ROQM800726NK3","ROQM800726MCHNXR09","MARISA JUDITH RONQUILLO QUIÑONEZ",30102,180,83101,1001,"01",56,"E3713",15,0,3,null,20200401,20200630,19694.28,0]
[null,"CHIHUAHUA","08DPT0003A",200,"SARJ830528CW0","SARJ830528HCHLDR12","JORGE ARTURO SALAS RODRIGUEZ",30102,216,83101,1001,"01",56,"E3713",18,0,3,null,20200401,20200630,23633.1,0]
[null,"CHIHUAHUA","08DPT0003A",100,"SADC810906EH7","SADC810906MCHNZR07","MARIA CRISTINA SANCHEZ DIAZ",30102,240,83101,1001,"01",56,"E3713",20,0,3,null,20200401,20200630,26259,0]
[null,"CHIHUAHUA","08DPT0003A",200,"SERM730609876","SERM730609MCHPYY01","MYRIAM SEPULVEDA REYES",30102,216,83101,1001,"01",56,"E3725",18,0,3,null,20200401,20200630,27272.7,0]
[null,"CHIHUAHUA","08DPT0003A",200,"TEAR760610A38","TEAR760610HCHRGL01","RAUL FELIPE TERRAZAS AGUIRRE",30102,120,83101,1001,"01",56,"E3725",10,0,3,null,20200401,20200630,15151.5,0]
[null,"CHIHUAHUA","08DPT0003A",200,"TOBT8310246R6","TOBT831024MCHRRH05","THELMA GUADALUPE TORRES BARRETO",30102,240,83101,1001,"01",56,"E3725",20,0,3,null,20200401,20200630,31113,0]
[null,"CHIHUAHUA","08DPT0003A",100,"UUAJ8910286B1","UUAJ891028HCHRRL00","JOEL URTUZUASTEGUI ARZOLA",30102,240,83101,1001,"01",56,"E3725",20,0,3,null,20200401,20200630,30303,0]
[null,"CHIHUAHUA","08DPT0003A",100,"VASM721005K88","VASM721005HCHLRR06","MARIO ALBERTO VALDEZ SIERRA",30102,108,83101,1001,"01",56,"E3725",9,0,3,null,20200401,20200630,13636.38,0]
[null,"CHIHUAHUA","08DPT0003A",100,"VATE6505053PA","VATE650505HCHLRR02","ERNESTO VALLEJO TERRAZAS",30102,204,83101,1001,"01",56,"E3725",17,0,3,null,20200401,20200630,25757.58,0]
[null,"CHIHUAHUA","08DPT0003A",100,"VAGS580921NS3","VAGS580921MCHZRL04","SOLEDAD VAZQUEZ GARCIA",30102,228,83101,1001,"01",56,"E3725",19,0,3,null,20200401,20200630,28787.88,0]
[null,"CHIHUAHUA","08DPT0003A",100,"VASI870422IA8","VASI870422MCHZVS04","ISIS KRYSTAL VAZQUEZ SAENZ",30102,228,83101,1001,"01",56,"E3725",19,0,3,null,20200401,20200630,28787.88,0]
[null,"CHIHUAHUA","08DPT0003A",200,"VEMA770621BW5","VEMA770621MCHLRN02","ANA ISABEL VELAZQUEZ MARTINEZ",30102,228,83101,1001,"01",56,"E3725",19,0,3,null,20200401,20200630,28787.88,0]
[null,"CHIHUAHUA","08DPT0003A",200,"VEDA870119GY2","VEDA870119MDGRMD03","ADRIANA VERGARA DOMINGUEZ",30102,180,83101,1001,"01",56,"E3725",15,0,3,null,20200401,20200630,22727.279999999999,0]
[null,"CHIHUAHUA","08DPT0003A",200,"VILJ810613D4A","VILJ810613HCHLRR06","JORGE ANTONIO VILLAR LOERA",30102,240,83101,1001,"01",56,"E3713",20,0,3,null,20200401,20200630,26259,0]
[null,"CHIHUAHUA","08DPT0003A",200,"VIGR710609UT2","VIGR710609HCHLRF00","RAFAEL VILLEGAS GARCIA",30102,240,83101,1001,"01",56,"E3725",20,0,3,null,20200401,20200630,30303,0]
[null,"CHIHUAHUA","08DPT0007X",100,"AUAC800520NRA","AUAC800520HDGGNS04","CESAR ALEJANDRO AGUILAR ANTUNEZ",20202,480,83101,1003,"02","07","CF18203","00.0",11986,2,null,20200401,20200630,54972,0]
[null,"CHIHUAHUA","08DPT0007X",100,"AARJ7003036F2","AARJ700303MCHNMS07","MARIA DE JESUS ANAYA RAMIREZ",20202,480,83101,1003,"02","07","CF33204","00.0",2390,2,null,20200401,20200630,91240.18,0]
[null,"CHIHUAHUA","08DPT0007X",100,"AIEL6711121J4","AIXE671112MCHRXL03","MARÍA ELIZABETH ARRIETA",20204,480,83101,1003,"02","07","S01201","00.0",9329,2,null,20200401,20200630,35992.339999999997,0]
[null,"CHIHUAHUA","08DPT0007X",100,"BELH630930M26","BELH630930HCHNNM06","JOSE HUMBERTO BENITEZ LONGORIA",10102,480,83101,1003,"02","07","CF19201","00.0",9327,2,null,20200401,20200630,57314.19,0]
[null,"CHIHUAHUA","08DPT0007X",100,"CADE710915BB6","CADE710915MCHRZL02","ELVIRA CARRASCO DIAZ",50404,480,83101,1003,"02","07","CF02103","00.0",12600,5,null,20200401,20200630,100611.18,0]
[null,"CHIHUAHUA","08DPT0007X",100,"CACI7205151S9","CACI720515HOCHRS01","ISIDRO MANUEL CHAVEZ CARRERA",20202,480,83101,1003,"02","07","CF33204","00.0",9338,2,null,20200401,20200630,87339.82,0]
[null,"CHIHUAHUA","08DPT0007X",100,"DEML700812U65","DEML700812MDGLRR03","LAURA DIANA DELGADO MARRERO",20204,480,83101,1003,"02","07","A03202","00.0",9319,2,null,20200401,20200630,55182.57,0]
[null,"CHIHUAHUA","08DPT0007X",200,"EALJ731221FM3","EALJ731221HSLSRN06","JUAN DE DIOS ESCALANTE LAUREAN",10102,480,83101,1003,"02","07","S01202","00.0",9342,2,null,20200401,20200630,45044.18,0]
[null,"CHIHUAHUA","08DPT0007X",100,"GAEM680908Q97","GAEC680908MCLLSN03","MA. CONCEPCION GALLARDO ESPARZA",20202,480,83101,1003,"02","07","S01202","00.0",9337,2,null,20200401,20200630,42391.24,0]
[null,"CHIHUAHUA","08DPT0007X",100,"GADA760726L20","GADA760726MCHRZD02","ADRIANA GARCIA DIAZ",20202,480,83101,1003,"02","07","A03202","00.0",465,2,null,20200401,20200630,53889.21,0]
[null,"CHIHUAHUA","08DPT0007X",100,"HEGJ620729F26","HEGJ620729HCHRNV07","JOSE JAVIER HERNANDEZ GONZALEZ",20201,480,83101,1003,"02","07","CF33206","00.0",14112,2,null,20200401,20200630,87992.84,0]
[null,"CHIHUAHUA","08DPT0007X",100,"HEGL611117FN5","HEGL611117MCHRNZ00","LUZ MARIA HERNANDEZ GONZALEZ",20202,480,83101,1003,"02","07","CF33204","00.0",2229,2,null,20200401,20200630,106398.27,0]
[null,"CHIHUAHUA","08DPT0007X",100,"HEPH660312FI8","HEPH660312HCHRRC02","HECTOR HERNANDEZ PEREZ",20203,480,83101,1003,"02","07","CF18203","00.0",9332,2,null,20200401,20200630,63252.93,0]
[null,"CHIHUAHUA","08DPT0007X",100,"LIMR6608162E8","LIMR660816HZSRNY01","RAYMUNDO LIRA MENDOZA",20201,480,83101,1003,"02","07","CF33206","00.0",13756,2,null,20200401,20200630,141869.51,0]
[null,"CHIHUAHUA","08DPT0007X",100,"MASF580311IY9","MASF580311HDGGCR04","FRANCISCO MAGDALENO SAUCEDO",20203,480,83101,1003,"02","07","CF33204","00.0",210,2,null,20200401,20200630,89733.24,0]
[null,"CHIHUAHUA","08DPT0007X",100,"MARL701010AR4","MARL701010MCLRBD02","LUDIVINA MARTINEZ REBOLLOSO",20202,480,83101,1003,"02","07","CF04201","00.0",11955,2,null,20200401,20200630,60847.93,0]
[null,"CHIHUAHUA","08DPT0007X",100,"MECL790627CP7","MEXC790627MCHJXL02","CLAUDIA FABIOLA MEJIA",20202,480,83101,1003,"02","07","CF34202","00.0",12097,2,null,20200401,20200630,51949.2,0]
[null,"CHIHUAHUA","08DPT0007X",100,"MONL710121CT7","MONL710121MSLGVR08","LORENA INES MOGUEL NOVELO",20201,480,83101,1003,"02","07","CF33206","00.0",13431,2,null,20200401,20200630,103335.16,0]
[null,"CHIHUAHUA","08DPT0007X",100,"MONM720514D8A","MONM720514HCHRXR04","MARCIAL EZEQUIEL MORALES NUÑEZ",20201,480,83101,1003,"02","07","CF33206","00.0",13430,2,null,20200401,20200630,125276.72,0]
[null,"CHIHUAHUA","08DPT0007X",100,"OIPL750706829","OIPL750706HNTRXS09","LUIS ALBERTO ORTIZ PEÑA",20202,480,83101,1003,"02","07","CF33204","00.0",9348,2,null,20200401,20200630,81527.360000000001,0]
[null,"CHIHUAHUA","08DPT0007X",100,"PECG710113QA8","PECG710113MCHRRB06","GABRIELA PEREZ CRUZ",20202,480,83101,1003,"02","07","S01202","00.0",7505,2,null,20200401,20200630,49711.19,0]
[null,"CHIHUAHUA","08DPT0007X",100,"ROCS700130LMA","ROCS700130MDGDLL00","SILVIA ESTELA RODRIGUEZ CALVILLO",20201,480,83101,1003,"02","07","CF33206","00.0",13432,2,null,20200401,20200630,88864.57,0]
[null,"CHIHUAHUA","08DPT0007X",100,"ROMA711015CL1","ROMA711015MDFDLN06","ANA LUISA RODRIGUEZ MILAN",20202,480,83101,1003,"02","07","A03202","00.0",9322,2,null,20200401,20200630,54699.21,0]
[null,"CHIHUAHUA","08DPT0007X",100,"ROME6706013EA","ROME670601MDFJLD04","MARIA EDITH ROJAS MELENDEZ",20202,480,83101,1003,"02","07","A03202","00.0",9320,2,null,20200401,20200630,54535.89,0]
[null,"CHIHUAHUA","08DPT0007X",100,"SOGC711207N65","SOGC711207MCHTRN06","MARIA CONCEPCION SOTO GUERRERO",20201,480,83101,1003,"02","07","CF33206","00.0",13433,2,null,20200401,20200630,132651.32,0]
[null,"CHIHUAHUA","08DPT0007X",100,"SOHJ7805045P4","SOHJ780504HCHTRS02","JOSE DE JESUS SOTO HERNANDEZ",20202,480,83101,1003,"02","07","CF33203","00.0",9335,2,null,20200401,20200630,51202.05,0]
[null,"CHIHUAHUA","08DPT0007X",100,"ZAVE920703L47","ZAVE920703HCHVLD09","EDGAR ALEJANDRO ZAVALA VALLES",20202,480,83101,1003,"02","07","S01201","00.0",9325,2,null,20200401,20200630,34968.699999999997,0]
[null,"CHIHUAHUA","08DPT0007X",100,"AAVJ670109VEA","AAVJ670109HVZBLL08","JULIAN MIGUEL ABSALON VILLEGAS ",30102,240,83101,1001,"02","07","E3711",20,0,3,null,20200401,20200630,28194,0]
[null,"CHIHUAHUA","08DPT0007X",200,"AOLJ680721RSA","AOLJ680721MCHCJL09","JULIA ROSA ACOSTA LUJAN ",30102,228,83101,1001,"02","07","E3725",19,0,3,null,20200401,20200630,34827,0]
[null,"CHIHUAHUA","08DPT0007X",200,"AEMV850720NG8","AEMV850720MCHLNR03","VIRIDIANA ALMEIDA MONTES ",30102,204,83101,1001,"02","07","E3725",17,0,3,null,20200401,20200630,31161,0]
[null,"CHIHUAHUA","08DPT0007X",100,"AAGP8807274Z4","AAGP880727MMCLLB04","PABLOVA ALVARADO GALICIA ",30102,216,83101,1001,"02","07","E3725",18,0,3,null,20200401,20200630,32994,0]
[null,"CHIHUAHUA","08DPT0007X",200,"AASJ7104236Z2","AASJ710423HCHLNR06","JORGE ADRIAN ALVARADO SANCHEZ ",30102,240,83101,1001,"02","07","E3725",20,0,3,null,20200401,20200630,36660,0]
[null,"CHIHUAHUA","08DPT0007X",100,"AATG900815VD7","AATG900815MCHLRL09","GLORIA YARALDY ALVARADO TARANGO ",30102,204,83101,1001,"02","07","E3725",17,0,3,null,20200401,20200630,31161,0]
[null,"CHIHUAHUA","08DPT0007X",100,"AARP801213GG6","AARP801213HCHVDD14","PEDRO ALONSO AVALOS RODARTE ",30102,240,83101,1001,"02","07","E3725",20,0,3,null,20200401,20200630,36660,0]
[null,"CHIHUAHUA","08DPT0007X",100,"BACJ730108BV7","BACJ730108MDFYRH00","JAHEL BAYARDO CARVAJAL ",30102,204,83101,1001,"02","07","E3725",17,0,3,null,20200401,20200630,31161,0]
[null,"CHIHUAHUA","08DPT0007X",100,"BECI670819Q93","BECI670819HCHLRV03","IVAN BELMONTE CARRILLO ",30102,228,83101,1001,"02","07","E3725",19,0,3,null,20200401,20200630,34827,0]
[null,"CHIHUAHUA","08DPT0007X",100,"BEMY780623E38","BEMY780623MCHRRS01","YESICA BERUMEN MARTINEZ ",30102,180,83101,1001,"02","07","E3725",15,0,3,null,20200401,20200630,27495,0]
[null,"CHIHUAHUA","08DPT0007X",400,"BUEL761105V38","BUEL761105MCHSSR05","LAURA ISELA BUSTAMANTE ESCOBEDO",30102,216,83101,1001,"02","07","E3725",18,0,3,null,20200401,20200630,32994,0]
[null,"CHIHUAHUA","08DPT0007X",200,"CAVM69042817A","CAVM690428HCHBGR00","MARIO ALBERTO CABALLERO VEGA ",30102,228,83101,1001,"02","07","E3713",19,0,3,null,20200401,20200630,30269.849999999995,0]
[null,"CHIHUAHUA","08DPT0007X",200,"CAVM6006195R6","CAVM600619HCHLLN01","MANUEL ALBERTO CALLEROS VILLALOBOS ",30102,240,83101,1001,"02","07","E3713",20,0,3,null,20200401,20200630,31863,0]
[null,"CHIHUAHUA","08DPT0007X",100,"CIGJ801220RP4","CIGJ801220HCHSRL09","JULIO ALBERTO CISNEROS GARCIA ",30102,240,83101,1001,"02","07","E3725",20,0,3,null,20200401,20200630,36660,0]
[null,"CHIHUAHUA","08DPT0007X",200,"DIAA860226874","DIAA860226MSRZGN04","ANA FABOLA DIAZ AGUILAR ",30102,144,83101,1001,"02","07","E3725",12,0,3,null,20200401,20200630,21996,0]
[null,"CHIHUAHUA","08DPT0007X",200,"DOBG610203LR2","DOBG610203HCHMRL02","GILBERTO DOMINGUEZ BARAY ",30102,240,83101,1001,"02","07","E3725",20,0,3,null,20200401,20200630,36660,0]
[null,"CHIHUAHUA","08DPT0007X",100,"DOEJ630916HP1","DOEJ630916HCLRSN05","JUAN JESUS DORADO ESPINO ",30102,216,83101,1001,"02","07","E3711",18,0,3,null,20200401,20200630,21145.5,0]
[null,"CHIHUAHUA","08DPT0007X",200,"EADJ860902I17","EADJ860902HCHSZV01","JAVIER EDUARDO ESPARZA DIAZ ",30102,216,83101,1001,"02","07","E3725",18,0,3,null,20200401,20200630,32994,0]
[null,"CHIHUAHUA","08DPT0007X",200,"EACL8412183L3","EACL841218MCHSRR08","LAURA VERONICA ESTRADA CARRILLO ",30102,228,83101,1001,"02","07","E3725",19,0,3,null,20200401,20200630,34827,0]
[null,"CHIHUAHUA","08DPT0007X",200,"EAHJ881022RT6","EAHJ881022HCHSRQ05","JOAQUIN JOEL ESTRADA HERNANDEZ ",30102,240,83101,1001,"02","07","E3725",20,0,3,null,20200401,20200630,36660,0]
[null,"CHIHUAHUA","08DPT0007X",200,"EASA951019EL5","EASA951019HCHSLN00","JOSE ANGEL ESTRADA SALAYANDIA ",30102,240,83101,1001,"02","07","E3711",20,0,3,null,20200401,20200630,28194,0]
[null,"CHIHUAHUA","08DPT0007X",200,"FOCG620409LQ0","FOCG620409HDGLHN03","GONZALO FLORES CHACON ",30102,240,83101,1001,"02","07","E3725",20,0,3,null,20200401,20200630,36660,0]
[null,"CHIHUAHUA","08DPT0007X",100,"GAEH711103S52","GAEH711103HCHBNC07","HECTOR GERARDO GABALDON ENRÍQUEZ                   ",30102,156,83101,1001,"02","07","E3725",13,0,3,null,20200401,20200630,23829,0]
[null,"CHIHUAHUA","08DPT0007X",200,"GAJE670908MV9","GAJE670908HDGLRV06","EVARISTO GALVAN JUAREZ ",30102,240,83101,1001,"02","07","E3713",20,0,3,null,20200401,20200630,31863,0]
[null,"CHIHUAHUA","08DPT0007X",100,"GAMY7604228L5","GAMY760422MDGLXL00","YOLANDA ALEJANDRA GALVAN MUÑOZ",30102,144,83101,1001,"02","07","E3725",12,0,3,null,20200401,20200630,21996,0]
[null,"CHIHUAHUA","08DPT0007X",200,"GAOR861127BG3","GAOR861127MCHMNQ19","RAQUEL GAMBOA ONTIVEROS ",30102,240,83101,1001,"02","07","E3725",20,0,3,null,20200401,20200630,36660,0]
[null,"CHIHUAHUA","08DPT0007X",100,"GAAN631226D5A","GAAN631226MCHNNR03","NORMA GANDARA ANGUIANO",30102,168,83101,1001,"02","07","E3725",14,0,3,null,20200401,20200630,25662,0]
[null,"CHIHUAHUA","08DPT0007X",100,"GARA6105276N5","GARA610527HCHRZL00","JOSE ALFONSO GARAY RUIZ ",30102,240,83101,1001,"02","07","E3725",20,0,3,null,20200401,20200630,36660,0]
[null,"CHIHUAHUA","08DPT0007X",100,"GAMB810605AT7","GAMB810605HDGRCR04","BERNARDO ANTONIO GARCIA MACIAS ",30102,192,83101,1001,"02","07","E3711",16,0,3,null,20200401,20200630,18796,0]
[null,"CHIHUAHUA","08DPT0007X",100,"GOTD6910121D1","GOTD691012MCHMVY06","DEYANIRA GOMEZ TAVARES ",30102,120,83101,1001,"02","07","E3725",10,0,3,null,20200401,20200630,18330,0]
[null,"CHIHUAHUA","08DPT0007X",100,"GOGG8703244X4","GOGG870324MCHNNB07","GABRIELA ALEJANDRA GONZALEZ GANDARA ",30102,204,83101,1001,"02","07","E3701",17,0,3,null,20200401,20200630,17783.7,0]
[null,"CHIHUAHUA","08DPT0007X",100,"GONM640214JC7","GONM640214HJCNVG03","MIGUEL GONZÁLEZ NAVA",30102,240,83101,1001,"02","07","E3711",20,0,3,null,20200401,20200630,28194,0]
[null,"CHIHUAHUA","08DPT0007X",100,"GUCH710602IC3","GUCH710602HCHTSC09","HECTOR GUTIERREZ CISNEROS ",30102,204,83101,1001,"02","07","E3711",17,0,3,null,20200401,20200630,19970.75,0]
[null,"CHIHUAHUA","08DPT0007X",100,"HEPR900403KQ2","HEPR900403HCHRRC03","RICARDO HERNANDEZ PEREZ ",30102,120,83101,1001,"02","07","E3725",10,0,3,null,20200401,20200630,18330,0]
[null,"CHIHUAHUA","08DPT0007X",100,"HEMA6604046K4","HEMA660404HCHRXN05","JOSE ANGEL HERRERA MUÑOZ ",30102,240,83101,1001,"02","07","E3725",20,0,3,null,20200401,20200630,36660,0]
[null,"CHIHUAHUA","08DPT0007X",100,"HEOS840726F25","HEOS840726HCHRGR06","SERGIO ARTURO HERRERA OGAZ ",30102,120,83101,1001,"02","07","E3725",10,0,3,null,20200401,20200630,18330,0]
[null,"CHIHUAHUA","08DPT0007X",100,"HOAG621120KT8","HOAG621120MCHLVB08","GABRIELA ALEJANDRA HOLGUIN AVILA ",30102,216,83101,1001,"02","07","E3713",18,0,3,null,20200401,20200630,28676.7,0]
[null,"CHIHUAHUA","08DPT0007X",100,"HUJD820323M58","HUJD820323HMCRMN01","DANIEL HUERTA JIMENEZ ",30102,228,83101,1001,"02","07","E3701",19,0,3,null,20200401,20200630,19875.900000000001,0]
[null,"CHIHUAHUA","08DPT0007X",200,"LOHA840518CS8","LOHA840518HCHPRL07","ALBERTO LOPEZ HERNANDEZ ",30102,204,83101,1001,"02","07","E3725",17,0,3,null,20200401,20200630,31161,0]
[null,"CHIHUAHUA","08DPT0007X",200,"MAVA850717159","MAVA850717MCHCLL06","ALEJANDRA MACÍAS VELAZQUEZ ",30102,240,83101,1001,"02","07","E3725",20,0,3,null,20200401,20200630,36660,0]
[null,"CHIHUAHUA","08DPT0007X",100,"MAER720708DH1","MAXE720708MCHNXR00","ERIKA SELENE MANCHA ",30102,192,83101,1001,"02","07","E3725",16,0,3,null,20200401,20200630,29328,0]
[null,"CHIHUAHUA","08DPT0007X",100,"MAOD8107099T0","MAOD810709HCHRLN01","DANIEL ANTONIO MARQUEZ OLIVAS ",30102,240,83101,1001,"02","07","E3713",20,0,3,null,20200401,20200630,31863,0]
[null,"CHIHUAHUA","08DPT0007X",100,"MARS830130RA7","MARS830130HCHRVR05","SERGIO ALONSO MARTINEZ RIVERA ",30102,120,83101,1001,"02","07","E3725",10,0,3,null,20200401,20200630,18330,0]
[null,"CHIHUAHUA","08DPT0007X",200,"MALA850527KR1","MALA850527HTLTCN04","ANDRES ISAAC MATUS LECOURTOIS ",30102,180,83101,1001,"02","07","E3711",15,0,3,null,20200401,20200630,21145.5,0]
[null,"CHIHUAHUA","08DPT0007X",100,"MEAP8301055K0","MEAP830105MSLDRT07","PATRICIA DEL ROCIO MEDINA ARMENTA ",30102,204,83101,1001,"02","07","E3711",17,0,3,null,20200401,20200630,19970.75,0]
[null,"CHIHUAHUA","08DPT0007X",100,"MESO501218RY9","MESO501218HJCNLS04","OSCAR IGNACIO MENDOZA SALAS ",30102,144,83101,1001,"02","07","E3725",12,0,3,null,20200401,20200630,21996,0]
[null,"CHIHUAHUA","08DPT0007X",200,"MESB8507159W0","MESB850715HCHNRN00","BENJAMIN ALEJANDRO MENDOZA SORIANO",30102,240,83101,1001,"02","07","E3725",20,0,3,null,20200401,20200630,36660,0]
[null,"CHIHUAHUA","08DPT0007X",200,"MOHF7603319E7","MOHF760331HDFCRR01","FERNANDO MOCTEZUMA HERNANDEZ ",30102,168,83101,1001,"02","07","E3711",14,0,3,null,20200401,20200630,16446.5,0]
[null,"CHIHUAHUA","08DPT0007X",200,"MOAJ681102IQ0","MOAJ681102HCHNGS07","JESUS GERARDO MONTES AGUILAR",30102,228,83101,1001,"02","07","E3711",19,0,3,null,20200401,20200630,26784.3,0]
[null,"CHIHUAHUA","08DPT0007X",200,"MOMM791027B8A","MOMM791027MCHRRY08","MAYRA MARGARITA MORALES MORENO ",30102,216,83101,1001,"02","07","E3725",18,0,3,null,20200401,20200630,32994,0]
[null,"CHIHUAHUA","08DPT0007X",200,"OEPH7911267A5","OEPH791126HCHRNC09","HECTOR RICARDO ORNELAS DEL PINO ",30102,180,83101,1001,"02","07","E3725",15,0,3,null,20200401,20200630,27495,0]
[null,"CHIHUAHUA","08DPT0007X",100,"OOMB8207037W4","OOMB820703HCHRLN09","BLAS OROZCO MONTES ",30102,180,83101,1001,"02","07","E3711",15,0,3,null,20200401,20200630,17621.25,0]
[null,"CHIHUAHUA","08DPT0007X",400,"OIGV851019169","OIGV851019HTSRRC00","VICTOR HUGO ORTIZ GARCIA ",30102,240,83101,1001,"02","07","E3711",20,0,3,null,20200401,20200630,23495,0]
[null,"CHIHUAHUA","08DPT0007X",200,"OIGC960301QQA","OIGC960301HCHRNR04","CARLOS ANDRES ORTIZ GONZALEZ ",30102,108,83101,1001,"02","07","E3701",9,0,3,null,20200401,20200630,7845.7499999999991,0]
[null,"CHIHUAHUA","08DPT0007X",200,"OIGA8509273I1","OIGA850927HCHRTL04","JOSE ALBERTO ORTIZ GUTIERREZ ",30102,132,83101,1001,"02","07","E3725",11,0,3,null,20200401,20200630,20163,0]
[null,"CHIHUAHUA","08DPT0007X",200,"PEME750130UP9","PEME750130HCHRRR00","ERICK DAVID PEREZ MARTINEZ ",30102,216,83101,1001,"02","07","E3713",18,0,3,null,20200401,20200630,28676.7,0]
[null,"CHIHUAHUA","08DPT0007X",100,"PERL8208024K1","PERL820802MCHRMR03","LAURA ANGELICA PEREZ RAMOS ",30102,216,83101,1001,"02","07","E3725",18,0,3,null,20200401,20200630,32994,0]
[null,"CHIHUAHUA","08DPT0007X",200,"PESD840502CP3","PESD840502HCHRCG00","DIEGO ALEJANDRO PEREZ SAUCEDO ",30102,180,83101,1001,"02","07","E3711",15,0,3,null,20200401,20200630,21145.5,0]
[null,"CHIHUAHUA","08DPT0007X",200,"POMJ860826TB2","POMJ860826HCHRDN05","JUAN CARLOS PORRAS MEDINA ",30102,228,83101,1001,"02","07","E3725",19,0,3,null,20200401,20200630,34827,0]
[null,"CHIHUAHUA","08DPT0007X",200,"RIBG810102KB8","RIBG810102MCHVRR02","GRACIELA RIVAS BARRAGAN ",30102,216,83101,1001,"02","07","E3725",18,0,3,null,20200401,20200630,32994,0]
[null,"CHIHUAHUA","08DPT0007X",100,"ROMP8008014S4","ROMP800801MCSBZT07","PATRICIA ROBLERO MAZARIEGOS ",30102,144,83101,1001,"02","07","E3725",12,0,3,null,20200401,20200630,21996,0]
[null,"CHIHUAHUA","08DPT0007X",200,"ROCG680807P47","ROCG680807MCLLSR09","GRISELDA ROLDAN CASTILLO ",30102,204,83101,1001,"02","07","E3725",17,0,3,null,20200401,20200630,31161,0]
[null,"CHIHUAHUA","08DPT0007X",200,"RUGA7605108F9","RUGA760510MCHVTN01","MARIA ANTONIETA RUVALCABA GUTIERREZ",30102,96,83101,1001,"02","07","E3713",8,0,3,null,20200401,20200630,12745.2,0]
[null,"CHIHUAHUA","08DPT0007X",100,"SAMR880304CG8","SAMR880304HCHLXF03","RAFAEL SALAS MUÑOZ ",30102,240,83101,1001,"02","07","E3713",20,0,3,null,20200401,20200630,31863,0]
[null,"CHIHUAHUA","08DPT0007X",100,"SAFA580219G58","SAFA580219HVZMLL08","ALVARO SAMARIO FLORES ",30102,240,83101,1001,"02","07","E3725",20,0,3,null,20200401,20200630,36660,0]
[null,"CHIHUAHUA","08DPT0007X",100,"SAOA880909JJ6","SAOA880909HOCMSL00","ALVARO OSCAR SAMARIO OSORIO",30102,240,83101,1001,"02","07","E3711",20,0,3,null,20200401,20200630,28194,0]
[null,"CHIHUAHUA","08DPT0007X",200,"SAON851028RE1","SAON851028MVZMSL07","NALLELY SAMARIO OSORIO ",30102,96,83101,1001,"02","07","E3711",8,0,3,null,20200401,20200630,11277.6,0]
[null,"CHIHUAHUA","08DPT0007X",400,"SAEO910403QK8","SAEO910403HNLNSS08","OSCAR IVAN SANCHEZ ESTRADA ",30102,192,83101,1001,"02","07","E3711",16,0,3,null,20200401,20200630,22555.200000000001,0]
[null,"CHIHUAHUA","08DPT0007X",100,"SEEI760505188","SEEI760505MCHRSL09","ILSE SERRATOS ESPARZA ",30102,204,83101,1001,"02","07","E3725",17,0,3,null,20200401,20200630,31161,0]
[null,"CHIHUAHUA","08DPT0007X",200,"TAVY911105KV5","TAVY911105MCHGNS05","YASSMIN TAGLE VENZOR ",30102,240,83101,1001,"02","07","E3725",20,0,3,null,20200401,20200630,36660,0]
[null,"CHIHUAHUA","08DPT0007X",200,"TENA800305KZ2","TENA800305HCHJVN00","ANGEL ADRIAN TEJADA NEVAREZ ",30102,240,83101,1001,"02","07","E3725",20,0,3,null,20200401,20200630,36660,0]
[null,"CHIHUAHUA","08DPT0007X",200,"TORE8012234Y9","TORE801223HNTPYD08","EDGAR TOPETE REYES ",30102,216,83101,1001,"02","07","E3725",18,0,3,null,20200401,20200630,32994,0]
[null,"CHIHUAHUA","08DPT0007X",100,"TOCJ650407CT0","TOCJ650407HVZRNS07","JOSE TORRES CANTERO ",30102,240,83101,1001,"02","07","E3725",20,0,3,null,20200401,20200630,36660,0]
[null,"CHIHUAHUA","08DPT0007X",200,"TORN791114PY6","TORN791114MCHRYD07","NADIA MARIA TORRES REY ",30102,216,83101,1001,"02","07","E3725",18,0,3,null,20200401,20200630,32994,0]
[null,"CHIHUAHUA","08DPT0007X",100,"UUAR860131EV3","UUAR860131HCHRRF06","RAFAEL URTUZUASTEGUI ARZOLA ",30102,240,83101,1001,"02","07","E3725",20,0,3,null,20200401,20200630,36660,0]
[null,"CHIHUAHUA","08DPT0007X",200,"VAAF840608FK3","VAAF840608HCHZCR03","FERNANDO VAZQUEZ ACEVEDO ",30102,240,83101,1001,"02","07","E3713",20,0,3,null,20200401,20200630,31863,0]
[null,"CHIHUAHUA","08DPT0007X",200,"VIAS640217RZ1","VIAS640217HCHLGL08","SAUL VILLALOBOS AGUIRRE ",30102,228,83101,1001,"02","07","E3713",19,0,3,null,20200401,20200630,30269.849999999995,0]
[null,"CHIHUAHUA","08DPT0007X",100,"VIGR720403880","VIGR720403HVZLBC14","RICARDO VILLARAUZ GABINO ",30102,228,83101,1001,"02","07","E3725",19,0,3,null,20200401,20200630,34827,0]
[null,"CHIHUAHUA","08DPT0008W",100,"AUED570608MR1","AUED570608HZSGSN08","DANIEL AGUILAR ESPARZA",20201,480,83101,1001,"02","08","CF33203",0,"9354",2,null,20200401,20200630,53661.899999999994,0]
[null,"CHIHUAHUA","08DPT0008W",100,"BESJ800501RQ3","BESJ800501HCLRLL06","JULIO CESAR BERNAL SALAS",20214,480,83101,1001,"02","08","CF33206",0,13383,2,null,20200401,20200630,83706.86,0]
[null,"CHIHUAHUA","08DPT0008W",100,"EOCA6608284C4","EOCA660828HCHSRG02","AGUSTIN ESCOBAR CERVANTES",20214,480,83101,1001,"02","08","CF18201",0,12852,2,null,20200401,20200630,36589.25,0]
[null,"CHIHUAHUA","08DPT0008W",100,"GORL940810U53","GORL940810MCHMDR00","LARISSA GOMEZ RODRIGUEZ ",20401,480,83101,1001,"02","08","S01201",0,9358,2,null,20200401,20200630,22755.119999999999,0]
[null,"CHIHUAHUA","08DPT0008W",100,"HEGA690525I40","HEGA690525MCHRRL02","ALICIA HERNANDEZ GARCIA",20215,480,83101,1001,"02","08","AO3202",0,"13382",2,null,20200401,20200630,48671.76,0]
[null,"CHIHUAHUA","08DPT0008W",100,"MALM890515EN0","MALM890515HCHTCR05","MARIO ALBERTO MATA LICON",50101,480,83101,1001,"02","08","CF02103",0,"12588",5,null,20200401,20200630,85992.48,0]
[null,"CHIHUAHUA","08DPT0008W",100,"MEMF660302UM0","MEMF660302HCHNLD06","FEDERICO MENDOZA MOLINA",20305,480,83101,1001,"02","08","CF18203",0,"9369",2,null,20200401,20200630,54910.079999999994,0]
[null,"CHIHUAHUA","08DPT0008W",100,"MOAG600916JW6","MOAG600916HCHYCL04","GUILLERMO MOY ACOSTA",20214,480,83101,1001,"02","08","CF33206",0,13384,2,null,20200401,20200630,79779.75,0]
[null,"CHIHUAHUA","08DPT0008W",100,"OOVM6504302T1","OOVM650430HCHRLS07","MOISES OROZCO VALDEZ",20305,480,83101,1001,"02","08","CF18203",0,"9363",2,null,20200401,20200630,54910.079999999994,0]
[null,"CHIHUAHUA","08DPT0008W",100,"PANA720117JW4","PANA720117HDGLVN01","ANTONIO PALMA NEVAREZ",20206,480,83101,1001,"02","08","CF19201",0,"9365",2,null,20200401,20200630,48534.74,0]
[null,"CHIHUAHUA","08DPT0008W",100,"PAHA640330KP3","PAHA640330MCHYLR06","ARMIDA IRENE PAYAN HOLGUIN",20214,480,83101,1001,"02","08","CF33206",0,"13385",2,null,20200401,20200630,131759.72999999998,0]
[null,"CHIHUAHUA","08DPT0008W",100,"POAJ710301PK6","POAJ710301MCHRLS06","MARIA DE JESUS PORTILLO ALARCON",20216,480,83101,1001,"02","08","CF34201",0,"9358",2,null,20200401,20200630,37745.5,0]
[null,"CHIHUAHUA","08DPT0008W",100,"RIGR710129FB6","RIGR710129MCHVRQ06","RAQUEL ERENDIDA RIVERA GARCIA",20214,480,83101,1001,"02","08","CF04201",0,13382,2,null,20200401,20200630,130057.84000000001,0]
[null,"CHIHUAHUA","08DPT0008W",100,"ROGJ660820EP3","ROGJ660820HCHDNN02","JOSE JUAN RODRIGUEZ GONZALEZ",20401,480,83101,1001,"02","08","S01201",0,2431,2,null,20200401,20200630,29451.870000000003,0]
[null,"CHIHUAHUA","08DPT0008W",100,"SAML750404ND1","SAML750404MCHNXZ07","SAENZ MUNOZ LUZ MARIA",20401,480,83101,1001,"02","08","SO1201",0,9359,2,null,20200401,20200630,33485.17,0]
[null,"CHIHUAHUA","08DPT0008W",100,"TAHJ7109304KA","TAHJ710930HCHRLV01","JAVIER EUSEBIO TARANGO HOLGUIN",20214,480,83101,1001,"02","08","CF33206",0,"14089",2,null,20200401,20200630,118144.84000000001,0]
[null,"CHIHUAHUA","08DPT0008W",100,"VAGJ9208132AA","VAGJ920813HCHLRN08","JONHATAN VALDEZ GARCIA",20214,480,83101,1001,"02","08","CF18201",0,9367,2,null,20200401,20200630,27575.8,0]
[null,"CHIHUAHUA","08DPT0008W",100,"VARJ610925H36","VARJ610925HCHLSS00","JESUS ANTONIO VALDEZ ROSALES",20216,480,83101,1001,"02","08","S01202",0,9352,2,null,20200401,20200630,41625.910000000003,0]
[null,"CHIHUAHUA","08DPT0008W",100,"VAMA950227HC9","VAMA950227HCLLNL00","ALDO EUGENIO VALENCIANO MENDEZ ",50107,480,83101,1001,"02","08","CF02105",0,12852,5,null,20200401,20200630,66459.899999999994,0]
[null,"CHIHUAHUA","08DPT0008W",100,"VEGR750904UR2","VEGR750904MCHLRS06","ROSALIA MARGARITA VELARDE GARCIA",20214,480,83101,1001,"02","08","CF33206",0,9350,2,null,20200401,20200630,83706.86,0]
[null,"CHIHUAHUA","08DPT0008W",100,"VARO691222JA8","VAXR691222MCHLXS07","ROSA MARIA VALENZUELA",30102,216,83101,1003,"02","08","E3725",18,0,3,null,20200401,20200630,27272.7,0]
[null,"CHIHUAHUA","08DPT0008W",100,"AUMM780328A31","AUMM780328MCHGLN09","MINERVA AGUILAR MOLINAR",30102,240,83101,1003,"02","08","E3725",20,0,3,null,20200401,20200630,30303,0]
[null,"CHIHUAHUA","08DPT0008W",100,"AEGL800105RF6","AEGL800105MCHLNZ06","LIZETTE JOHANNA ALEJANDRO GONZALEZ",30102,240,83101,1003,"02","08","E3725",20,0,3,null,20200401,20200630,30303,0]
[null,"CHIHUAHUA","08DPT0008W",100,"AAGJ670423U8A","AAGJ670423HCHMNR05","JORGE AMPARAN GONZALEZ",30102,240,83101,1003,"02","08","E3725",20,0,3,null,20200401,20200630,30303,0]
[null,"CHIHUAHUA","08DPT0008W",100,"AESS721002N67","AESS721002MCHRTS00","SUSANA ARMENDARIZ SOTO",30102,240,83101,1003,"02","08","E3725",20,0,3,null,20200401,20200630,30303,0]
[null,"CHIHUAHUA","08DPT0008W",100,"BAVM821203FN0","BAVM821203MCHRLN06","MONICA LOURDES BARRAZA VILLALOBOS",30102,228,83101,1003,"02","08","E3725",19,0,3,null,20200401,20200630,28787.879999999997,0]
[null,"CHIHUAHUA","08DPT0008W",100,"CAVS820702FV1","CAVS820702MCHRRN01","SANDRA ELIZABETH CARDENAS VARGAS",30102,216,83101,1003,"02","08","E3713",18,0,3,null,20200401,20200630,23633.1,0]
[null,"CHIHUAHUA","08DPT0008W",100,"ROMJ731201675","CANA840815MCHRVN00","ANA ISABEL CARREON NAVA",30102,228,83101,1003,"02","08","E3713",19,0,3,null,20200401,20200630,24946.080000000002,0]
[null,"CHIHUAHUA","08DPT0008W",100,"COFA750408JB9","COFA750408MCHRRZ08","AZUCENA CORRAL FRANCO",30102,228,83101,1003,"02","08","E3725",19,0,3,null,20200401,20200630,28787.879999999997,0]
[null,"CHIHUAHUA","08DPT0008W",100,"DIHL770620B93","DIHL770620MCHZRZ06","LUZ IMELDA DIAZ HERNANDEZ",30102,216,83101,1003,"02","08","E3725",18,0,3,null,20200401,20200630,27272.7,0]
[null,"CHIHUAHUA","08DPT0008W",100,"DIHO910620AV5","DIHO910620MZSZRS07","OSIRIS DIAZ HERNANDEZ",30102,144,83101,1003,"02","08","E3711",18,0,3,null,20200401,20200630,21027.599999999999,0]
[null,"CHIHUAHUA","08DPT0008W",100,"GASJ850822GF7","GASJ850822HCHLNS04","JOSE GALVEZ SANTANA",30102,240,83101,1003,"02","08","E3725",20,0,3,null,20200401,20200630,30303,0]
[null,"CHIHUAHUA","08DPT0008W",100,"GASA8103319V2","GASA810331MCHRRD08","ADRIANA GARDEA SERRANO",30102,240,83101,1003,"02","08","E3713",20,0,3,null,20200401,20200630,26259,0]
[null,"CHIHUAHUA","08DPT0008W",100,"GULM750313628","GULM750313HCHLNN08","MANUEL ALEJANDRO GULLEN LUNA",30102,216,83101,1003,"02","08","E3725",18,0,3,null,20200401,20200630,27272.7,0]
[null,"CHIHUAHUA","08DPT0008W",100,"HEAJ8610295N1","HEAJ861029HCHRCN09","JUAN CARLOS HERNANDEZ ACOSTA ",30102,240,83101,1003,"02","08","E3725",20,0,3,null,20200401,20200630,30303,0]
[null,"CHIHUAHUA","08DPT0008W",100,"HEGE760311918","HEGE760311HCHRTF05","EFRAIN ARTURO HERNANDEZ GUTIERREZ",30102,216,83101,1003,"02","08","E3701",18,0,3,null,20200401,20200630,21027.599999999999,0]
[null,"CHIHUAHUA","08DPT0008W",100,"MAML7703077T7","MAML770307MCHCRS01","LESSLEY MYRLEE MACIAS MARTINEZ",30102,216,83101,1003,"02","08","E3725",18,0,3,null,20200401,20200630,27272.7,0]
[null,"CHIHUAHUA","08DPT0008W",100,"MAEJ690219AK2","MAEJ690219HCHRSS06","JESUS MARTINEZ ESPARZA",30102,240,83101,1003,"02","08","E3725",20,0,3,null,20200401,20200630,30303,0]
[null,"CHIHUAHUA","08DPT0008W",100,"MEMR7702148Q4","MEMR770214HCHLNC02","RICARDO MELENDEZ MENDOZA",30102,80,83101,1003,"02","08","E3711",10,0,3,null,20200401,20200630,11682,0]
[null,"CHIHUAHUA","08DPT0008W",100,"MECO5508271G3","MECO550827MSLXSL09","MEXIA CASTRO OLGA PATRICIA",30102,240,83101,1003,"02","08","E3725",20,0,3,null,20200401,20200630,30303,0]
[null,"CHIHUAHUA","08DPT0008W",100,"MOGE730414EA4","MOGE730414HCHRRL09","MORENO GARCIA ELISEO",30102,216,83101,1003,"02","08","E3711",18,0,3,null,20200401,20200630,21027.599999999999,0]
[null,"CHIHUAHUA","08DPT0008W",100,"MUMP8911284K8","MUMP891128HCHXXS06","PASCUAL ABRAHAM MUÑOZ MUÑOZ",30102,240,83101,1003,"02","08","E3713",20,0,3,null,20200401,20200630,26259,0]
[null,"CHIHUAHUA","08DPT0008W",100,"NAHJ790815BF0","NAHJ790815HCHVRS00","JESUS MIGUEL NAVARRO HERNANDEZ",30102,240,83101,1003,"02","08","E3711",20,0,3,null,20200401,20200630,23364,0]
[null,"CHIHUAHUA","08DPT0008W",100,"OIGM890424IC1","OIGM890424MCHLRR06","MARTHA ALEJANDRA OLIVAS GUERRERO",30102,228,83101,1003,"02","08","E3725",19,0,3,null,20200401,20200630,28787.879999999997,0]
[null,"CHIHUAHUA","08DPT0008W",100,"OINS5902223YA","OINS590222HMNLXL02","OLIVO NUÑEZ JOSE SALVADOR",30102,240,83101,1003,"02","08","E3725",20,0,3,null,20200401,20200630,30303,0]
[null,"CHIHUAHUA","08DPT0008W",100,"PAFV661205KZ5","PAFV661205HCHTRC01","PATENA FIERRO VICTOR MANUEL",30102,216,83101,1003,"02","08","E3713",18,0,3,null,20200401,20200630,27272.7,0]
[null,"CHIHUAHUA","08DPT0008W",100,"RATV881128H34","RATV881128HCHMRC05","VICTOR HUGO RAMIREZ",30102,80,83101,1003,"02","08","E3711",10,0,3,null,20200401,20200630,11682,0]
[null,"CHIHUAHUA","08DPT0008W",100,"RERP770809FK9","RERP770809HCHDDD04","PEDRO OSWALDO REDE RODRIGUEZ",30102,216,83101,1003,"02","08","E3725",18,0,3,null,20200401,20200630,27272.7,0]
[null,"CHIHUAHUA","08DPT0008W",100,"REVY780409NT1","REVY780409MCHYLZ05","YASMIN LISSET REYES VALLES",30102,240,83101,1003,"02","08","E3713",20,0,3,null,20200401,20200630,26259,0]
[null,"CHIHUAHUA","08DPT0008W",100,"RIGJ610311956","RIGJ610311HDFVRL08","JOEL RAUL RIVAS GARCIA",30102,216,83101,1003,"02","08","E3713",18,0,3,null,20200401,20200630,23633.1,0]
[null,"CHIHUAHUA","08DPT0008W",100,"ROGR680108PWA","ROGR680108HCHDRC09","RICARDO RODRIGUEZ GARCIA",30102,120,83101,1003,"02","08","E3725",10,0,3,null,20200401,20200630,15151.5,0]
[null,"CHIHUAHUA","08DPT0008W",100,"SADR840831726","SADR840831HCHNZM02","RAMON AGUSTO SANCHEZ DIAZ",30102,120,83101,1003,"02","08","E3725",10,0,3,null,20200401,20200630,15151.5,0]
[null,"CHIHUAHUA","08DPT0008W",100,"SARJ650111CB4","SARJ650111HCHNVM05","JAIME SANCHEZ RIVERA",30102,120,83101,1003,"02","08","E3725",10,0,3,null,20200401,20200630,15151.5,0]
[null,"CHIHUAHUA","08DPT0008W",100,"TAGR880916H31","TAGR880916MCHLNS09","ROSA CAROLINA TALAMANTES GONZALEZ",30102,132,83101,1003,"02","08","E3711",11,0,3,null,20200401,20200630,12850.2,0]
[null,"CHIHUAHUA","08DPT0008W",100,"VAVS740521TK5","VAVS740521HCHLLL09","SAUL ARMANDO VALLES VALLE",30102,180,83101,1003,"02","08","E3725",15,0,3,null,20200401,20200630,22727.280000000002,0]
[null,"CHIHUAHUA","08DPT0008W",100,"VICG5002047Q6","VICG500204HCHTRL01","GILBERTO FELICIANO VITELA CARRASCO",30102,240,83101,1003,"02","08","E3725",20,0,3,null,20200401,20200630,10101,0]
[null,"CHIHUAHUA","08DPT0012I",124,"CAMC8511068L5","CAMC851106MCHRRR00","CARMEN IVONNE CARMONA MURILLO","20216",480,83101,1003,"02","18","SO1201",0,9680,2,null,20200401,20200630,31150.369999999995,0]
[null,"CHIHUAHUA","08DPT0012I",100,"CAJG690110UD1","CAJG690110HCHHRN00","GONZALO CHAVEZ JUAREZ","20109",480,83101,1003,"02","18","CF33206",0,13932,2,null,20200401,20200630,79779.75,0]
[null,"CHIHUAHUA","08DPT0012I",124,"COVC830703U30","COVC830703MCHRZY01","CYNTHIA ROSARIO CORONADO VAZQUEZ","20109",480,83101,1003,"02","18","CF33206",0,14308,2,null,20200401,20200630,98758.42,0]
[null,"CHIHUAHUA","08DPT0012I",124,"EIRL670407TS6","EIRL670407MCHNDT08","LETICIA ENRIQUEZ RODRIGUEZ","20105",480,83101,1003,"02","18","CF33206",0,13933,2,null,20200401,20200630,135048.34999999998,0]
[null,"CHIHUAHUA","08DPT0012I",124,"GACI7107098NA","GACI710709MCHRRM01","IMELDA IVONE GARCIA CARMONA","20201",480,83101,1003,"02","18","CF33203",0,9688,2,null,20200401,20200630,54243.75,0]
[null,"CHIHUAHUA","08DPT0012I",124,"GOMB690116428","GOMB690116MCHNRL02","BELIA LORENA GONZALEZ  MORENO","20206",480,83101,1003,"02","18","A03202",0,9677,2,null,20200401,20200630,49421.909999999989,0]
[null,"CHIHUAHUA","08DPT0012I",124,"IAMM880831RY4","IAMM880831MCHZRR03","MAR ELISA IZAGUIRRE MARTINEZ","20216",480,83101,1003,"02","18","A03202",0,9678,2,null,20200401,20200630,43263.18,0]
[null,"CHIHUAHUA","08DPT0012I",124,"LECG700827GY1","LECG700827MCHCHL00","GLORIA A LECHUGA CHAVEZ","20201",480,83101,1003,"02","18","CF33204",0,9675,2,null,20200401,20200630,87272.34,0]
[null,"CHIHUAHUA","08DPT0012I",124,"LOLJ670723J90","LOLJ670723HCHPZV05","JAVIER LOPEZ LOZANO","20401",480,83101,1003,"02","18","SO1201",0,9681,2,null,20200401,20200630,31150.369999999995,0]
[null,"CHIHUAHUA","08DPT0012I",124,"MAAS821018113","MAAS821018HCHRNG05","SIGIFREDO MARQUEZ ANCHONDO","20216",480,83101,1003,"02","18","CF18203",0,8788,2,null,20200401,20200630,45250.200000000004,0]
[null,"CHIHUAHUA","08DPT0012I",124,"MAQS651014TH4","MAQS651014HCHRNL03","SAUL MARQUEZ QUINTANA","20302",480,83101,1003,"02","18","CF18201",0,9689,2,null,20200401,20200630,38464.94,0]
[null,"CHIHUAHUA","08DPT0012I",124,"PEDR620906HG6","PEDR620906HCHRMM07","RAMON JAVIER PEREZ DOMINGUEZ","20109",480,83101,1003,"02","18","CF33206",0,13934,2,null,20200401,20200630,84403.62000000001,0]
[null,"CHIHUAHUA","08DPT0012I",124,"ROCR700830F58","ROCR700830HCHDNC08","RICARDO ANTELMO RODRIGUEZ CANO","20302",480,83101,1003,"02","18","S01202",0,9681,2,null,20200401,20200630,41287.83,0]
[null,"CHIHUAHUA","08DPT0012I",124,"ROTF760823LY5","ROTF760823MCHDRL03","FLOR GUADALUPE RODRIGUEZ TREJO","20216",480,83101,1003,"02","18","CF04201",0,9676,2,null,20200401,20200630,44793.4,0]
[null,"CHIHUAHUA","08DPT0012I",124,"SOMD561124TEA","SOMD561124HCHTDV09","DAVID SOTELO MEDRANO","20205",480,83101,1003,"02","18","T08201",0,11851,2,null,20200401,20200630,49713.69000000001,0]
[null,"CHIHUAHUA","08DPT0012I",124,"TERL781019J60","TERL781019HCHNDS08","LUIS CARLOS TENA RODELAS","20206",480,83101,1003,"02","18","CF21202",0,9694,2,null,20200401,20200630,45661.68,0]
[null,"CHIHUAHUA","08DPT0012I",124,"UIST6008045JA","UIST600804HDGRMM07","TOMAS URBINA SIMENTAL","20216",480,83101,1003,"02","18","CF18203",0,9691,2,null,20200401,20200630,53141.8,0]
[null,"CHIHUAHUA","08DPT0012I",124,"VAGA800112LSA","VAGA800112HCHLTL07","ALBERTO VALENZUELA GUTIERREZ",20216,480,83101,1003,"02","18","CF19201",0,9692,2,null,20200401,20200630,36921.280000000006,0]
[null,"CHIHUAHUA","08DPT0012I",200,"AARP7710257KA","AARP771025MCHLZL02","PALMA LILIANA ALMANZA RUIZ","30102",168,83101,1001,"02","18","E3725","14.0",0,3,null,20200401,20200630,21212.1,0]
[null,"CHIHUAHUA","08DPT0012I",124,"AAOG811026Q47","AAOG811026MCHRRB02","GABRIELA MARIA ARAGON ORTIZ","30102",240,83101,1001,"02","18","E3725","20.0",0,3,null,20200401,20200630,30303,0]
[null,"CHIHUAHUA","08DPT0012I",100,"AEGL940102TD8","AEGL940102HCHRNS03","LUIS DANIEL ARMENDARIZ GONZALEZ","30102",192,83101,1001,"02","18","E3711","16.0",0,3,null,20200401,20200630,18691.2,0]
[null,"CHIHUAHUA","08DPT0012I",100,"BALL820222AW6","BALL820222HCHYNR00","LORENZO ANTONIO BAYLON DE LEON","30102",192,83101,1001,"02","18","E3711","16.0",0,3,null,20200401,20200630,18691.2,0]
[null,"CHIHUAHUA","08DPT0012I",100,"CARE8810091J2","CARE881009HCHRMD08","EDGAR ENRIQUE CARREON RAMOS","30102",228,83101,1001,"02","18","E3725","19.0",0,3,null,20200401,20200630,28787.879999999997,0]
[null,"CHIHUAHUA","08DPT0012I",100,"CACP850903KT2","CACP850903MCHHHR00","PERLA JAZMIN CHAIREZ CHACON","30102",216,83101,1001,"02","18","E3725","18.0",0,3,null,20200401,20200630,27272.7,0]
[null,"CHIHUAHUA","08DPT0012I",200,"CAMN760505UE4","CAMN760505MCHHNN03","NANCY LORENA CHAVEZ MONCADA","30102",180,83101,1001,"02","18","E3725","15.0",0,3,null,20200401,20200630,22727.280000000002,0]
[null,"CHIHUAHUA","08DPT0012I",100,"PEMC8412061M5","PEMC841206HCHXRR02","CARLOS DE LA PEÑA MERAZ","30102",240,83101,1001,"02","18","E3725","20.0",0,3,null,20200401,20200630,30303,0]
[null,"CHIHUAHUA","08DPT0012I",100,"DOCE610806AJ3","DOCE610806MCHMMS03","ESPERANZA DOMINGUEZ CAMUÑEZ","30102",216,83101,1001,"02","18","E3711","18.0",0,3,null,20200401,20200630,21027.599999999999,0]
[null,"CHIHUAHUA","08DPT0012I",200,"DOTW8710023S3","DOTW871002HCHMRL06","WALTER ALEJANDRO DOMINGUEZ TORRES","30102",192,83101,1001,"02","18","E3725","16.0",0,3,null,20200401,20200630,24242.400000000001,0]
[null,"CHIHUAHUA","08DPT0012I",124,"DUIA911217JM8","DUIA911217HCHRBR05","ARMANDO ALEXIS DUARTE IBARRA","30102",240,83101,1001,"02","18","E3713","20.0",0,3,null,20200401,20200630,26259,0]
[null,"CHIHUAHUA","08DPT0012I",124,"EIRK930402BZ7","EIRK930402MCHNDR04","KARINA LIZETH ENRIQUEZ RODRIGUEZ","30102",216,83101,1001,"02","18","E3711","18.0",0,3,null,20200401,20200630,21027.599999999999,0]
[null,"CHIHUAHUA","08DPT0012I",200,"EACL761108IA6","EACL761108HCHSHS08","JOSE LUIS ESTRADA CHAVEZ","30102",168,83101,1001,"02","18","E3701","14.0",0,3,null,20200401,20200630,12024.6,0]
[null,"CHIHUAHUA","08DPT0012I",124,"FITM7609208P9","FITM760920MCHGVR05","MARISOL FIGUEROA TOVAR","30102",216,83101,1001,"02","18","E3725","18.0",0,3,null,20200401,20200630,27272.7,0]
[null,"CHIHUAHUA","08DPT0012I",100,"GAMC820716BJ4","GAMC820716MCHLRR08","MARIA DEL CARMEN GALLEGOS MARTINEZ","30102",240,83101,1001,"02","18","E3725","20.0",0,3,null,20200401,20200630,30303,0]
[null,"CHIHUAHUA","08DPT0012I",100,"GOCS820528T91","GOCS820528MCHNLN05","SANDRA BERENICE GONZALEZ COLMENERO","30102",240,83101,1001,"02","18","E3725","20.0",0,3,null,20200401,20200630,30303,0]
[null,"CHIHUAHUA","08DPT0012I",100,"GOGG631226J88","GOGG631226MCHNLL06","GLORIA MARINA GONZALEZ GALLEGOS","30102",240,83101,1001,"02","18","E3725","20.0",0,3,null,20200401,20200630,30303,0]
[null,"CHIHUAHUA","08DPT0012I",124,"GOQM960413969","GOQM960413HCHNXR03","MARCO ANTONIO GONZALEZ QUIÑONEZ","30102",204,83101,1001,"02","18","E3701","17.0",0,3,null,20200401,20200630,14601.3,0]
[null,"CHIHUAHUA","08DPT0012I",100,"GAMO630830H94","GAMO630830MCHRRL07","OLGA CECILIA GRAJEDA  MIRAMONTES","30102",120,83101,1001,"02","18","E3725","10.0",0,3,null,20200401,20200630,15151.5,0]
[null,"CHIHUAHUA","08DPT0012I",124,"HEGP741201TCA","HEGP741201MCHRRT03","PATRICIA OLAYA HERRERA GARCIA","30102",228,83101,1001,"02","18","E3725","19.0",0,3,null,20200401,20200630,28787.879999999997,0]
[null,"CHIHUAHUA","08DPT0012I",100,"IAPJ9005168T2","IAPJ900516MCHBRS04","JESIKA EDITH IBARRA PEREZ","30102",144,83101,1001,"02","18","E3711","12.0",0,3,null,20200401,20200630,14018.4,0]
[null,"CHIHUAHUA","08DPT0012I",200,"IAFR620519979","IAFR620519HSLZRM07","RAMON  IZAGUIRRE FIERRO","30102",240,83101,1001,"02","18","E3713","20.0",0,3,null,20200401,20200630,26259,0]
[null,"CHIHUAHUA","08DPT0012I",200,"JAAG74101784A","JAAG741017MCHQRL01","GLORIA LINDA JAQUEZ ARBALLO","30102",240,83101,1001,"02","18","E3725","20.0",0,3,null,20200401,20200630,30303,0]
[null,"CHIHUAHUA","08DPT0012I",124,"LAGL890709J41","LAGL890709MCHZNL07","LLUVIA CRISTINA LAZO GONZALEZ","30102",228,83101,1001,"02","18","E3725","19.0",0,3,null,20200401,20200630,28787.879999999997,0]
[null,"CHIHUAHUA","08DPT0012I",200,"MALS840210DM2","MALS840210MCHCYL02","SILVIA ISELA MACIAS LOYA","30102",120,83101,1001,"02","18","E3725","10.0",0,3,null,20200401,20200630,15151.5,0]
[null,"CHIHUAHUA","08DPT0012I",200,"MATM841124GU1","MATM841124MCHRLY00","MAYTEE ABRIL MARQUEZ TELLO","30102",180,83101,1001,"02","18","E3725","15.0",0,3,null,20200401,20200630,22727.280000000002,0]
[null,"CHIHUAHUA","08DPT0012I",200,"MAGM880802UR1","MAGM880802MCHRRR08","MARINA ANGELICA MARTINEZ GARCIA","30102",228,83101,1001,"02","18","E3725","19.0",0,3,null,20200401,20200630,28787.879999999997,0]
[null,"CHIHUAHUA","08DPT0012I",124,"MEOE6606187C0","MEOE660618HCHLRF02","EFREN MELENDEZ ORTIZ","30102",216,83101,1001,"02","18","E3725","18.0",0,3,null,20200401,20200630,27272.7,0]
[null,"CHIHUAHUA","08DPT0012I",100,"MERA900126FD2","MERA900126MCHNMN03","ANA ISABEL MENDOZA RAMOS","30102",240,83101,1001,"02","18","E3713","20.0",0,3,null,20200401,20200630,26259,0]
[null,"CHIHUAHUA","08DPT0012I",200,"MOEJ8410204P7","MOEJ841020HCHRSS09","JESUS MORENO ESTRADA","30102",216,83101,1001,"02","18","E3725","18.0",0,3,null,20200401,20200630,27272.7,0]
[null,"CHIHUAHUA","08DPT0012I",100,"NAAH950220UHA","NAAH950220MCHKNR00","HARUMI VALERIA NAKAMURA ANCHONDO","30102",120,83101,1001,"02","18","E3711","10.0",0,3,null,20200401,20200630,11682,0]
[null,"CHIHUAHUA","08DPT0012I",100,"NUMR860506DV4","NUMR860506MCHXRQ03","RAQUEL NUÑEZ MARTINEZ","30102",120,83101,1001,"02","18","E3725","10.0",0,3,null,20200401,20200630,15151.5,0]
[null,"CHIHUAHUA","08DPT0012I",200,"OIPC830620AE8","OIPC830620HCHRRR03","CARLOS ALEJANDRO ORTIZ PAREDES","30102",240,83101,1001,"02","18","E3725","20.0",0,3,null,20200401,20200630,30303,0]
[null,"CHIHUAHUA","08DPT0012I",100,"PAVC680810379","PAVC680810MCHLLR09","CARMEN LORENA PALMA VALVERDE","30102",240,83101,1001,"02","18","E3725","20.0",0,3,null,20200401,20200630,30303,0]
[null,"CHIHUAHUA","08DPT0012I",200,"PAVK8303143F4","PAVK830314MCHYLR05","KARLA DENISSE PAYAN VALVERDE","30102",240,83101,1001,"02","18","E3725","20.0",0,3,null,20200401,20200630,30303,0]
[null,"CHIHUAHUA","08DPT0012I",100,"POED8604086S3","POED860408MCHRCN03","DIANA ELIZABETH PORTILLO ECHAVARRIA","30102",240,83101,1001,"02","18","E3725","20.0",0,3,null,20200401,20200630,30303,0]
[null,"CHIHUAHUA","08DPT0012I",200,"ROAN6811104YA","ROAN681110HVZDGX08","JOSE NOE RODRIGUEZ AGUILERA","30102",168,83101,1001,"02","18","E3725","14.0",0,3,null,20200401,20200630,21212.1,0]
[null,"CHIHUAHUA","08DPT0012I",100,"ROVC830522ILA","ROVC830522MCHDLR00","CRISTINA RODRIGUEZ VALVERDE","30102",216,83101,1001,"02","18","E3711","18.0",0,3,null,20200401,20200630,21027.599999999999,0]
[null,"CHIHUAHUA","08DPT0012I",100,"SAME780216645","SAME780216MCHCLS05","ESMERALDA SAUCEDO MOLINA","30102",240,83101,1001,"02","18","E3725","20.0",0,3,null,20200401,20200630,30303,0]
[null,"CHIHUAHUA","08DPT0012I",124,"SATL841206QI8","SATL841206HCHZRS00","LUIS MIGUEL SAUZAMEDA TORRES","30102",228,83101,1001,"02","18","E3711","19.0",0,3,null,20200401,20200630,22195.8,0]
[null,"CHIHUAHUA","08DPT0012I",200,"UUGA831111DY9","UUGA831111MCHRND03","ADRIANA ARMINE URQUIZA GONZALEZ","30102",240,83101,1001,"02","18","E3725","20.0",0,3,null,20200401,20200630,30303,0]
[null,"CHIHUAHUA","08DPT0012I",200,"VATL8403292K8","VATL840329HCHLRS05","LUIS OCTAVIO VALVERDE TORRES","30102",240,83101,1001,"02","18","E3713","20.0",0,3,null,20200401,20200630,26259,0]
[null,"CHIHUAHUA","08DPT0012I",100,"VACA8309027BA","VXCA830902HCHZHN07","ANDRES VAZQUEZ  CHAVEZ","30102",240,83101,1001,"02","18","E3725","20.0",0,3,null,20200401,20200630,30303,0]
[null,"CHIHUAHUA","08DPT0012I",124,"VIVR8208282I1","VIVR820828HDGLLB03","ROBERTO RENE VILLALPALDO VILLALPANDO","30102",240,83101,1001,"02","18","E3701","20.0",0,3,null,20200401,20200630,17178,0]
[null,"CHIHUAHUA","08DPT0011J",120,"AAEJ730109C94","AAEJ730109HCHLSL06","JULIAN  ALVAREZ ESCARCEGA ","20206",480,83101,1003,"02",19,"S01201",0,"9738",2,null,20200401,20200630,31150.31,0]
[null,"CHIHUAHUA","08DPT0011J",120,"AOJS831129TE8","AOJS831129MCHNRL09","SILVIA GRACIELA ANCHONDO JUAREZ ",20206,480,83101,1003,"02",19,"A03202",0,"2386",2,null,20200401,20200630,41402.94,0]
[null,"CHIHUAHUA","08DPT0011J",120,"AOLY671118ELA","AOLY671118MDGRCZ05","YAZMIN ARROYO LECHUGA ",20109,480,83101,1003,"02",19,"CF33206",0,"14302",2,null,20200401,20200630,124837.2,0]
[null,"CHIHUAHUA","08DPT0011J",120,"AIAA780609P70","AIAA780609HCHVGG01","AGUSTIN AVITIA AGUILAR ",50201,480,83101,1003,"02",19,"CF02105",0,"14576",5,null,20200401,20200630,66459.899999999994,0]
[null,"CHIHUAHUA","08DPT0011J",120,"BARM6606271QA","BARM660627HCHRBR03","MARIO ALBERTO BARBA RUBIO",20202,480,83101,1003,"02",19,"S01202",0,"9722",2,null,20200401,20200630,34618.54,0]
[null,"CHIHUAHUA","08DPT0011J",120,"CAMF661018JC7","CAMF661018HCHHDR08","FRANCISCO JAVIER CABRERA MEDINA","20205",480,83101,1003,"02",19,"CF33204",0,"6359",2,null,20200401,20200630,89111.94,0]
[null,"CHIHUAHUA","08DPT0011J",120,"CAVJ9010233Z3","CAVJ901023MCHXZH05","JAHAIRA ARANI CAÑAS VAZQUEZ ",20205,480,83101,1003,"02",19,"CF33204",0,"9734",2,null,20200401,20200630,57302.73,0]
[null,"CHIHUAHUA","08DPT0011J",120,"EUGM7504107E2","EUGM750410HCHSRR05","MAURO EZEQUIEL ESQUIVEL GUERRERO ",20216,80,83101,1003,"02",19,"S01202",0,"9718",2,null,20200616,20200630,5574.08,0]
[null,"CHIHUAHUA","08DPT0011J",120,"FACG681029MZ8","FACG681029MCHDRR04","GEORGINA FAUDOA CRUZ","50408",480,83101,1003,"02",19,"CF19201",0,9706,2,null,20200401,20200630,50681.16,0]
[null,"CHIHUAHUA","08DPT0011J",120,"FUCJ631107GN9","FUCJ611107MCHNHL09","JULIETA FUENTES CHAVEZ",20109,480,83101,1003,"02",19,"CF33206",0,"14303",2,null,20200401,20200630,106708.68,0]
[null,"CHIHUAHUA","08DPT0011J",120,"GAGJ740328P75","GAGJ740328HCHLNR03","JORGE ARTURO GALLEGOS GONZALEZ","20109",480,83101,1003,"02",19,"CF18203",0,"9725",2,null,20200401,20200630,45738.6,0]
[null,"CHIHUAHUA","08DPT0011J",120,"GOML880120US2","GOML880120MCHMNZ01","GOMEZ MENDOZA LUZ IVONNE",20214,160,83101,1003,"02",19,"S01202",0,"9737",2,null,20200601,20200630,24403.32,0]
[null,"CHIHUAHUA","08DPT0011J",120,"GOQG650428BVA","GOQG650428MCHNNR07","GEORGINA GONZALEZ QUINTANA","20216",480,83101,1003,"02",19,"A03202",0,"9700",2,null,20200401,20200630,44342.58,0]
[null,"CHIHUAHUA","08DPT0011J",120,"GURJ541104T10","GURJ541104HCHRMS04","JESUS LUIS GUERRA RAMIREZ","20206",480,83101,1003,"02",19,"S01202",0,"9720",2,null,20200401,20200630,45601.59,0]
[null,"CHIHUAHUA","08DPT0011J",120,"HEAT6405082U8","HEAT640508MCHRNR05","MARIA TERESA HERNANDEZ ANCHONDO ",20214,160,83101,1003,"02",19,"S01201",0,"9723",2,null,20200601,20200630,22755.119999999999,0]
[null,"CHIHUAHUA","08DPT0011J",120,"HENE680323MJ1","HENE680323MCHRRL03","ELIDA HERNANDEZ NORES","20214",480,83101,1003,"02",19,"A03202",0,"9701",2,null,20200401,20200630,48635.4,0]
[null,"CHIHUAHUA","08DPT0011J",120,"LIGG8206272AA","LIGG820627HCLRRZ15","GIEZI LIRA GARCIA","20214",480,83101,1003,"02",19,"CF18203",0,"9710",2,null,20200401,20200630,46227.06,0]
[null,"CHIHUAHUA","08DPT0011J",120,"LOPO671113I30","LOPO671113HCHPRS00","OSCAR BENJAMIN LOPEZ PEREZ","20216",480,83101,1003,"02",19,"CF33206",0,"13188",2,null,20200401,20200630,126654.16,0]
[null,"CHIHUAHUA","08DPT0011J",120,"MAGI710826BY5","MAGI710826HCHRNV05","IVONNE ARACELI MARTINEZ GONZALEZ","20216",480,83101,1003,"02",19,"CF33204",0,"9699",2,null,20200401,20200630,84025.09,0]
[null,"CHIHUAHUA","08DPT0011J",120,"MAVE810424SY3","MAVE810424MCHRLL08","ELIA ZURASY MARTINEZ VELO","20206",480,83101,1003,"02",19,"S01202",0,"9738",2,null,20200401,20200630,35440.370000000003,0]
[null,"CHIHUAHUA","08DPT0011J",120,"MEGM480906839","MEGM480906HCHNNG00","MIGUEL ANGEL MENDOZA GONZALEZ","20206",480,83101,1003,"02",19,"S01201",0,"9728",2,null,20200401,20200630,34990.129999999997,0]
[null,"CHIHUAHUA","08DPT0011J",120,"MOCY820701FR6","MOCY820701MCHRHS01","YESSENIA IVONNE MORENO CHAVEZ ","20202",480,83101,1003,"02",19,"CF33206",0,"13640",2,null,20200401,20200630,113409.28,0]
[null,"CHIHUAHUA","08DPT0011J",120,"NIRF750722BR7","NIRF750722HCHXDL02","FILIBERTO NIÑO RODRIGUEZ ",20202,480,83101,1003,"02",19,"CF18201",0,"9722",2,null,20200401,20200630,22755.119999999999,0]
[null,"CHIHUAHUA","08DPT0011J",120,"OIFL620226IA5","OIFL620226MCHLLD03","LIDIA GUADALUPE OLIVAS FLORES",20102,480,83101,1003,"02",19,"CF33206",0,"14303",2,null,20200401,20200630,82716.06,0]
[null,"CHIHUAHUA","08DPT0011J",120,"OESN6905137N5","OESN690513MCHRCR06","NORMA ORTEGA SCOTT","20104",480,83101,1003,"02",19,"CF33204",0,"9704",2,null,20200401,20200630,86829.75,0]
[null,"CHIHUAHUA","08DPT0011J",120,"REVB701115KRA","REVB701115MCHGTH02","BHERDINA REGALADO VITELA ",20109,480,83101,1003,"02",19,"CF33206",0,"13639",2,null,20200401,20200630,126539.04,0]
[null,"CHIHUAHUA","08DPT0011J",120,"ROAA860101KQ4","ROAA860101HCHCNL04","JOSE ALBERTO ROCHA ANTUNA",20206,480,83101,1003,"02",19,"CF18201",0,"9776",2,null,20200401,20200630,29772.03,0]
[null,"CHIHUAHUA","08DPT0011J",120,"RUAJ680828NZ1","RUAJ680828HCHZGN01","JUAN CARLOS RUIZ AGUIRRE","20214",480,83101,1003,"02",19,"S01201",0,"9709",2,null,20200401,20200630,30908.98,0]
[null,"CHIHUAHUA","08DPT0011J",120,"SADC620717A78","SADC620717MCHLMR01","CARMEN ESTELA SALAS DOMINGUEZ",20214,480,83101,1003,"02",19,"CF33204",0,"9702",2,null,20200401,20200630,72432.990000000005,0]
[null,"CHIHUAHUA","08DPT0011J",120,"SACG701206260","SACG701206MCHLND02","MARIA GUADALUPE SALAZAR CONTRERAS","20214",480,83101,1003,"02",19,"CF33204",0,"9730",2,null,20200401,20200630,89589.15,0]
[null,"CHIHUAHUA","08DPT0011J",120,"SAOD961029SV8","SAOD961029MCHNRN08","DIANA GUADALUPE SANDATE ORTEGA",20216,400,83101,1003,"02",19,"SO1202",0,"9738",2,null,20200401,20200615,20336.099999999999,0]
[null,"CHIHUAHUA","08DPT0011J",120,"VAAG6312036W2","VAAG631203HTSLVR03","GERARDO VALDEZ AVILA",50201,480,83101,1003,"02",19,"CF02103",0,"12652",5,null,20200401,20200630,85992.48,0]
[null,"CHIHUAHUA","08DPT0011J",120,"VIDV791004RJ0","VIDV791004MCHLRR04","VIRGINIA VILLALBA DURAN","20206",480,83101,1003,"02",19,"CF04201",0,"9696",2,null,20200401,20200630,45193.74,0]
[null,"CHIHUAHUA","08DPT0011J",120,"VIMS620916I47","VIMS620916MCHLRN00","SANDRA HORTENSIA VILLALOBOS MARIN","20214",480,83101,1003,"02",19,"CF33204",0,"2404",2,null,20200401,20200630,86277.87,0]
[null,"CHIHUAHUA","08DPT0011J",120,"VIYD6702201Q6","VIYD670220MCHLXR09","DORA EMMA VILLALOBOS YAÑEZ","20214",480,83101,1003,"02",19,"A03202",0,"9695",2,null,20200401,20200630,46489.02,0]
[null,"CHIHUAHUA","08DPT0011J",120,"AOAJ720609R46","AOAJ720609MCHCLS06","MARIA DE JESUS ACOSTA ALVAREZ",30102,240,83101,1001,"02",19,"E3711",20,0,3,null,20200401,20200630,23364,0]
[null,"CHIHUAHUA","08DPT0011J",120,"AORC6607129B3","AORC660712HCHCMS03","CESAR RENE ACOSTA ROMO",30102,180,83101,1001,"02",19,"E3713",15,0,3,null,20200401,20200630,19694.28,0]
[null,"CHIHUAHUA","08DPT0011J",120,"AUVX671108950","AUVX671108MCHGLC09","XOCHITL MARGARITA AGUILAR VILLALOBOS",30102,180,83101,1001,"02",19,"E3725",15,0,3,null,20200401,20200630,22727.279999999999,0]
[null,"CHIHUAHUA","08DPT0011J",120,"AADF760822JB4","AADF760822MCHLML07","FLOR ANEL ALMANZA DOMINGUEZ",30102,216,83101,1001,"02",19,"E3725",18,0,3,null,20200401,20200630,27272.699999999997,0]
[null,"CHIHUAHUA","08DPT0011J",120,"AADF541004UL3","AADF541004HDGLMR07","FRANCISCO ALVARADO DOMINGUEZ",30102,192,83101,1001,"02",19,"E3725",16,0,3,null,20200401,20200630,24242.400000000001,0]
[null,"CHIHUAHUA","08DPT0011J",120,"AAGD820816HU2","AAGD820816MCHLTL09","DALYLA ALVARADO GUTIERREZ",30102,204,83101,1001,"02",19,"E3725",17,0,3,null,20200401,20200630,25757.58,0]
[null,"CHIHUAHUA","08DPT0011J",120,"AASE930324BT6","AASE930324MCHLLD02","EDITH ALVAREZ SALASAR",30102,216,83101,1001,"02",19,"E3711",18,0,3,null,20200401,20200630,23633.1,0]
[null,"CHIHUAHUA","08DPT0011J",120,"AIRL900105A19","AIRL900105HCHLSS09","JOSE LUIS ALVIDREZ RIOS",30102,228,83101,1001,"02",19,"E3725",19,0,3,null,20200401,20200630,28787.879999999997,0]
[null,"CHIHUAHUA","08DPT0011J",120,"AALU670310HX2","AAXL670310HCHMXS16","LUIS CARLOS AMAYA X",30102,192,83101,1001,"02",19,"E3725",16,0,3,null,20200401,20200630,24242.400000000001,0]
[null,"CHIHUAHUA","08DPT0011J",120,"AAAM8805014VA","AAAM880501MCHNCL02","MILDRET ARLETTE ANDRADE ACOSTA",30102,216,83101,1001,"02",19,"E3711",18,0,3,null,20200401,20200630,21027.599999999999,0]
[null,"CHIHUAHUA","08DPT0011J",120,"AIDJ6101296Q4","AIDJ610129HCHVLS09","JESUS HUMBERTO AVILA DELGADO",30102,240,83101,1001,"02",19,"E3725",20,0,3,null,20200401,20200630,30303,0]
[null,"CHIHUAHUA","08DPT0011J",120,"AIQC690227LQ0","AIQC690227HCHVNS05","CESAR ROGACIANO AVILA QUINTANA",30102,240,83101,1001,"02",19,"E3725",20,0,3,null,20200401,20200630,30303,0]
[null,"CHIHUAHUA","08DPT0011J",120,"BAGA570401CF3","BAGA570401HCHRNN09","ANDRES BARBA GANDARA",30102,240,83101,1001,"02",19,"E3725",20,0,3,null,20200401,20200630,30303,0]
[null,"CHIHUAHUA","08DPT0011J",120,"BABR540126HB4","BABR540126HCHZDL02","RAUL GABRIEL BAEZA BEDOY",30102,144,83101,1001,"02",19,"E3725",12,0,3,null,20200401,20200630,18181.8,0]
[null,"CHIHUAHUA","08DPT0011J",120,"BASZ650208NL8","BASZ650208MDFRTH15","BARRAZA STOELTING ZHENIA PATRICIA",30102,96,83101,1001,"02",19,"E3725",8,0,3,null,20200401,20200630,12121.2,0]
[null,"CHIHUAHUA","08DPT0011J",120,"BEAG740617SI1","BEAG740617MSLJRB00","MARIA GABIELA BEJARANO ARREDONDO",30102,240,83101,1001,"02",19,"E3725",20,0,3,null,20200401,20200630,30303,0]
[null,"CHIHUAHUA","08DPT0011J",120,"BEML730902B28","BEML730902HCHLRS07","JOSE LUIS BELTRAN MARQUEZ",30102,228,83101,1001,"02",19,"E3725",19,0,3,null,20200401,20200630,28787.879999999997,0]
[null,"CHIHUAHUA","08DPT0011J",120,"BACJ820811R51","BACJ820811HCHLRN02","JUAN JOSE BLANCO CRUZ",30102,120,83101,1001,"02",19,"E3725",10,0,3,null,20200401,20200630,15151.5,0]
[null,"CHIHUAHUA","08DPT0011J",120,"BASH700602N82","BASH700602HCHLNR08","HERNAN BLANCO SAENZ",30102,192,83101,1001,"02",19,"E3725",16,0,3,null,20200401,20200630,24242.400000000001,0]
[null,"CHIHUAHUA","08DPT0011J",120,"CAHJ821204323","CAHJ821204HCHBRL07","JOEL ANTONIO CABALLERO HERNANDEZ",30102,228,83101,1001,"02",19,"E3725",19,0,3,null,20200401,20200630,28787.879999999997,0]
[null,"CHIHUAHUA","08DPT0011J",120,"CADL780717DQ0","CADL780717HCHMLS06","LUIS MANUEL CAMACHO DELGADO",30102,240,83101,1001,"02",19,"E3713",20,0,3,null,20200401,20200630,26259,0]
[null,"CHIHUAHUA","08DPT0011J",120,"CAML770621S57","CAML770621HCHRRS02","LUIS CARMONA MORA",30102,96,83101,1001,"02",19,"E3725",8,0,3,null,20200401,20200630,12121.2,0]
[null,"CHIHUAHUA","08DPT0011J",120,"CAEI831214746","CAEI831214MCHRSV05","IVETH SELENE CARO ESCUDERO",30102,180,83101,1001,"02",19,"E3725",15,0,3,null,20200401,20200630,22727.279999999999,0]
[null,"CHIHUAHUA","08DPT0011J",120,"CAGS5611036P5","CAGS561103MCHRLL06","SILVIA CARRASCO GALVAN",30102,180,83101,1001,"02",19,"E3725",15,0,3,null,20200401,20200630,22727.279999999999,0]
[null,"CHIHUAHUA","08DPT0011J",120,"CAVJ780821N37","CAVJ780821HCHZLS05","JESUS MANUEL CAZARES VILLARREAL",30102,228,83101,1001,"02",19,"E3713",19,0,3,null,20200401,20200630,24946.080000000002,0]
[null,"CHIHUAHUA","08DPT0011J",120,"CEPJ5209176A4","CEPJ520917MCLDXS03","MARIA DE JESUS CEDILLO PEÑA",30102,240,83101,1001,"02",19,"E3725",20,0,3,null,20200401,20200630,30303,0]
[null,"CHIHUAHUA","08DPT0011J",120,"CALM790104KB2","CALM790104HCHHPN06","MANUEL ALBERTO CHAVIRA LOPEZ",30102,240,83101,1001,"02",19,"E3725",20,0,3,null,20200401,20200630,30303,0]
[null,"CHIHUAHUA","08DPT0011J",120,"CORI861010967","CORI861010HCHNVS07","ISAUL CONTRERAS RIVERA",30102,228,83101,1001,"02",19,"E3713",19,0,3,null,20200401,20200630,24946.080000000002,0]
[null,"CHIHUAHUA","08DPT0011J",120,"COVM710719995","COVM710719HCHRLR08","MARCO ANTONIO CORONADO VILLARREAL",30102,228,83101,1001,"02",19,"E3725",19,0,3,null,20200401,20200630,28787.879999999997,0]
[null,"CHIHUAHUA","08DPT0011J",120,"DIVM670828475","DIVM670828HCHZQN04","MANUEL DIAZ VAQUERA",30102,180,83101,1001,"02",19,"E3725",15,0,3,null,20200401,20200630,22727.279999999999,0]
[null,"CHIHUAHUA","08DPT0011J",120,"EICP660518T31","EICP660518MCHSRT02","PATRICIA EISSA CARRILLO",30102,180,83101,1001,"02",19,"E3725",15,0,3,null,20200401,20200630,22727.279999999999,0]
[null,"CHIHUAHUA","08DPT0011J",120,"EIAL6904095Y1","EIAL690409MCHSLR06","LORENA MARGARITA ESPINOZA ALCALA",30102,240,83101,1001,"02",19,"E3725",20,0,3,null,20200401,20200630,30303,0]
[null,"CHIHUAHUA","08DPT0011J",120,"FOSJ7411047Y2","FOSJ741104HCHLLV00","FLORES SALAS JAVIER ARTURO",30102,144,83101,1001,"02",19,"E3725",12,0,3,null,20200401,20200630,18181.800000000003,0]
[null,"CHIHUAHUA","08DPT0011J",120,"GAGJ7110079I6","GAGJ711007HCHBRL03","JULIAN GABIRA DE LA GARZA",30102,228,83101,1001,"02",19,"E3725",19,0,3,null,20200401,20200630,28787.879999999997,0]
[null,"CHIHUAHUA","08DPT0011J",120,"GALP8605195S6","GALP860519MCHRCR06","PERLA LILIANA GARCIA LUCERO",30102,240,83101,1001,"02",19,"E3713",20,0,3,null,20200401,20200630,26259,0]
[null,"CHIHUAHUA","08DPT0011J",120,"GOCC7107156X6","GOCC710715MCHNHR03","CARMEN GUADALUPE GONZALEZ CHACON",30102,216,83101,1001,"02",19,"E3725",18,0,3,null,20200401,20200630,27272.699999999997,0]
[null,"CHIHUAHUA","08DPT0011J",120,"GOGJ721103UI4","GOGJ721103HCHNRL03","JULIO CESAR GONZALEZ GRANADOS",30102,204,83101,1001,"02",19,"E3725",17,0,3,null,20200401,20200630,25757.58,0]
[null,"CHIHUAHUA","08DPT0011J",120,"GOPS631119234","GOPS631119HCHNZX06","SIXTO HUMBERTO GONZALEZ PAEZ",30102,240,83101,1001,"02",19,"E3725",20,0,3,null,20200401,20200630,30303,0]
[null,"CHIHUAHUA","08DPT0011J",120,"GUTM700125HI4","GUTM700125MCHRRR03","MARGARITA GUARDADO TORRES",30102,192,83101,1001,"02",19,"E3725",16,0,3,null,20200401,20200630,24242.400000000001,0]
[null,"CHIHUAHUA","08DPT0011J",120,"GUGL640702V28","GUGL640702HCHTRS02","LUIS ROGELIO GUTIERREZ GARCIA",30102,204,83101,1001,"02",19,"E3725",17,0,3,null,20200401,20200630,25757.58,0]
[null,"CHIHUAHUA","08DPT0011J",120,"HECM730118LI9","HECM730118HCHRDR06","MAURICIO HERNANDEZ CAUDILLO",30102,120,83101,1001,"02",19,"E3725",10,0,3,null,20200401,20200630,15151.5,0]
[null,"CHIHUAHUA","08DPT0011J",120,"HEOD870714897","HEOD870714MCLRLN06","DIANA HERNANDEZ OLIVARES",30102,204,83101,1001,"02",19,"E3725",17,0,3,null,20200401,20200630,25757.58,0]
[null,"CHIHUAHUA","08DPT0011J",120,"HETC830217EB1","HETC830217MCHRRN07","CINTHIA LIZETH HERNANDEZ TREVIÑO",30102,144,83101,1001,"02",19,"E3725",12,0,3,null,20200401,20200630,18181.800000000003,0]
[null,"CHIHUAHUA","08DPT0011J",120,"HEDM761211T33","HEDM761211MCHRZY08","MAYRA GUADALUPE HERRERA DIAZ",30102,216,83101,1001,"02",19,"E3725",18,0,3,null,20200401,20200630,27272.699999999997,0]
[null,"CHIHUAHUA","08DPT0011J",120,"JASX660321NQ4","JASX660321HZSYTM15","XAMIR JAYDAR SOTO",30102,180,83101,1001,"02",19,"E3725",15,0,3,null,20200401,20200630,22727.279999999999,0]
[null,"CHIHUAHUA","08DPT0011J",120,"JISR460111595","JISR460111HBCMLY00","REYNALDO JIMENEZ SOLIS",30102,216,83101,1001,"02",19,"E3725",18,0,3,null,20200401,20200630,23633.1,0]
[null,"CHIHUAHUA","08DPT0011J",120,"JILS7804098R3","JILS780409HCHMZR04","SERGIO ARMANDO JIMENEZ LOZANO",30102,72,83101,1001,"02",19,"E3713",8,0,3,null,20200401,20200630,9090.9000000000015,0]
[null,"CHIHUAHUA","08DPT0011J",120,"LEGI810812S76","LEGI810812HCHYNR04","IRVING LEYVA GONZALEZ",30102,216,83101,1001,"02",19,"E3725",18,0,3,null,20200401,20200630,27272.699999999997,0]
[null,"CHIHUAHUA","08DPT0011J",120,"LOGE770513DS3","LOGE770513MCHPLL01","ELENA DEL ROSARIO LOPEZ GALAVIZ",30102,216,83101,1001,"02",19,"E3725",18,0,3,null,20200401,20200630,27272.699999999997,0]
[null,"CHIHUAHUA","08DPT0011J",120,"LUCL830421CC7","LUCL830421HCHVNS03","LUIS FERNANDO LUEVANO CONTRERAS",30102,204,83101,1001,"02",19,"E3713",17,0,3,null,20200401,20200630,22320.18,0]
[null,"CHIHUAHUA","08DPT0011J",120,"LURI7603163W9","LURI760316MCHJDR01","IRMA EMILLIA LUJAN RODRIGUEZ",30102,216,83101,1001,"02",19,"E3713",18,0,3,null,20200401,20200630,23633.1,0]
[null,"CHIHUAHUA","08DPT0011J",120,"MEFJ6010186V1","MEFJ601018HCHNNS07","JESUS ALBERTO MENCHACA FUENTES",30102,240,83101,1001,"02",19,"E3725",20,0,3,null,20200401,20200630,30303,0]
[null,"CHIHUAHUA","08DPT0011J",120,"MEEJ750705D34","MEEJ750705HCHNSS02","JESUS MENDOZA ESTEVANE",30102,144,83101,1001,"02",19,"E3725",12,0,3,null,20200401,20200630,18181.800000000003,0]
[null,"CHIHUAHUA","08DPT0011J",120,"MOVI660317J46","MOXV660317HCHLXC08","VICTOR MANUEL MOLINAR X",30102,240,83101,1001,"02",19,"E3713",20,0,3,null,20200401,20200630,26259,0]
[null,"CHIHUAHUA","08DPT0011J",120,"MORR640403339","MORR640403MCHNDS08","ROSARIO FLORENTINA MONTOYA RODRIGUEZ",30102,204,83101,1001,"02",19,"E3725",17,0,3,null,20200401,20200630,25757.58,0]
[null,"CHIHUAHUA","08DPT0011J",120,"MOEC8307215B7","MOEC830721HCHRSR06","CARLOS DANIEL MORALES ESPINOZA",30102,228,83101,1001,"02",19,"E3725",19,0,3,null,20200401,20200630,28787.879999999997,0]
[null,"CHIHUAHUA","08DPT0011J",120,"MOSV610329FQ2","MOSV610329HCHRTC06","VICTOR MORENO SOTO",30102,192,83101,1001,"02",19,"E3725",16,0,3,null,20200401,20200630,24242.400000000001,0]
[null,"CHIHUAHUA","08DPT0011J",120,"MOOL690713831","MOOL690713MCHRSR07","LAURA MAGDALENA MORONES OSUNA",30102,240,83101,1001,"02",19,"E3725",20,0,3,null,20200401,20200630,30303,0]
[null,"CHIHUAHUA","08DPT0011J",120,"MORC720201UY4","MORC720201MCHRDL09","CLAUDIA MORONES RODRIGUEZ",30102,192,83101,1001,"02",19,"E3725",16,0,3,null,20200401,20200630,24242.400000000001,0]
[null,"CHIHUAHUA","08DPT0011J",120,"MUNL690829H48","MUNL690829MCHXTZ04","LUZ EMILIA MUÑOZ NATIVIDAD",30102,120,83101,1001,"02",19,"E3725",10,0,3,null,20200401,20200630,15151.5,0]
[null,"CHIHUAHUA","08DPT0011J",120,"NADJ630505N67","NADJ630505HCHVLN05","JUAN NAVA DELGADO",30102,240,83101,1001,"02",19,"E3725",20,0,3,null,20200401,20200630,30303,0]
[null,"CHIHUAHUA","08DPT0011J",120,"NAML740428B29","NAML740428MCHVRR05","LORENA IVONNE NAVA MORALES",30102,240,83101,1001,"02",19,"E3725",20,0,3,null,20200401,20200630,30303,0]
[null,"CHIHUAHUA","08DPT0011J",120,"MOSV610329FQ2","OOMJ610830MCHCDN00","JUANA ROSA OCHOA MADRID",30102,240,83101,1001,"02",19,"E3725",20,0,3,null,20200401,20200630,30303,0]
[null,"CHIHUAHUA","08DPT0011J",120,"OOGI7603109Y9","OOGI760310HDGRNS08","ISIDRO OROZCO GONZALEZ",30102,240,83101,1001,"02",19,"E3725",20,0,3,null,20200401,20200630,30303,0]
[null,"CHIHUAHUA","08DPT0011J",120,"OORA820321MG3","OORA820321MCHRNY08","AYDE OROZCO RENOVA",30102,216,83101,1001,"02",19,"E3725",18,0,3,null,20200401,20200630,27272.699999999997,0]
[null,"CHIHUAHUA","08DPT0011J",120,"PAMC840828GP8","PAMC840828MCHCRR08","CRISTINA PACHECO MARQUEZ",30102,180,83101,1001,"02",19,"E3725",15,0,3,null,20200401,20200630,22727.279999999999,0]
[null,"CHIHUAHUA","08DPT0011J",120,"PAPA610623V58","PAPA610623HCHLXN04","ANTONIO PALACIO PIÑA",30102,216,83101,1001,"02",19,"E3725",18,0,3,null,20200401,20200630,27272.699999999997,0]
[null,"CHIHUAHUA","08DPT0011J",120,"PEHJ6802298H5","PEHJ680229HCHRRN03","JUAN JOSE PEREZ HERNANDEZ",30102,120,83101,1001,"02",19,"E3725",10,0,3,null,20200401,20200630,15151.5,0]
[null,"CHIHUAHUA","08DPT0011J",120,"PERM720917SD7","PERM720917MCHRMR06","MARGARITA PEREZ RAMIREZ",30102,108,83101,1001,"02",19,"E3725",9,0,3,null,20200401,20200630,13636.380000000001,0]
[null,"CHIHUAHUA","08DPT0011J",120,"PADM510809SZ5","PADM510809HNTLZG08","MIGUEL ANGEL PLASCENCIA DIAZ",30102,240,83101,1001,"02",19,"E3725",20,0,3,null,20200401,20200630,30303,0]
[null,"CHIHUAHUA","08DPT0011J",120,"QUCC800518RJ7","QUCC800518MCHZML03","CLAUDIA ROCIO QUEZADA CAMPOYA",30102,192,83101,1001,"02",19,"E3725",16,0,3,null,20200401,20200630,24242.400000000001,0]
[null,"CHIHUAHUA","08DPT0011J",120,"QUME830808SH6","QUME830808HCHXRR06","ERIC QUIÑONES MARIÑELARENA",30102,192,83101,1001,"02",19,"E3725",16,0,3,null,20200401,20200630,24242.400000000001,0]
[null,"CHIHUAHUA","08DPT0011J",120,"RARR491119L95","RARR491119HPLMVB06","ROBERTO PONCIANO RAMIREZ RIVERA",30102,240,83101,1001,"02",19,"E3725",20,0,3,null,20200401,20200630,30303,0]
[null,"CHIHUAHUA","08DPT0011J",120,"RAHA780618377","RAHA780618HCHMRD01","ADARIK QUILEO RAMOS HERRERA",30102,216,83101,1001,"02",19,"E3725",18,0,3,null,20200401,20200630,27272.699999999997,0]
[null,"CHIHUAHUA","08DPT0011J",120,"RARL740713SN9","RARL740713MCHSYR08","LOURDES GABRIELA RASCON REYES",30102,180,83101,1001,"02",19,"E3725",15,0,3,null,20200401,20200630,22727.279999999999,0]
[null,"CHIHUAHUA","08DPT0011J",120,"REGJ630501KR7","REGJ630501HDFNRN07","JUAN CARLOS RENDON GARCIA",30102,240,83101,1001,"02",19,"E3725",20,0,3,null,20200401,20200630,30303,0]
[null,"CHIHUAHUA","08DPT0011J",120,"RILA820506DD4","RILA820506HCHVCN08","ANGEL ARMANDO RIVERA LECHUGA",30102,228,83101,1001,"02",19,"E3713",19,0,3,null,20200401,20200630,24946.080000000002,0]
[null,"CHIHUAHUA","08DPT0011J",120,"ROVW790131VE9","ROVW790131HCHJLL05","WILFREDO ROJO VELAZQUEZ",30102,132,83101,1001,"02",19,"E3725",11,0,3,null,20200401,20200630,16666.68,0]
[null,"CHIHUAHUA","08DPT0011J",120,"ROHE830406P40","ROHE830406MCHMRL03","ELSA SAMANTHA ROMERO HERRERA",30102,144,83101,1001,"02",19,"E3725",12,0,3,null,20200401,20200630,18181.800000000003,0]
[null,"CHIHUAHUA","08DPT0011J",120,"RUBJ910211L87","RUBJ910211HCHZCS01","RUIZ ESPARZA BACASEHUA JOSE",30102,228,83101,1001,"02",19,"E3713",19,0,3,null,20200401,20200630,24946.080000000002,0]
[null,"CHIHUAHUA","08DPT0011J",120,"RUHJ7401277YA","RUHJ740127HCHZRR00","JORGE ARTURO RUIZ HEIRAS",30102,240,83101,1001,"02",19,"E3725",20,0,3,null,20200401,20200630,30303,0]
[null,"CHIHUAHUA","08DPT0011J",120,"RUCJ590315LP9","RUCJ590315HZSZMS00","JOSE RUIZ ESPARZA CAMARENA",30102,240,83101,1001,"02",19,"E3725",20,0,3,null,20200401,20200630,30303,0]
[null,"CHIHUAHUA","08DPT0011J",120,"SARC670203156","SARC670203MDGLZR00","MARIA DEL CARMEN SALAS RUIZ",30102,240,83101,1001,"02",19,"E3725",20,0,3,null,20200401,20200630,30303,0]
[null,"CHIHUAHUA","08DPT0011J",120,"SACD640228KY5","SACD640228HCHLNN03","DANIEL JAVIER SALAZAR CONTRERAS",30102,180,83101,1001,"02",19,"E3725",15,0,3,null,20200401,20200630,22727.279999999999,0]
[null,"CHIHUAHUA","08DPT0011J",120,"SASL611115CC2","SASL611115HCHMPP00","LEOPOLDO SAMANIEGO SEPULVEDA",30102,192,83101,1001,"02",19,"E3725",16,0,3,null,20200401,20200630,24242.400000000001,0]
[null,"CHIHUAHUA","08DPT0011J",120,"SAPJ770502I20","SAPJ770502HCHNRV00","JAVIER SANCHEZ PEREZ",30102,96,83101,1001,"02",19,"E3725",8,0,3,null,20200401,20200630,12121.2,0]
[null,"CHIHUAHUA","08DPT0011J",120,"SEVK920127JG4","SEVK920127MCHGLR02","KAREN JEMIMA SEGOVIA VILLALOBOS",30102,180,83101,1001,"02",19,"E3725",15,0,3,null,20200401,20200630,22727.279999999999,0]
[null,"CHIHUAHUA","08DPT0011J",120,"TOMG6805124B0","TOMG680512MCHRRB05","GABRIELA TORRES MORENO",30102,240,83101,1001,"02",19,"E3725",20,0,3,null,20200401,20200630,30303,0]
[null,"CHIHUAHUA","08DPT0011J",120,"TOPD7211138C2","TOPD721113MCHRRL03","DELIA ARMIDA TORRES PORTILLO",30102,204,83101,1001,"02",19,"E3725",17,0,3,null,20200401,20200630,25757.58,0]
[null,"CHIHUAHUA","08DPT0011J",120,"TORJ640811CX6","TORJ640811HCHVVS02","JOSE TOVAR RIVERO",30102,240,83101,1001,"02",19,"E3725",20,0,3,null,20200401,20200630,30303,0]
[null,"CHIHUAHUA","08DPT0011J",120,"UUIL8212152F2","UUIL821215HCHRBS02","LUIS ALBERTO URQUIDI IBARBOL",30102,240,83101,1001,"02",19,"E3725",20,0,3,null,20200401,20200630,30303,0]
[null,"CHIHUAHUA","08DPT0011J",120,"VAPD660401U61","VAPD660401HCHLRN00","DANIEL VALADEZ PORTILLO",30102,216,83101,1001,"02",19,"E3725",18,0,3,null,20200401,20200630,27272.699999999997,0]
[null,"CHIHUAHUA","08DPT0011J",120,"VAGB5901245Z9","VAGB590124MCHLNL07","BLANCA ESTELA VALDERRABANO GONZALEZ ",30102,216,83101,1001,"02",19,"E3725",18,0,3,null,20200401,20200630,27272.699999999997,0]
[null,"CHIHUAHUA","08DPT0011J",120,"VAHJ690910EY0","VAHJ690910HCHLRM02","JAIME VALENZUELA HERNANDEZ",30102,180,83101,1001,"02",19,"E3725",15,0,3,null,20200401,20200630,22727.279999999999,0]
[null,"CHIHUAHUA","08DPT0011J",120,"VAGJ670203PVA","VAGJ670203HCLLVS03","JOSE VALLEJO GUEVARA",30102,240,83101,1001,"02",19,"E3725",20,0,3,null,20200401,20200630,30303,0]
[null,"CHIHUAHUA","08DPT0011J",120,"VACL8309162TA","VACL830916MCHRRR05","VARGAS CORRAL LAURA YANETH",30102,168,83101,1001,"02",19,"E3711",14,0,3,null,20200401,20200630,13629,0]
[null,"CHIHUAHUA","08DPT0011J",120,"VEDL620727PL3","VEDL620727MCHGRR05","LORETO VEGA DURAN",30102,240,83101,1001,"02",19,"E3725",20,0,3,null,20200401,20200630,30303,0]
[null,"CHIHUAHUA","08DPT0011J",120,"VEMA551027JGA","VEMA551027HCHGRR06","ARIEL VEGA MIRANDA",30102,240,83101,1001,"02",19,"E3725",20,0,3,null,20200401,20200630,30303,0]
[null,"CHIHUAHUA","08DPT0011J",120,"VIBH7007255V7","VIBH700725MCHDNL05","HILDA MINERVA VIDAÑA BENCOMO",30102,228,83101,1001,"02",19,"E3725",19,0,3,null,20200401,20200630,28787.88,0]
[null,"CHIHUAHUA","08DPT0011J",120,"VIPT690222SN0","VIPT690222MCHLXR04","MARIA TERESA VILLARREAL PIÑON",30102,144,83101,1001,"02",19,"E3725",12,0,3,null,20200401,20200630,18181.8,0]
[null,"CHIHUAHUA","08DPT0013H",120,"AOVP680821N74","AOVP680821MCHLLT07","PATRICIA GUADALUPE ALONSO VALENZUELA",30102,240,83101,1001,"03",23,"E3713","20.0",0,3,null,20200401,20200630,31863,0]
[null,"CHIHUAHUA","08DPT0013H",200,"AAOP870805580","AAOP870805HCHLLD04","PEDRO TOMAS ALVARADO OLIVAS",30102,216,83101,1001,"03",23,"E3711","18.0",0,3,null,20200401,20200630,25374.6,0]
[null,"CHIHUAHUA","08DPT0013H",120,"AIBS821008VBA","AIBS821008HVZRRR09","SERGIO ARIAS BRAVO",30102,240,83101,1001,"03",23,"E3725","20.0",0,3,null,20200401,20200630,36660,0]
[null,"CHIHUAHUA","08DPT0013H",100,"BUMA741111CX0","BUMA741111MCHSNN11","ANGELICA BUSTILLOS MINJAREZ",30102,240,83101,1001,"03",23,"E3725","20.0",0,3,null,20200401,20200630,36660,0]
[null,"CHIHUAHUA","08DPT0013H",120,"BURK950212RQ2","BURK950212MCHSNR03","KARLA ESTRELLA BUSTILLOS RENDON",30102,240,83101,1001,"03",23,"E3711","20.0",0,3,null,20200401,20200630,28194,0]
[null,"CHIHUAHUA","08DPT0013H",100,"CACR890101JE8","CACR890101HCHLRN05","RENE CALDERON CARNERO",30102,240,83101,1001,"03",23,"E3725","20.0",0,3,null,20200401,20200630,36660,0]
[null,"CHIHUAHUA","08DPT0013H",100,"CAMY820713FS4","CAMY820713MCHRTR09","YURIDIA ITZEL CARDONA MATA",30102,240,83101,1001,"03",23,"E3725","20.0",0,3,null,20200401,20200630,36660,0]
[null,"CHIHUAHUA","08DPT0013H",200,"CAGX6801106S4","CXGA680110HCLRRR09","ARTURO CARRILLO GARCIA",30102,240,83101,1001,"03",23,"E3711","20.0",0,3,null,20200401,20200630,28194,0]
[null,"CHIHUAHUA","08DPT0013H",120,"CECD871010N16","CECD871010HCHRSG08","DIEGO ADOLFO CERVANTES CASTILLO",30102,216,83101,1001,"03",23,"E3711","18.0",0,3,null,20200401,20200630,25374.6,0]
[null,"CHIHUAHUA","08DPT0013H",100,"COTD9112155M3","COTD911215MCHRRN03","DENISSE ALEJANDRA CORELLA TRUJILLO",30102,240,83101,1001,"03",23,"E3725","20.0",0,3,null,20200401,20200630,36660,0]
[null,"CHIHUAHUA","08DPT0013H",100,"CUAL871105HE1","CUAL871105HCHRLS08","LUIS ALEJANDRO CRUZ ALVARADO",30102,240,83101,1001,"03",23,"E3713","20.0",0,3,null,20200401,20200630,31863,0]
[null,"CHIHUAHUA","08DPT0013H",100,"DAGR770317JPA","DAGR770317HCLVNF02","RAFAEL DAVILA GONZALEZ",30102,132,83101,1001,"03",23,"E3711","11.0",0,3,null,20200401,20200630,15506.7,0]
[null,"CHIHUAHUA","08DPT0013H",120,"CUYJ890624UL8","CUYJ890624HCHRXN04","JUAN RAMON DE LA CRUZ YAÑEZ",30102,228,83101,1001,"03",23,"E3711","19.0",0,3,null,20200401,20200630,26784.3,0]
[null,"CHIHUAHUA","08DPT0013H",120,"ROCJ811214HD5","ROCJ811214HCLSMV04","JAVIER ROLANDO DE LA ROSA CAMPOS",30102,240,83101,1001,"03",23,"E3725","20.0",0,3,null,20200401,20200630,36660,0]
[null,"CHIHUAHUA","08DPT0013H",200,"LEVD880414UB2","LEVD880414MCLNLN07","DIANA GABRIELA DE LEON VELAZQUEZ",30102,216,83101,1001,"03",23,"E3725","18.0",0,3,null,20200401,20200630,32994,0]
[null,"CHIHUAHUA","08DPT0013H",120,"DODK891025237","DODK891025MCHMMR03","KARLA KARINA DOMINGUEZ DOMINGUEZ",30102,240,83101,1001,"03",23,"E3725","20.0",0,3,null,20200401,20200630,36660,0]
[null,"CHIHUAHUA","08DPT0013H",120,"EECA8503081Q2","EECA850308HSLCRB06","ABRAHAM JACOBO ECHEVARRIA CORRALES",30102,240,83101,1001,"03",23,"E3725","20.0",0,3,null,20200401,20200630,36660,0]
[null,"CHIHUAHUA","08DPT0013H",120,"EISC871230RT1","EISC871230MCHSNR08","CAROLINA ESPINOZA DE SANTIAGO",30102,240,83101,1001,"03",23,"E3725","20.0",0,3,null,20200401,20200630,36660,0]
[null,"CHIHUAHUA","08DPT0013H",120,"GAOR680723LM5","GAOR680723HCHLRC05","RICARDO RAUL GALARZA ORTEGA",30102,240,83101,1001,"03",23,"E3725","20.0",0,3,null,20200401,20200630,36660,0]
[null,"CHIHUAHUA","08DPT0013H",200,"GARS970720IY4","GARS970720MCHRDN02","SONIA YANIRA GARCIA RODRIGUEZ",30102,216,83101,1001,"03",23,"E3711","18.0",0,3,null,20200401,20200630,25374.6,0]
[null,"CHIHUAHUA","08DPT0013H",200,"GONJ870317J36","GONJ870317MVZMCN02","JENNY PATRICIA GOMEZ NICIDA",30102,240,83101,1001,"03",23,"E3713","20.0",0,3,null,20200401,20200630,31863,0]
[null,"CHIHUAHUA","08DPT0013H",200,"GOBA8404166GA","GOBA840416MDFNRN06","ANGELINA GONZALEZ BARCENAS",30102,204,83101,1001,"03",23,"E3711","17.0",0,3,null,20200401,20200630,23964.9,0]
[null,"CHIHUAHUA","08DPT0013H",120,"GOHD860913N63","GOHD860913MCLNRL08","DALIA LIBERTAD GONZALEZ HERNANDEZ",30102,240,83101,1001,"03",23,"E3711","20.0",0,3,null,20200401,20200630,28194,0]
[null,"CHIHUAHUA","08DPT0013H",120,"GOMA820909QV4","GOMA820909MCHNRD09","ADRIANA GONZALEZ MARQUEZ",30102,240,83101,1001,"03",23,"E3725","20.0",0,3,null,20200401,20200630,36660,0]
[null,"CHIHUAHUA","08DPT0013H",100,"GORR890405IP7","GORR890405HCHNMY01","RAYMUNDO RAMIREZ GONZALEZ",30102,240,83101,1001,"03",23,"E3725","20.0",0,3,null,20200401,20200630,36660,0]
[null,"CHIHUAHUA","08DPT0013H",200,"GUCD860131S71","GUCD860131HCHRLV06","JOSE DAVID GUERRERO CALLEROS",30102,240,83101,1001,"03",23,"E3713","20.0",0,3,null,20200401,20200630,31863,0]
[null,"CHIHUAHUA","08DPT0013H",100,"GUMG891202IP6","GUMG891202MCHTRR04","GRECIA REYNA GUTIERREZ MARRUFO",30102,228,83101,1001,"03",23,"E3713","19.0",0,3,null,20200401,20200630,30269.879999999997,0]
[null,"CHIHUAHUA","08DPT0013H",200,"HEAN911008UH6","HEAN911008MCHRLN03","NANCY ELIZABETH HEREDIA ALVARADO",30102,240,83101,1001,"03",23,"E3711","20.0",0,3,null,20200401,20200630,28194,0]
[null,"CHIHUAHUA","08DPT0013H",100,"HEAL6501012W6","HEAL650101HCHRRR04","LORENZO HERNANDEZ ARMENTA",30102,240,83101,1001,"03",23,"E3725","20.0",0,3,null,20200401,20200630,36660,0]
[null,"CHIHUAHUA","08DPT0013H",100,"HEPM870418QNA","HEPM870418MDFRRR08","MARY CARMEN HERNANDEZ PERALES",30102,240,83101,1001,"03",23,"E3725","20.0",0,3,null,20200401,20200630,36660,0]
[null,"CHIHUAHUA","08DPT0013H",100,"HIMY9004108E8","MIMY900410MCHNDS05","YISSEL SAYONARA HINOJO MODESTO",30102,228,83101,1001,"03",23,"E3711","19.0",0,3,null,20200401,20200630,26784.3,0]
[null,"CHIHUAHUA","08DPT0013H",100,"JUAS860801FD3","JUAS860801MCHRLL00","SILVIA ANGELICA JUAREZ ALVARADO",30102,240,83101,1001,"03",23,"E3725","20.0",0,3,null,20200401,20200630,36660,0]
[null,"CHIHUAHUA","08DPT0013H",100,"JUGD920330V98","JUGD920330MCHRRN02","DIANA MARIA JUAREZ GRANADOS",30102,180,83101,1001,"03",23,"E3711","15.0",0,3,null,20200401,20200630,21145.5,0]
[null,"CHIHUAHUA","08DPT0013H",200,"LINM5608318QA","LINM560731HDFVTG06","MIGUEL ARTURO LIEVANO NORMAN",30102,240,83101,1001,"03",23,"E3711","20.0",0,3,null,20200401,20200630,28194,0]
[null,"CHIHUAHUA","08DPT0013H",200,"LOMR7805084Z7","LOMR780508HCHRNL09","RAUL ERNESTO LOERA MONARREZ",30102,160,83101,1001,"03",23,"E3725","20.0",0,3,null,20200401,20200530,24440,0]
[null,"CHIHUAHUA","08DPT0013H",200,"LOAA850515Q46","LOAA850515HCHPRL03","ALEJANDRO LOPEZ ARMENDARIZ",30102,240,83101,1001,"03",23,"E3725","20.0",0,3,null,20200401,20200630,36660,0]
[null,"CHIHUAHUA","08DPT0013H",120,"LOCS771008517","LOCS771008HCHPRR09","SERGIO LOPEZ DE LA CRUZ",30102,240,83101,1001,"03",23,"E3725","20.0",0,3,null,20200401,20200630,36660,0]
[null,"CHIHUAHUA","08DPT0013H",200,"MAGT901211DE9","MAGT901211MCHLNH09","THANIA GUADALUPE MALDONADO GONZALEZ",30102,240,83101,1001,"03",23,"E3725","20.0",0,3,null,20200401,20200630,36660,0]
[null,"CHIHUAHUA","08DPT0013H",200,"MAGC661008FYA","MAGC661008HCHRNN09","CANDELARIO MARTINEZ GONZALEZ",30102,240,83101,1001,"03",23,"E3725","20.0",0,3,null,20200401,20200630,36660,0]
[null,"CHIHUAHUA","08DPT0013H",100,"METJ941115RJ7","METJ941115MCHDNN07","JENIFFER MEDINA TUNCHEZ",30102,228,83101,1001,"03",23,"E3711","19.0",0,3,null,20200401,20200630,26784.3,0]
[null,"CHIHUAHUA","08DPT0013H",100,"MOAR891030LR4","MOAR891030HCHNGC01","RICARDO DANIEL MONJARAS AGUILAR",30102,240,83101,1001,"03",23,"E3711","20.0",0,3,null,20200401,20200630,28194,0]
[null,"CHIHUAHUA","08DPT0013H",200,"MUSF8807088K7","MUSF880708HCHRLR03","FRANCISCO JAVIER MURILLO SALAZAR",30102,240,83101,1001,"03",23,"E3711","20.0",0,3,null,20200401,20200630,28194,0]
[null,"CHIHUAHUA","08DPT0013H",100,"NARM960112JC1","NARM960112HCHVMB02","MOAB DANIEL NAVARRO RAMIREZ",30102,240,83101,1001,"03",23,"E3711","20.0",0,3,null,20200401,20200630,28194,0]
[null,"CHIHUAHUA","08DPT0013H",200,"OISE771121RD9","OISE771121HCHLNL07","ELIAS HERIBERTO OLIVAS SAENZ",30102,240,83101,1001,"03",23,"E3713","20.0",0,3,null,20200401,20200630,31863,0]
[null,"CHIHUAHUA","08DPT0013H",120,"OISM951129R68","OISM951129MCHRLC03","MICHELLE ALEJANDRA ORTIZ SILVA",30102,216,83101,1001,"03",23,"E3701","18.0",0,3,null,20200401,20200630,18829.8,0]
[null,"CHIHUAHUA","08DPT0013H",100,"POGD861005KA6","POGD861005MCHRMN00","DANIELA PORRAS GOMEZ",30102,240,83101,1001,"03",23,"E3725","20.0",0,3,null,20200401,20200630,36660,0]
[null,"CHIHUAHUA","08DPT0013H",120,"PUYR780420I72","PUYR780420MMCLXC00","ROCIO PULIDO YAÑEZ",30102,240,83101,1001,"03",23,"E3725","20.0",0,3,null,20200401,20200630,36660,0]
[null,"CHIHUAHUA","08DPT0013H",100,"QUPK7804119NA","QUPK780411MSRVRR11","KARLA LIZETTE  QUEVEDO PRECIADO",30102,240,83101,1001,"03",23,"E3725","20.0",0,3,null,20200401,20200630,36660,0]
[null,"CHIHUAHUA","08DPT0013H",120,"RESJ851201GQ9","RESJ851201HCHVPV07","JAVIER EDUARDO  REVELES SAPIEN",30102,240,83101,1001,"03",23,"E3725","20.0",0,3,null,20200401,20200630,36660,0]
[null,"CHIHUAHUA","08DPT0013H",200,"ROGM9209304F8","ROGM920930HMCDLG05","MIGUEL ANGEL RODRIGUEZ GALVAN",30102,240,83101,1001,"03",23,"E3711","20.0",0,3,null,20200401,20200630,28194,0]
[null,"CHIHUAHUA","08DPT0013H",120,"ROVC550831794","ROVC550831MQTDLN04","CONCEPCION ROSARIO RODRIGUEZ VALDIVIELSO",30102,216,83101,1001,"03",23,"E3713","18.0",0,3,null,20200401,20200630,28676.7,0]
[null,"CHIHUAHUA","08DPT0013H",200,"RORE881219EW3","RORE881219HVZJYR07","ERNESTO IVAN ROJAS REYES",30102,240,83101,1001,"03",23,"E3711","20.0",0,3,null,20200401,20200630,28194,0]
[null,"CHIHUAHUA","08DPT0013H",200,"SASG860316EQ4","SASG860316HCHNNN09","GENARO ALONSO SAENZ SAENZ",30102,240,83101,1001,"03",23,"E3701","20.0",0,3,null,20200401,20200630,20922,0]
[null,"CHIHUAHUA","08DPT0013H",200,"SACR870225HZ8","SACR870225HCHLLB02","ROBERTO ISMAEL SALAZAR CALDERA",30102,240,83101,1001,"03",23,"E3725","20.0",0,3,null,20200401,20200630,36660,0]
[null,"CHIHUAHUA","08DPT0013H",200,"SACE740906S3A","SACE740906HCLLMN05","ENRIQUE  SALAZAR CAMPOS",30102,240,83101,1001,"03",23,"E3725","20.0",0,3,null,20200401,20200630,36660,0]
[null,"CHIHUAHUA","08DPT0013H",120,"SARC911030SC8","SARC911030HCHLMR00","CARLOS SALGADO ROMO",30102,240,83101,1001,"03",23,"E3713","20.0",0,3,null,20200401,20200630,31863,0]
[null,"CHIHUAHUA","08DPT0013H",100,"SESU611116K12","SESU611116HDFGRL05","ULISES SEGURA SIERRA",30102,240,83101,1001,"03",23,"E3701","20.0",0,3,null,20200401,20200630,20922,0]
[null,"CHIHUAHUA","08DPT0013H",120,"SIER8905149W5","SIER890514MCHGSS03","ROSA SELENE SIGALA ESQUIVEL",30102,240,83101,1001,"03",23,"E3725","20.0",0,3,null,20200401,20200630,36660,0]
[null,"CHIHUAHUA","08DPT0013H",100,"SORR740817E88","SORR740817HCHSDC09","RICARDO SOSA RODRIGUEZ",30102,240,83101,1001,"03",23,"E3725","20.0",0,3,null,20200401,20200630,36660,0]
[null,"CHIHUAHUA","08DPT0013H",100,"TECI630106UW7","TECI630106MDFLBS09","MARIA ISABEL TELLEZ GIRON COBOS",30102,240,83101,1001,"03",23,"E3713","20.0",0,3,null,20200401,20200630,31863,0]
[null,"CHIHUAHUA","08DPT0013H",120,"TORR840104UJ5","TORR840104MCHRMQ05","RAQUEL IVETTE TORRES RAMIREZ",30102,240,83101,1001,"03",23,"E3725","20.0",0,3,null,20200401,20200630,36660,0]
[null,"CHIHUAHUA","08DPT0013H",120,"UUMM850610TB5","UUMM850610HCHNNN02","MANUEL EDUARDO UNZUETA MONTES",30102,204,83101,1001,"03",23,"E3713","17.0",0,3,null,20200401,20200630,27083.58,0]
[null,"CHIHUAHUA","08DPT0013H",100,"VATB930812JK4","VATB930812MCHLRR05","BRENDA SUJEY VALADEZ TRUJILLO",30102,240,83101,1001,"03",23,"E3713","20.0",0,3,null,20200401,20200630,31863,0]
[null,"CHIHUAHUA","08DPT0013H",200,"VABE970529355","VABE970529HDFZLR00","ERNESTO VAZQUEZ BELMONTES",30102,240,83101,1001,"03",23,"E3711","20.0",0,3,null,20200401,20200630,28194,0]
[null,"CHIHUAHUA","08DPT0013H",100,"VEPS7608116K0","VEPS760811MCHLBS04","SUSANA ADRIANA VELAZQUEZ POBLANO",30102,240,83101,1001,"03",23,"E3725","20.0",0,3,null,20200401,20200630,36660,0]
[null,"CHIHUAHUA","08DPT0013H",200,"VIPL700512EU4","VIPL700512HCHDRS00","JOSE LUIS VIDAÑA PEREZ",30102,228,83101,1001,"03",23,"E3725","19.0",0,3,null,20200401,20200630,34827,0]
[null,"CHIHUAHUA","08DPT0013H",120,"AOVP680821N74","AOVP680821MCHLLT07","PATRICIA GUADALUPE ALONSO VALENZUELA","20212",480,83101,1003,"03",23,"T05801","00.0",0,2,"0012020",20200401,20200630,25729.5,0]
[null,"CHIHUAHUA","08DPT0013H",120,"AIBS821008VBA","AIBS821008HVZRRR09","SERGIO ARIAS BRAVO","20101",480,83101,1003,"03",23,"CF33206","00.0",0,2,"0022020",20200401,20200630,78454.92,0]
[null,"CHIHUAHUA","08DPT0013H",120,"CAAJ800611RP7","CAAJ800611HCHHLL08","JULIO CESAR CHAVEZ ALVARADO","20302",480,83101,1003,"03",23,"S01202","00.0",0,2,"0032020",20200401,20200630,23749.32,0]
[null,"CHIHUAHUA","08DPT0013H",120,"DODK891025237","DODK891025MCHMMR03","KARLA KARINA DOMINGUEZ DOMINGUEZ","20207","480.0",83101,1003,"03",23,"CF33204","00.0",0,2,"0042020",20200401,20200630,43632.539999999994,0]
[null,"CHIHUAHUA","08DPT0013H",120,"EECA8503081Q2","EECA850308HSLCRB06","ABRAHAM JACOBO ECHEVARRIA CORRALES","20202","480.0",83101,1003,"03",23,"CF33204","00.0",0,2,"0052020",20200401,20200630,43632.539999999994,0]
[null,"CHIHUAHUA","08DPT0013H",120,"EAGJ991008R37","EAGJ991008MCHSZS02","JESSICA LIZBETH ESCAÑUELAS GUZMAN","20201","480.0",83101,1003,"03",23,"CF33203","00.0",0,2,"0062020",20200401,20200630,28768.139999999996,0]
[null,"CHIHUAHUA","08DPT0013H",120,"EISC871230RT1","EISC871230MCHSNR08","CAROLINA ESPINOZA DE SANTIAGO","20206","480.0",83101,1003,"03",23,"CF33204","00.0",0,2,"0072020",20200401,20200630,43632.539999999994,0]
[null,"CHIHUAHUA","08DPT0013H",120,"GARS970720IY4","GARS970720MCHRDN02","SONIA YANIRA GARCIA RODRIGUEZ","20214","480.0",83101,1003,"03",23,"ED0280","00.0",0,2,"0302020",20200401,20200630,25729.5,0]
[null,"CHIHUAHUA","08DPT0013H",120,"GOHD860913N63","GOHD860913MCLNRL08","DALIA LIBERTAD GONZALEZ HERNANDEZ","20206","480.0",83101,1003,"03",23,"S01202","00.0",0,2,"0082020",20200401,20200630,23749.32,0]
[null,"CHIHUAHUA","08DPT0013H",120,"HEAC5605024W8","HEAC560502HTCRRR19","JOSE CRUZ HERNANDEZ ARA","20402","480.0",83101,1003,"03",23,"S01201","00.0",0,2,"0092020",20200401,20200630,21795.420000000002,0]
[null,"CHIHUAHUA","08DPT0013H",120,"HECK800610371","HECK800610MMCRHR10","KARINA HERNANDEZ CHAVEZ","20206","480.0",83101,1003,"03",23,"S01201","00.0",0,2,"0102020",20200401,20200630,21795.420000000002,0]
[null,"CHIHUAHUA","08DPT0013H",120,"LOCS771008517","LOCS771008HCHPRR09","SERGIO LOPEZ  DE LA CRUZ","20104","480.0",83101,1003,"03",23,"CF33206","00.0",0,2,"0112020",20200401,20200630,78454.92,0]
[null,"CHIHUAHUA","08DPT0013H",120,"MARA971025347","MARA971025MCHNBR07","ARGELIA YAZMIN MANZUR REBOLLOZO","20215","480.0",83101,1003,"03",23,"S01202","00.0",0,2,"0122020",20200401,20200630,23749.32,0]
[null,"CHIHUAHUA","08DPT0013H",120,"NEAA910928HC9","NEAA910928HCHGCN09","ANTONIO NEGRETE ACOSTA","20214","480.0",83101,1003,"03",23,"S01201","00.0",0,2,"0132020",20200401,20200630,21795.420000000002,0]
[null,"CHIHUAHUA","08DPT0013H",120,"OISE001029EX3","OISE001029HCHRLRA7","ERICK LORENZO ORTIZ SILVA","20401","480.0",83101,1003,"03",23,"S01202","00.0",0,2,"0152020",20200401,20200630,23749.32,0]
[null,"CHIHUAHUA","08DPT0013H",120,"OISM951129R68","OISM951129MCHRLC03","MICHELLE ALEJANDRA ORTIZ SILVA","20214","480.0",83101,1003,"03",23,"ED0280","00.0",0,2,"0162020",20200401,20200630,25729.5,0]
[null,"CHIHUAHUA","08DPT0013H",120,"PAVS900926C55","PAVS900926MVZDZN02","SANDY YUNUEN PADILLA VAZQUEZ","20214","480.0",83101,1003,"03",23,"CF33204","00.0",0,2,"0172020",20200401,20200630,43632.539999999994,0]
[null,"CHIHUAHUA","08DPT0013H",120,"PUYR780420I72","PUYR780420MMCLXC00","ROCIO PULIDO  YAÑEZ","20101","480.0",83101,1003,"03",23,"CF33206","00.0",0,2,"0182020",20200401,20200630,78454.92,0]
[null,"CHIHUAHUA","08DPT0013H",120,"RACI731115V49","RACI731115HPLMNS06","ISRAEL RAMOS CONTRERAS","20206","480.0",83101,1003,"03",23,"S01201","00.0",0,2,"0312020",20200401,20200630,21795.420000000002,0]
[null,"CHIHUAHUA","08DPT0013H",120,"RESJ851201GQ9","RESJ851201HCHVPV07","JAVIER EDUARDO REVELES  SAPIEN","20101","480.0",83101,1003,"03",23,"CF33206","00.0",0,2,"0192020",20200401,20200630,78454.92,0]
[null,"CHIHUAHUA","08DPT0013H",120,"ROES970521Q99","ROES970521MCHDSN09","SINAI CAROLINA RODRIGUEZ ESTRADA","20206","480.0",83101,1003,"03",23,"S01202","00.0",0,2,"0202020",20200401,20200630,23749.32,0]
[null,"CHIHUAHUA","08DPT0013H",120,"RUMJ670308JU5","RUMJ670308HSPBRN01","JUAN RUBIO MARTINEZ","20401","480.0",83101,1003,"03",23,"S01201","00.0",0,2,"0212020",20200401,20200630,21795.420000000002,0]
[null,"CHIHUAHUA","08DPT0013H",120,"SARC911030SC8","SARC911030HCHLMR00","CARLOS SALGADO  ROMO","20205","480.0",83101,1003,"03",23,"CF33204","00.0",0,2,"0222020",20200401,20200630,43632.539999999994,0]
[null,"CHIHUAHUA","08DPT0013H",120,"SAVS980512N44","SAVS980512MCHVLR08","SARAH INES SAAVEDRA VILLEGAS","20206","480.0",83101,1003,"03",23,"S01201","00.0",0,2,"0232020",20200401,20200630,21795.420000000002,0]
[null,"CHIHUAHUA","08DPT0013H",120,"SIER8905149W5","SIER890514MCHGSS03","ROSA SELENE SIGALA ESQUIVEL","20203","480.0",83101,1003,"03",23,"CF33204","00.0",0,2,"0242020",20200401,20200630,43632.539999999994,0]
[null,"CHIHUAHUA","08DPT0013H",120,"TORR840104UJ5","TORR840104MCHRMQ05","RAQUEL IVETTE TORRES RAMIREZ","20206","480.0",83101,1003,"03",23,"CF33204","00.0",0,2,"0252020",20200401,20200630,43632.539999999994,0]
[null,"CHIHUAHUA","00XXX0000X",124,"LIAL810304JK3","LIAL810304MCHCRL00","LILIANA LICON ARAGONEZ",50301,480,83101,1003,"07","04","CF11102",0,10994,5,null,20200401,20200630,100611.18,0]
[null,"CHIHUAHUA","00XXX0000X",124,"BUAC8304198K9","BUAC830419MCHNGY03","CYNTHIA IRENE BUENO AGUIRRE",50703,480,83101,1003,"07","04","CF01601",0,10993,5,null,20200401,20200630,66459.899999999994,0]
[null,"CHIHUAHUA","00XXX0000X",124,"CATC7205274V8","CATC720527HCHNRR09","CARLOS CANO TORRES",20303,480,83101,1003,"07","04","CF33204",0,10990,2,null,20200401,20200630,94462.98,0]
[null,"CHIHUAHUA","00XXX0000X",124,"GOMD671113QD6","GOMD671113HCHMRG03","DIEGO RAUL GOMEZ MARTINEZ",20303,480,83101,1003,"07","04","CF33204",0,11820,2,null,20200401,20200630,97312.24,0]
[null,"CHIHUAHUA","00XXX0000X",124,"MOHB751008LK5","MOHB751008MMNNRL03","BLANCA ESTELA MONTAÑEZ HERNANDEZ",20201,480,83101,1003,"07","04","CF33204",0,10999,2,null,20200401,20200630,79957.03,0]
[null,"CHIHUAHUA","00XXX0000X",124,"PALU750621U84","PAXL750621HCHLXS05","LUIS ENRIQUE PALACIOS",20303,480,83101,1003,"07","04","CF33204",0,10995,2,null,20200401,20200630,88707.46,0]
[null,"CHIHUAHUA","00XXX0000X",124,"QUEG630216GA8","QUEG630216MCHXSR02","GRACIELA QUIÑONEZ ESTRADA",50704,480,83101,1003,"07","04","CF01601",0,11822,5,null,20200401,20200630,66459.899999999994,0]
[null,"CHIHUAHUA","00XXX0000X",124,"SAWV80120227A","SAWV801202MCLNLV05","VIVIANA SANCHEZ WILLIAMS",50201,480,83101,1003,"07","04","CF01601",0,11000,5,null,20200401,20200630,66459.899999999994,0]
[null,"CHIHUAHUA","00XXX0000X",124,"VARM7910137D6","VARM791013MCHLMR03","MARISOL VALLES RAMOS",20206,480,83101,1003,"07","04","CF33204",0,11819,2,null,20200401,20200630,85085.71,0]
[null,"CHIHUAHUA","00XXX0000X",124,"AOCF590913PU5","AOCF590913HCHCNL08","FLAVIO FILOMENO ACOSTA CANO DE LOS RIOS","50201",480,83101,1003,"05","12","CF11100",0,10166,5,null,20200401,20200630,236416.25999999998,0]
[null,"CHIHUAHUA","00XXX0000X",124,"AAGE900717365","AAGE900717MCHZZL09","ELIZABETH AZAETA GUZMAN","20215",480,83101,1003,"05","12","CF33204",0,"8024",2,null,20200401,20200630,65383.959999999992,0]
[null,"CHIHUAHUA","00XXX0000X",124,"CAMH8103197WA","CAMH810319HCHRRG06","HUGO ALBERTO CARMONA MORA","50608",480,83101,1003,"05","12","CF02100",0,12457,5,null,20200401,20200630,75764.28,0]
[null,"CHIHUAHUA","00XXX0000X",124,"DUCD810810J24","DUCD810810MCHRRN06","DANISSA DURAN CARO","20201",480,83101,1003,"05","12","CF33204",0,13186,2,null,20200401,20200630,98561.43,0]
[null,"CHIHUAHUA","00XXX0000X",124,"FEPD840911LH2","FEPD840911MCHRZN04","DENISSE JANETT FERNANDEZ PAEZ",20203,480,83101,1003,"05","12","CF33204",0,"9714",2,null,20200401,20200630,76556.27,0]
[null,"CHIHUAHUA","00XXX0000X",124,"GACS670112I53","GACS670112MCHRHN02","SANDRA MARGARITA GARCIA CHAVEZ","20109",480,83101,1003,"05","12","CF33206",0,14136,2,null,20200401,20200630,117224.02,0]
[null,"CHIHUAHUA","00XXX0000X",124,"GARG760607HY8","GARG760607HCHSMS07","GUSTAVO ALONSO GASCA RAMIREZ ",50201,480,83101,1003,"05","12","CF02100",0,10166,5,null,20200401,20200630,75764.28,0]
[null,"CHIHUAHUA","00XXX0000X",124,"LAAC860420JE7","LAAC860420MCHBPL04","CLAUDIA PATRICIA LABRADO APARICIO","20201",480,83101,1003,"05","12","CF34205",0,10163,2,null,20200401,20200630,70597.780000000013,0]
[null,"CHIHUAHUA","00XXX0000X",124,"LORC551120FV3","LORC551120HCHYDR08","CARLOS JAVIER LOYA RODRIGUEZ",50609,480,83101,1003,"05","12","CF02100",0,"12456",5,null,20200401,20200630,75764.28,0]
[null,"CHIHUAHUA","00XXX0000X",124,"MADY940205DA8","MADY940205MCHRMR02","YARITZA IVONNE MARQUEZ DOMINGUEZ",20201,480,83101,1003,"05","12","S01201",0,9718,2,null,20200401,20200630,23133.119999999999,0]
[null,"CHIHUAHUA","00XXX0000X",124,"MEFL841115AN9","MEFL841115MCHDRZ02","LIZETH MEDRANO FIERRO",20205,480,83101,1003,"05","12","CF34201",0,"9729",2,null,20200401,20200630,26069.040000000001,0]
[null,"CHIHUAHUA","00XXX0000X",124,"MOSF7009259L5","MOSF700925HCHRTR02","FERNANDO ALBERTO MORA SOTO","20109",480,83101,1003,"05","12","CF33206",0,10160,2,null,20200401,20200630,124384.97999999998,0]
[null,"CHIHUAHUA","00XXX0000X",124,"PAMA800623I22","PAMA800623MDGDRL02","PADILLA MARQUEZ ALICIA","20101",480,83101,1003,"05","12","CF33204",0,2413,2,null,20200401,20200630,69664.66,0]
[null,"CHIHUAHUA","00XXX0000X",124,"PEGC781114HZ3","PEGC781114HCHRRS06","CESAR VALENTE PEREA GARCIA ","20202",480,83101,1003,"05","12","ED01201",0,"11615",2,null,20200401,20200630,42937.720000000008,0]
[null,"CHIHUAHUA","00XXX0000X",124,"RAMJ770419E96","RAMJ770419HSPMRS01","JESUS ALFONSO RAMIREZ MARRUFO","20201",480,83101,1003,"05","12","CF33206",0,"13183",2,null,20200401,20200630,96082.91,0]
[null,"CHIHUAHUA","00XXX0000X",124,"ROMF8411116Z4","ROMF841111MCHJXR01","FARINA ROJAS MUÑOZ","20201",480,83101,1003,"05","12","T08201",0,"11845",2,null,20200401,20200630,39048.839999999997,0]
[null,"CHIHUAHUA","00XXX0000X",124,"SACP740829IP4","SACP740829MCHLNL05","PILAR ALICIA SALAZAR CONTRERAS",20214,480,83101,1003,"05","12","CF33204",0,"9333",2,null,20200401,20200630,80207.25,0]
[null,"CHIHUAHUA","00XXX0000X",124,"SIRS640927FF8","SIRS640927MCHLDL09","SILVIA SILVA RODRIGUEZ ","20104",480,83101,1003,"05","12","CF33206",0,14135,2,2,20200401,20200630,73993.98,0]
[null,"CHIHUAHUA","00XXX0000X",124,"VARS761230AZ5","VARS761230MCHLML03","SILVIA CAROLINA VALENZUELA RAMIREZ ",20215,480,83101,1003,"05","12","CF34205",0,"10163",2,null,20200401,20200630,59436.58,0]
[null,"CHIHUAHUA","00XXX0000X",124,"VAGP6007013D4","VAGP600701MCHLNT09","PATRICIA RAQUEL VALVERDE GONZALEZ","20105",480,83101,1003,"05","12","CF33206",0,10165,2,null,20200401,20200630,128647.44,0]
[null,"CHIHUAHUA","00XXX0000X",124,"RAPE620309J41","RAPE620309HCHYRN08","ENRIQUE RAY PORTILLO",20201,480,83101,1003,"05","12","CF33206",0,10164,2,1,20200401,20200630,66066.720000000001,0]
[null,"Total Personas : ",null,null,831,null,null,null,null,null,null,null,null,"Total Plazas : ",null,238,null,null,"Total Pto. Federal",null,{"$f":"SUM(Tabla12[Columna20])","v":31374385.246999975}]
[]
[null,null,null,null,null,null,null,null,null,null,null,null,null,null,null,null,null,null,"Total Ppto. Otras Fuentes:",null,null,{"$f":"SUM(V16:V848)","v":0}]
[]
[null,"*Total de Percepciones reportadas por la Entidad Federativa como pagadas al trabajador durante la comisión."]
[null,"Fuente : Información proporcionada por las Entidades Federativas"]

{"sheet":"II D) 2","index":7,"n_rows":29,"n_cols":19,"rows_kept":29,"cut":false,"hidden":false,"merged":[[8,1,8,9],[11,0,12,0],[11,1,12,1],[11,5,12,5],[11,2,12,2],[11,3,12,3],[11,4,12,4],[11,16,12,16],[11,15,12,15],[11,17,12,17],[11,18,12,18],[11,6,11,12],[11,13,12,13],[11,14,12,14]]}
[]
[]
[]
[]
[]
[]
[]
[null,"Formato: Movimientos de Plazas"]
[null,{"$f":"IF('1'!D22=\"Elige el Periodo…\",\"\",'1'!D22)","v":"Fondo de Aportaciones para la Educación Tecnológica y de Adultos/Colegio Nacional de Educación Profesional Técnica (FAETA/CONALEP)"},null,null,null,null,null,null,null,null,null,null,null,null,null,null,null,"2do. Trimestre 2020"]
[]
[]
[null,"Entidad Federativa","RFC","CURP","Nombre","Origen Presupuestal\n de la plazas","Clave Presupuestal",null,null,null,null,null,null,"Clave de nivel de puesto","Clave de nivel de sueldo","Zona Económica","Tipo de movimiento","Quincena Inicial","Quincena Final"]
[null,null,null,null,null,null,"Partida Presupuestal","Código de Pago","Clave de Unidad","Clave de Sub Unidad","Clave de Categoría","Horas Semana Mes ","Número de Plaza"]
[]
[null,"Entidad Federativa","RFC","CURP","Nombbre","Origen Presupuestal\n de la plazas","Partida Presupuestal","Código de Pago","Clave de Unidad","Clave de Sub Unidad","Clave de Categoría","Horas semana mes","Número de plaza","Clave de nivel de puesto","Clave de nivel de sueldo","Zona Económica","Tipo de movimiento","Quincena Inicial","Quincena Final"]
[null,"CHIHUAHUA","SAOD961029SV8","SAOD961029MCHNRN08","DIANA GUADALUPE SANDATE ORTEGA",1,83101,1003,"02","19","S01202","00.0",2414,27,"N04","C",2,202004,202011]
[null,"CHIHUAHUA","EARE580710TW7","EARE580710MMCRQL06","ELSA AMALIA ERRASQUIN ROQUE",4,83101,1001,"00","25","E3725","12.0","0",27,0,"C",1,202007,999999]
[null,"CHIHUAHUA","LURY8009223V9","LURY800922MSPNBJ02","YAJAIRA ALEJANDRA LUNA ROBLEDO",4,83101,1001,"00","26","E3711","14.0","0",27,0,"A",2,202004,202011]
[null,"CHIHUAHUA","PACJ951020J55","PACJ951020HCHZRN09","JUAN ANTONIO PAZ CERON",4,83101,1001,"00","26","E3711","13.0","0",27,0,"A",2,202004,202011]
[null,"CHIHUAHUA","SAGR890912TX9","SAGR890912HCHVTC08","RICARDO SAAVEDRA GUTIERREZ",4,83101,1001,"00","26","E3711","20.0","0",27,0,"A",2,202004,202011]
[null,"CHIHUAHUA","MOAI970902SU8","MOAI970902HCHNRS09","ISAAC MONREAL ARVIZU",4,83101,1001,"02","26","E3701","12.0","0",27,0,"A",2,202004,202011]
[null,"CHIHUAHUA","SORA920618QC4","SORA920618HVZTYL06","JOSE ALBERTO SOTO REYES",4,83101,1001,"02","26","E3701","16.0","0",27,0,"A",2,202004,202011]
[null,"CHIHUAHUA","VICG5002047Q6","VICG500204HCHTRL01","GILBERTO FELICIANO VITELA CARRASCO",4,83101,1001,"02","08","E3725","20.0","0",27,0,"C",1,202011,999999]
[null,"CHIHUAHUA","LOMR7805084Z7","LOMR780508HCHRNL09","RAUL ERNESTO LOERA MONARREZ",4,83101,1001,"03","23","E3725","20.0","0",27,0,"A",2,201415,202010]
[null,"Total Personas : ",9,null,null,null,null,null,null,null,"Total Plazas : ",null,1]
[]
[]
[]
[null,"Fuente : Información proporcionada por las Entidades Federativas"]

{"sheet":"II D) 4","index":8,"n_rows":28,"n_cols":17,"rows_kept":28,"cut":false,"hidden":false,"merged":[[24,13,24,14],[12,0,13,0],[12,6,13,6],[12,7,12,13],[12,14,12,15],[12,2,13,2],[12,1,13,1],[12,16,13,16],[12,5,13,5],[12,4,13,4],[12,3,13,3],[9,1,9,9]]}
[]
[]
[]
[]
[]
[]
[]
[]
[null,"Formato: Trabajadores Jubilados en el Periodo"]
[null,{"$f":"IF('1'!D22=\"Elige el Periodo…\",\"\",'1'!D22)","v":"Fondo de Aportaciones para la Educación Tecnológica y de Adultos/Colegio Nacional de Educación Profesional Técnica (FAETA/CONALEP)"},null,null,null,null,null,null,null,null,null,null,null,null,null,"2do. Trimestre 2020"]
[]
[]
[null,"Entidad Federativa","R.F.C.","CURP","NOMBRE","Clave CT","Última(s) ó Penultima(s) Plaza(s) Ocupada(s)\n(*)","Clave Presupuestal de la Jubilación",null,null,null,null,null,null,"Periodo ocupado",null,"Quincena de inicio de jubilación"]
[null,null,null,null,null,null,null,"Partida Presupuestal","Código de Pago","Clave de Unidad","Clave de Sub Unidad","Clave de Categoría","Horas Semana Mes ","Número de Plaza","Inicio","Conclusión"]
[]
[null,"Entidad Federativa","R.F.C.","CURP","NOMBRE","Clave Centro de Trabajo","Última(s) ó Penultima(s) Plaza(s) Ocupada(s)\n(*)","Partida Presupuestal","Código de Pago","Clave de Unidad","Clave de Sub Unidad","Clave de Categoría","Horas Semana Mes ","Número de Plaza","Periodo ocupado\nInicio","Periodo ocupado\nConclusión","Quincena de inicio de jubilación"]
[]
[]
[]
[]
[]
[]
[null,"Total Personas : ",0,null,null,null,null,null,null,null,null,"Total Plazas : ",null,0]
[]
[]
[]
[null,"Fuente : Información proporcionada por las Entidades Federativas"]
[null,"(*) Si  el trabajador se jubila con más de una clave presupuestal, por cada plaza se debe llenar un registro hasta que se haya informado acerca de todas las plazas del trabajador."]

{"sheet":"II D) 4 A","index":9,"n_rows":28,"n_cols":18,"rows_kept":28,"cut":false,"hidden":false,"merged":[[22,13,22,14],[9,1,9,7],[24,13,24,14],[12,17,13,17],[12,1,13,1],[12,2,13,2],[12,3,13,3],[12,4,13,4],[12,5,13,5],[12,6,12,12],[12,13,12,14],[12,15,13,15],[12,16,13,16]]}
[]
[]
[]
[]
[]
[]
[]
[]
[null,"Formato: Trabajadores que Tramitaron Licencia Prejubilatoria en el Periodo"]
[null,{"$f":"IF('1'!D22=\"Elige el Periodo…\",\"\",'1'!D22)","v":"Fondo de Aportaciones para la Educación Tecnológica y de Adultos/Colegio Nacional de Educación Profesional Técnica (FAETA/CONALEP)"},null,null,null,null,null,null,null,null,null,null,null,null,null,null,"2do. Trimestre 2020"]
[]
[]
[null,"Entidad Federativa","R.F.C.","CURP","NOMBRE","Clave integrada","Clave Presupuestal",null,null,null,null,null,null,"Periodo Licencia",null,"Percepciones pagadas con Presupuesto Federal en el  Periodo reportado*","Percepciones pagadas con Presupuesto de otra Fuente en el  Periodo reportado*","Clave CT Origen"]
[null,null,null,null,null,null,"Partida Presupuestal","Código de Pago","Clave de Unidad","Clave de Sub Unidad","Clave de Categoría","Horas Semana Mes ","Número de Plaza","Inicio","Conclusión"]
[]
[null,"Entidad Federativa","R.F.C.","CURP","NOMBRE","Clave integrada","Partida Presupuestal","Código de Pago","Clave de Unidad","Clave de Sub Unidad","Clave de Categoría","Horas Semana Mes ","Número de Plaza","Periodo Licencia\nInicio","Periodo Licencia\nConclusión","Percepciones pagadas con Presupuesto Federal en el  Periodo reportado*","Percepciones pagadas con Presupuesto de otra Fuente en el  Periodo reportado*","Clave CT Origen"]
[]
[]
[]
[]
[]
[]
[null,"Total Personas : ",0,null,null,null,null,null,null,null,"Total Plazas : ",null,0,"Total Pto. Federal",null,{"$f":"SUM(P17:P22)","v":0}]
[]
[null,null,null,null,null,null,null,null,null,null,null,null,null,"Total Ppto. Otras Fuentes",null,null,0]
[]
[null,"*Total de Percepciones reportadas por la Entidad Federativa como pagadas en el periodo "]
[null,"Fuente : Información proporcionada por las Entidades Federativas"]

{"sheet":"II D) 6","index":10,"n_rows":52,"n_cols":13,"rows_kept":52,"cut":false,"hidden":false,"merged":[[10,1,10,6],[13,12,14,12],[13,9,13,10],[13,11,14,11],[13,1,14,1],[13,2,14,2],[13,3,14,3],[13,4,14,4],[13,5,14,5],[13,6,14,6],[13,7,13,8]]}
[]
[]
[]
[]
[]
[]
[]
[]
[]
[null,"Formato: Trabajadores Contratados por Honorarios en el Periodo"]
[null,{"$f":"IF('1'!D22=\"Elige el Periodo…\",\"\",'1'!D22)","v":"Fondo de Aportaciones para la Educación Tecnológica y de Adultos/Colegio Nacional de Educación Profesional Técnica (FAETA/CONALEP)"},null,null,null,null,null,null,null,null,null,"2do. Trimestre 2020"]
[]
[]
[null,"Entidad Federativa","Clave Centro de Trabajo","R.F.C.","CURP","Nombre","Identificador del Contrato","Equivalencia",null,"Periodo de Contratación",null,"Función","Percepciones pagadas dentro del periodo reportado"]
[null,null,null,null,null,null,null,"Clave de Categoría","Horas Semana Mes ","Inicio","Conclusión"]
[]
[null,"Entidad Federativa","Clave Centro de Trabajo","R.F.C.","CURP","Nombre","Identificador del Contrato","Clave de Categoría","Horas Semana Mes ","Periodo de Contratación\nInicio","Periodo de Contratación\nConclusión","Función","Percepciones pagadas dentro del periodo reportado"]
[null,"CHIHUAHUA","00XXX0000X","RAPE620309J41","RAPE620309HCHYRN08","ENRIQUE RAY PORTILLO",1,"CF33206","00.0",20200101,20200630,"JEFE DE PROYECTO",66066.720000000001]
[null,"CHIHUAHUA","00XXX0000X","SIRS640927FF8","SIRS640927MCHLDL09","SILVIA SILVA RODRIGUEZ ",2,"CF33206","00.0",20200201,20200630,"JEFE DE PROYECTO",73993.98]
[null,"CHIHUAHUA","08DPT0011J","BAGA570401CF3","BAGA570401HCHRNN09","ANDRES BARBA GÁNDARA",3,"E3725",20,20200102,20200630,"DOCENTE",30303]
[null,"CHIHUAHUA","08DPT0013H","AOVP680821N74","AOVP680821MCHLLT07","PATRICIA GUADALUPE ALONSO VALENZUELA","0012020","T05801","00.0",20200102,20200630,"TÉCNICO BIBLIOTECARIO",25729.5]
[null,"CHIHUAHUA","08DPT0013H","AIBS821008VBA","AIBS821008HVZRRR09","SERGIO ARIAS BRAVO","0022020","CF33206","00.0",20200102,20200630,"JEFE DE PROYECTO SERVICIOS ESCOLARES",78454.92]
[null,"CHIHUAHUA","08DPT0013H","CAAJ800611RP7","CAAJ800611HCHHLL08","JULIO CESAR CHAVEZ ALVARADO","0032020","S01202","00.0",20200102,20200630,"AUXILIAR DE SERVICIOS GENERALES",23749.32]
[null,"CHIHUAHUA","08DPT0013H","DODK891025237","DODK891025MCHMMR03","KARLA KARINA DOMINGUEZ DOMINGUEZ","0042020","CF33204","00.0",20200102,20200630,"SUBJEFE TÉCNICO ESPECIALISTA",43632.539999999994]
[null,"CHIHUAHUA","08DPT0013H","EECA8503081Q2","EECA850308HSLCRB06","ABRAHAM JACOBO ECHEVARRIA CORRALES","0052020","CF33204","00.0",20200102,20200630,"SUBJEFE TÉCNICO ESPECIALISTA",43632.539999999994]
[null,"CHIHUAHUA","08DPT0013H","EAGJ991008R37","EAGJ991008MCHSZS02","JESSICA LIZBETH ESCAÑUELAS GUZMAN","0062020","CF33203","00.0",20200102,20200630,"TÉCNICO FINANCIERO",28768.139999999996]
[null,"CHIHUAHUA","08DPT0013H","EISC871230RT1","EISC871230MCHSNR08","CAROLINA ESPINOZA DE SANTIAGO","0072020","CF33204","00.0",20200102,20200630,"SUBJEFE TÉCNICO ESPECIALISTA",43632.539999999994]
[null,"CHIHUAHUA","08DPT0013H","GARS970720IY4","GARS970720MCHRDN02","SONIA YANIRA GARCIA RODRIGUEZ","0302020","ED0280","00.0",20200216,20200630,"TUTOR ESCOLAR",25729.5]
[null,"CHIHUAHUA","08DPT0013H","GOHD860913N63","GOHD860913MCLNRL08","DALIA LIBERTAD GONZALEZ HERNANDEZ","0082020","S01202","00.0",20200102,20200630,"AUXILIAR DE SERVICIOS GENERALES",23749.32]
[null,"CHIHUAHUA","08DPT0013H","HEAC5605024W8","HEAC560502HTCRRR19","JOSE CRUZ HERNANDEZ ARA","0092020","S01201","00.0",20200102,20200630,"ASISTENTE DE SERVICIOS BÁSICOS",21795.420000000002]
[null,"CHIHUAHUA","08DPT0013H","HECK800610371","HECK800610MMCRHR10","KARINA HERNANDEZ CHAVEZ","0102020","S01201","00.0",20200102,20200630,"ASISTENTE DE SERVICIOS BÁSICOS",21795.420000000002]
[null,"CHIHUAHUA","08DPT0013H","LOCS771008517","LOCS771008HCHPRR09","SERGIO LOPEZ  DE LA CRUZ","0112020","CF33206","00.0",20200102,20200630,"JEFE DE PROYECTO SERVICIOS ADMINISTRATIVOS",78454.92]
[null,"CHIHUAHUA","08DPT0013H","MARA971025347","MARA971025MCHNBR07","ARGELIA YAZMIN MANZUR REBOLLOZO","0122020","S01202","00.0",20200102,20200630,"AUXILIAR DE SERVICIOS GENERALES",23749.32]
[null,"CHIHUAHUA","08DPT0013H","NEAA910928HC9","NEAA910928HCHGCN09","ANTONIO NEGRETE ACOSTA","0132020","S01201","00.0",20200102,20200630,"ASISTENTE DE SERVICIOS BÁSICOS",21795.420000000002]
[null,"CHIHUAHUA","08DPT0013H","OISE001029EX3","OISE001029HCHRLRA7","ERICK LORENZO ORTIZ SILVA","0152020","S01202","00.0",20200102,20200630,"AUXILIAR DE SERVICIOS GENERALES",23749.32]
[null,"CHIHUAHUA","08DPT0013H","OISM951129R68","OISM951129MCHRLC03","MICHELLE ALEJANDRA ORTIZ SILVA","0162020","ED0280","00.0",20200102,20200630,"TUTOR ESCOLAR",25729.5]
[null,"CHIHUAHUA","08DPT0013H","PAVS900926C55","PAVS900926MVZDZN02","SANDY YUNUEN PADILLA VAZQUEZ","0172020","CF33204","00.0",20200102,20200630,"SUBJEFE TÉCNICO ESPECIALISTA",43632.539999999994]
[null,"CHIHUAHUA","08DPT0013H","PUYR780420172","PUYR780420MMCLXC00","ROCIO PULIDO  YAÑEZ","0182020","CF33206","00.0",20200102,20200630,"JEFE DE PROYECTO PROMOCIÓN Y VICULACIÓN",78454.92]
[null,"CHIHUAHUA","08DPT0013H","RACI731115V49","RACI73115HPLMNS06","ISRAEL RAMOS CONTRERAS","0312020","S01201","00.0",20200216,20200630,"ASISTENTE DE SERVICIOS BÁSICOS",21795.420000000002]
[null,"CHIHUAHUA","08DPT0013H","RESJ851201GQ9","RESJ851201HCHVPV07","JAVIER EDUARDO REVELES  SAPIEN","0192020","CF33206","00.0",20200102,20200630,"JEFE DE PROYECTO FORMACIÓN TÉCNICA",78454.92]
[null,"CHIHUAHUA","08DPT0013H","ROES970521Q99","ROES970521MCHDSN09","SINAI CAROLINA RODRIGUEZ ESTRADA","0202020","S01202","00.0",20200102,20200630,"AUXILIAR DE SERVICIOS GENERALES",23749.32]
[null,"CHIHUAHUA","08DPT0013H","RUMJ670308JU5","RUMJ670308HSPBRN01","JUAN RUBIO MARTINEZ","0212020","S01201","00.0",20200102,20200630,"ASISTENTE DE SERVICIOS BÁSICOS",21795.420000000002]
[null,"CHIHUAHUA","08DPT0013H","SARC911030SC8","SARC911030HCHLMR00","CARLOS SALGADO  ROMO","0222020","CF33204","00.0",20200102,20200630,"SUBJEFE TÉCNICO ESPECIALISTA",43632.539999999994]
[null,"CHIHUAHUA","08DPT0013H","SAVS980512N44","SAVS980512MCHVLR08","SARAH INES SAAVEDRA VILLEGAS","0232020","S01201","00.0",20200102,20200630,"ASISTENTE DE SERVICIOS BÁSICOS",21795.420000000002]
[null,"CHIHUAHUA","08DPT0013H","SIER8905149W5","SIER890514MCHGSS03","ROSA SELENE SIGALA ESQUIVEL","0242020","CF33204","00.0",20200102,20200630,"SUBJEFE TÉCNICO ESPECIALISTA",43632.539999999994]
[null,"CHIHUAHUA","08DPT0013H","TORR840104UJ5","TORR840104MCHRMQ05","RAQUEL IVETTE TORRES RAMIREZ","0252020","CF33204","00.0",20200102,20200630,"SUBJEFE TÉCNICO ESPECIALISTA",43632.539999999994]
[null,"Total Entidad Federativa Personas : ",null,29,null,null,null,null,null,null,null,"Subtotal Monto Pagado en el Periodo:",{"$f":"SUM(Tabla14[Percepciones pagadas dentro del periodo reportado])","v":1145086.9200000002}]
[]
[]
[null,null,null,null,null,null,null,null,null,"Total   Percepciones :",null,{"$f":"M47","v":1145086.9200000002}]
[]
[null,"Fuente : Información proporcionada por las Entidades Federativas"]

{"sheet":"II D) 7 1","index":11,"n_rows":168,"n_cols":19,"rows_kept":168,"cut":false,"hidden":false,"merged":[[161,16,161,17],[12,18,13,18],[12,13,13,13],[12,14,13,14],[12,15,13,15],[12,16,13,16],[8,17,8,18],[9,1,9,9],[12,6,13,6],[12,7,12,9],[12,10,13,10],[12,11,13,11],[12,12,13,12],[12,1,13,1],[12,2,13,2],[12,3,13,3],[12,4,13,4],[12,5,13,5],[12,17,13,17],[9,17,9,18]]}
[]
[]
[]
[]
[]
[]
[]
[]
[null,"Formato: Analítico de Categorías / Plazas Autorizadas con su Tabulador",null,null,null,null,null,null,null,null,null,null,null,null,null,null,"Entidad Federativa:",{"$f":"IF('1'!D21=\"Elige el Periodo…\",\"\",'1'!D21)","v":"CHIHUAHUA "}]
[null,{"$f":"IF('1'!D22=\"Elige el Periodo…\",\"\",'1'!D22)","v":"Fondo de Aportaciones para la Educación Tecnológica y de Adultos/Colegio Nacional de Educación Profesional Técnica (FAETA/CONALEP)"},null,null,null,null,null,null,null,null,null,null,null,null,null,null,null,"2do. Trimestre 2020"]
[]
[]
[null,"Clave Tipo educativo","Clave Nivel educativo","Clave Subnivel educativo","Descripción Nivel / Subnivel","Tipo Financiamiento","Partida Presupuestal","CATEGORIA",null,null,"Zona Económica","Nivel Puesto","Nivel Sueldo","Tipo Contratación","Monto mensual\npor plaza jornada","Monto mensual\nPor Plaza HSM","Número de Plazas Jornada","Número de Plazas HSM","Monto total autorizado"]
[null,null,null,null,null,null,null,"Tipo de Categoría"," Categoría","Descripción"]
[null,null,null,null,null,null,null,null,null,null,null,null,null,null,null,0]
[null,"Clave Tipo educativo","Clave Nivel educativo","Clave Subnivel educativo","Descripción Nivel / Subnivel","Tipo Financiamiento","Partida Presupestal","Tipo de Categoría"," Categoría","Descripción","Zona Económica","Nivel Puesto","Nivel Sueldo","Tipo Contratación","Monto mensual\npor plaza jornada","0","Número de Plazas Jornada","Número de Plazas HSM","Monto total autorizado"]
[null,2,21,"020","PERSONAL TECNICO",1,83101,5,"CF02103","DIRECTOR DEL PLANTEL B Y C ","C",27,"NB1","P",5753.58,0,1,0,5753.58]
[null,2,21,"020","PERSONAL TECNICO",1,83101,5,"CF02105","COORDINADOR EJECUTIVO II","C",27,"OB2","P",5165.88,0,1,0,5165.88]
[null,2,21,"020","PERSONAL TECNICO",1,83101,4,"CF33206","JEFE DE PROYECTO","C",27,"N07","P",22022.26,0,1,0,22022.26]
[null,2,21,"020","PERSONAL TECNICO",1,83101,4,"CF33206","JEFE DE PROYECTO","C",27,"N15","P",23268.959999999999,0,1,0,23268.959999999999]
[null,2,21,"020","PERSONAL TECNICO",1,83101,4,"CF33206","JEFE DE PROYECTO","C",27,"N15","P",24646.6,0,4,0,98586.4]
[null,2,21,"020","PERSONAL TECNICO",1,83101,4,"CF33204","SUBJEFE TECNICO ESPECIALISTA","C",27,"N13","P",14282.16,0,1,0,14282.16]
[null,2,21,"020","PERSONAL TECNICO",1,83101,4,"CF33204","SUBJEFE TECNICO ESPECIALISTA","C",27,"N13","P",15996.4,0,2,0,31992.799999999999]
[null,2,21,"020","PERSONAL TECNICO",1,83101,4,"CF33202","TECNICO EN CONTABILIDAD","C",27,"N09","P",9044.7999999999993,0,1,0,9044.7999999999993]
[null,2,21,"020","PERSONAL TECNICO",1,83101,4,"CF21202","ASISTENTE ESCOLAR Y SOCIAL","C",27,"N07","P",8405.34,0,1,0,8405.34]
[null,2,21,"020","PERSONAL TECNICO",1,83101,4,"CF04201","SECRETARIA B","C",27,"N07","P",8405.34,0,1,0,8405.34]
[null,2,21,"020","PERSONAL TECNICO",1,83101,4,"A03202","SECRETARIA C","C",27,"N05","P",7776.84,0,2,0,15553.68]
[null,2,21,"020","PERSONAL TECNICO",1,83101,4,"S01201","ASISTENTE DE SERVICIOS BASICOS","C",27,"N02","P",6464.34,0,4,0,25857.360000000001]
[null,2,21,"020","PERSONAL TECNICO",1,83101,4,"S01201","ASISTENTE DE SERVICIOS BASICOS","C",27,"N02","P",6117.66,0,3,0,18352.98]
[null,2,21,"020","PERSONAL TECNICO",1,83101,4,"S01202","AUXILIAR DE SERVICIOS GENERALES","C",27,"N04","P",7044.3,0,2,0,14088.6]
[null,2,21,"020","PERSONAL TECNICO",1,83101,4,"S01202","AUXILIAR DE SERVICIOS GENERALES","C",27,"N04","P",7467,0,1,0,7467]
[null,2,21,"020","PERSONAL TECNICO",1,83101,4,"CF18201","AUXILIAR DE SEGURIDAD","C",27,"N02","P",6464.34,0,2,0,12928.68]
[null,2,21,"020","PERSONAL TECNICO",1,83101,4,"CF18201","AUXILIAR DE SEGURIDAD","C",27,"N02","P",6117.66,0,1,0,6117.66]
[null,2,21,"020","PERSONAL TECNICO",1,83101,4,"CF18203","SUPERVISOR DE MANTENIMIENTO","C",27,"N09","P",9044.7999999999993,0,1,0,9044.7999999999993]
[null,2,21,"020","PERSONAL TECNICO",1,83101,4,"CF34201","TECNICO BIBLIOTECARIO","C",27,"N06","P",8089.36,0,1,0,8089.36]
[null,2,21,"020","PERSONAL TECNICO",1,83101,4,"CF34202","PROMOTOR CULTURAL Y DEPORTIVO","C",27,"N05","P",7776.84,0,1,0,7776.84]
[null,2,21,"020","PERSONAL TECNICO",1,83101,4,"CF19201","TUTOR ESCOLAR","C",27,"N06","P",8089.36,0,1,0,8089.36]
[null,2,21,"020","PERSONAL TECNICO",1,83101,4,"T08201","TECNICO EN GRAFICACION","C",27,"N08","P",8722.6,0,1,0,8722.6]
[null,2,21,"020","PERSONAL TECNICO",1,83101,4,"A03202","SECRETARIA C","C",27,"N05","P",6943.96,0,1,0,6943.96]
[null,2,21,"020","PERSONAL TECNICO",1,83101,4,"CF34202","PROMOTOR CULTURAL Y DEPORTIVO","C",27,"N05","P",7336.7,0,1,0,7336.7]
[null,2,21,"020","PERSONAL TECNICO",1,83101,4,"S01201","ASISTENTE DE SERVICIOS BASICOS","C",27,"N05","P",6852.1,0,1,0,6852.1]
[null,2,21,"020","PERSONAL TECNICO",1,83101,5,"CF02103","DIRECTOR DEL PLANTEL B Y C ","A",27,"NB2","P",5753.58,0,1,0,5753.58]
[null,2,21,"020","PERSONAL TECNICO",1,83101,5,"CF02105","COORDINADOR EJECUTIVO II","A",27,"N14","P",5165.88,0,1,0,5165.88]
[null,2,21,"020","PERSONAL TECNICO",1,83101,4,"CF33206","JEFE DE PROYECTO","A",27,"N15","P",26719.5,0,3,0,80158.5]
[null,2,21,"020","PERSONAL TECNICO",1,83101,4,"CF33206","JEFE DE PROYECTO","A",27,"N15","P",26343.1,0,1,0,26343.1]
[null,2,21,"020","PERSONAL TECNICO",1,83101,4,"CF33206","JEFE DE PROYECTO","A",27,"N15","P",26151.66,0,2,0,52303.32]
[null,2,21,"020","PERSONAL TECNICO",1,83101,4,"CF33204","SUBJEFE TECNICO ESPECIALISTA","A",27,"N13","P",18995.099999999999,0,7,0,132965.69999999998]
[null,2,21,"020","PERSONAL TECNICO",1,83101,4,"CF33204","SUBJEFE TECNICO ESPECIALISTA","A",27,"N13","P",17919.8,0,1,0,17919.8]
[null,2,21,"020","PERSONAL TECNICO",1,83101,4,"CF33204","SUBJEFE TECNICO ESPECIALISTA","A",27,"N13","P",14544.19,0,1,0,14544.19]
[null,2,21,"020","PERSONAL TECNICO",1,83101,4,"CF18203","SUPERVISOR DE MANTENIMIENTO","A",27,"N09","P",10740.5,0,3,0,32221.5]
[null,2,21,"020","PERSONAL TECNICO",1,83101,4,"CF04201","SECRETARIA B","A",27,"N07","P",9415.86,0,1,0,9415.86]
[null,2,21,"020","PERSONAL TECNICO",1,83101,4,"CF19201","TUTOR ESCOLAR","A",27,"N06","P",9606.36,0,2,0,19212.72]
[null,2,21,"020","PERSONAL TECNICO",1,83101,4,"CF34202","PROMOTOR CULTURAL Y DEPORTIVO","A",27,"N05","P",9371.94,0,1,0,9371.94]
[null,2,21,"020","PERSONAL TECNICO",1,83101,4,"A03202","SECRETARIA C","A",27,"N05","P",9371.94,0,1,0,9371.94]
[null,2,21,"020","PERSONAL TECNICO",1,83101,4,"S01202","AUXILIAR DE SERVICIOS GENERALES","A",27,"N04","P",8867,0,4,0,35468]
[null,2,21,"020","PERSONAL TECNICO",1,83101,4,"S01202","AUXILIAR DE SERVICIOS GENERALES","A",27,"N04","P",8364.84,0,2,0,16729.68]
[null,2,21,"020","PERSONAL TECNICO",1,83101,4,"CF34201","TECNICO BIBLIOTECARIO","A",27,"N06","P",9606.36,0,1,0,9606.36]
[null,2,21,"020","PERSONAL TECNICO",1,83101,4,"S01201","ASISTENTE DE SERVICIOS BASICOS","A",27,"N02","P",7265.16,0,4,0,29060.639999999999]
[null,2,21,"020","PERSONAL TECNICO",1,83101,4,"ED01201","TECNICO EN MATERIALES DIDACTICOS","A",27,"N06","P",9606.36,0,2,0,19212.72]
[null,2,21,"020","PERSONAL TECNICO",1,83101,4,"CF18201","AUXILIAR DE SEGURIDAD","A",27,"N02","P",7676.56,0,1,0,7676.56]
[null,2,21,"020","PERSONAL TECNICO",1,83101,4,"CF18201","AUXILIAR DE SEGURIDAD","A",27,"N02","P",7265.16,0,1,0,7265.16]
[null,2,21,"020","PERSONAL TECNICO",1,83101,5,"CF02103","DIRECTOR DEL PLANTEL B Y C ","C",27,"NB1","P",5753.58,0,1,0,5753.58]
[null,2,21,"020","PERSONAL TECNICO",1,83101,5,"CF02105","COORDINADOR EJECUTIVO II","C",27,"OB2","P",5165.8900000000003,0,1,0,5165.8900000000003]
[null,2,21,"020","PERSONAL TECNICO",1,83101,4,"CF33206","JEFE DE PROYECTO","C",27,"N15","P",24664.639999999999,0,2,0,49329.279999999999]
[null,2,21,"020","PERSONAL TECNICO",1,83101,4,"CF33206","JEFE DE PROYECTO","C",27,"N15","P",22022.23,0,4,0,88088.92]
[null,2,21,"020","PERSONAL TECNICO",1,83101,4,"CF33204","SUBJEFE TECNICO ESPECIALISTA","C",27,"N13","P",15996.41,0,2,0,31992.82]
[null,2,21,"020","PERSONAL TECNICO",1,83101,4,"CF33204","SUBJEFE TECNICO ESPECIALISTA","C",27,"N13","P",15090.75,0,1,0,15090.75]
[null,2,21,"020","PERSONAL TECNICO",1,83101,4,"CF33204","SUBJEFE TECNICO ESPECIALISTA","C",27,"N13","P",14282.14,0,1,0,14282.14]
[null,2,21,"020","PERSONAL TECNICO",1,83101,4,"CF33203","TECNICO FINANCIERO","C",27,"N09","P",9044.7800000000007,0,1,0,9044.7800000000007]
[null,2,21,"020","PERSONAL TECNICO",1,83101,4,"CF04201","SECRETARIA B","C",27,"N07","P",8405.35,0,2,0,16810.7]
[null,2,21,"020","PERSONAL TECNICO",1,83101,4,"CF21202","ASISTENTE ESCOLAR Y SOCIAL","C",27,"N07","P",8405.35,0,1,0,8405.35]
[null,2,21,"020","PERSONAL TECNICO",1,83101,4,"CF19201","TUTOR ESCOLAR","C",27,"N06","P",8089.37,0,1,0,8089.37]
[null,2,21,"020","PERSONAL TECNICO",1,83101,4,"A03202","SECRETARIA C","C",27,"N05","P",7776.84,0,1,0,7776.84]
[null,2,21,"020","PERSONAL TECNICO",1,83101,4,"A03202","SECRETARIA C","C",27,"N05","P",7336.71,0,2,0,14673.42]
[null,2,21,"020","PERSONAL TECNICO",1,83101,4,"CF34202","PROMOTOR CULTURAL Y DEPORTIVO","C",27,"N05","P",7776.84,0,1,0,7776.84]
[null,2,21,"020","PERSONAL TECNICO",1,83101,4,"S01202","AUXILIAR DE SERVICIOS GENERALES","C",27,"N04","P",7467,0,2,0,14934]
[null,2,21,"020","PERSONAL TECNICO",1,83101,4,"CF34201","TECNICO BIBLIOTECARIO","C",27,"N06","P",8405.35,0,1,0,8405.35]
[null,2,21,"020","PERSONAL TECNICO",1,83101,4,"S01201","ASISTENTE DE SERVICIOS BASICOS","C",27,"N02","P",6852.11,0,2,0,13704.22]
[null,2,21,"020","PERSONAL TECNICO",1,83101,4,"S01201","ASISTENTE DE SERVICIOS BASICOS","C",27,"N02","P",6464.34,0,3,0,19393.02]
[null,2,21,"020","PERSONAL TECNICO",1,83101,4,"S01201","ASISTENTE DE SERVICIOS BASICOS","C",27,"N02","P",6117.66,0,1,0,6117.66]
[null,2,21,"020","PERSONAL TECNICO",1,83101,4,"CF18201","AUXILIAR DE SEGURIDAD","C",27,"N02","P",6852.11,0,2,0,13704.22]
[null,2,21,"020","PERSONAL TECNICO",1,83101,5,"CF02103","DIRECTOR DEL PLANTEL B Y C ","A",27,"NB2","P",5753.58,0,1,0,5753.58]
[null,2,21,"020","PERSONAL TECNICO",1,83101,5,"CF02105","COORDINADOR EJECUTIVO II","A",27,"OB2","P",5165.88,0,1,0,5165.88]
[null,2,21,"020","PERSONAL TECNICO",1,83101,4,"CF33206","JEFE DE PROYECTO","A",27,"N15","P",26719.48,0,3,0,80158.44]
[null,2,21,"020","PERSONAL TECNICO",1,83101,4,"CF33206","JEFE DE PROYECTO","A",27,"N15","P",26151.64,0,3,0,78454.92]
[null,2,21,"020","PERSONAL TECNICO",1,83101,4,"CF33204","SUBJEFE TECNICO ESPECIALISTA","A",27,"N13","P",18995.099999999999,0,5,0,94975.5]
[null,2,21,"020","PERSONAL TECNICO",1,83101,4,"CF33203","TECNICO FINANCIERO","A",27,"N09","P",10740.5,0,1,0,10740.5]
[null,2,21,"020","PERSONAL TECNICO",1,83101,4,"CF18203","SUPERVISOR DE MANTENIMIENTO","A",27,"N09","P",10740.5,0,2,0,21481]
[null,2,21,"020","PERSONAL TECNICO",1,83101,4,"CF04201","SECRETARIA B","A",27,"N07","P",9981.2000000000007,0,1,0,9981.2000000000007]
[null,2,21,"020","PERSONAL TECNICO",1,83101,4,"CF19201","TUTOR ESCOLAR","A",27,"N06","P",9606.34,0,1,0,9606.34]
[null,2,21,"020","PERSONAL TECNICO",1,83101,4,"S01202","AUXILIAR DE SERVICIOS GENERALES","A",27,"N04","P",8867.02,0,2,0,17734.04]
[null,2,21,"020","PERSONAL TECNICO",1,83101,4,"S01202","AUXILIAR DE SERVICIOS GENERALES","A",27,"N04","P",8364.84,0,1,0,8364.84]
[null,2,21,"020","PERSONAL TECNICO",1,83101,4,"CF34202","PROMOTOR CULTURAL Y DEPORTIVO","A",27,"N05","P",9371.94,0,1,0,9371.94]
[null,2,21,"020","PERSONAL TECNICO",1,83101,4,"A03202","SECRETARIA C","A",27,"N05","P",9371.94,0,4,0,37487.760000000002]
[null,2,21,"020","PERSONAL TECNICO",1,83101,4,"S01201","ASISTENTE DE SERVICIOS BASICOS","A",27,"N02","P",7676.52,0,2,0,15353.04]
[null,2,21,"020","PERSONAL TECNICO",1,83101,5,"CF02103","DIRECTOR DEL PLANTEL B Y C ","C",27,"NB1","P",5753.58,0,1,0,5753.58]
[null,2,21,"020","PERSONAL TECNICO",1,83101,5,"CF02105","COORDINADOR EJECUTIVO II","C",27,"OB2","P",5165.88,0,1,0,5165.88]
[null,2,21,"020","PERSONAL TECNICO",1,83101,4,"CF33206","JEFE DE PROYECTO","C",27,"N15","P",24664.66,0,3,0,73993.98]
[null,2,21,"020","PERSONAL TECNICO",1,83101,4,"CF33206","JEFE DE PROYECTO","C",27,"N15","P",23268.959999999999,0,2,0,46537.919999999998]
[null,2,21,"020","PERSONAL TECNICO",1,83101,4,"CF33206","JEFE DE PROYECTO","C",27,"N15","P",22022.26,0,1,0,22022.26]
[null,2,21,"020","PERSONAL TECNICO",1,83101,4,"CF33203","TECNICO FINANCIERO","C",27,"N09","P",9044.7999999999993,0,1,0,9044.7999999999993]
[null,2,21,"020","PERSONAL TECNICO",1,83101,4,"CF04201","SECRETARIA B","C",27,"N07","P",7631.46,0,1,0,7631.46]
[null,2,21,"020","PERSONAL TECNICO",1,83101,4,"CF19201","TUTOR ESCOLAR","C",27,"N04","P",8089.36,0,1,0,8089.36]
[null,2,21,"020","PERSONAL TECNICO",1,83101,4,"A03202","SECRETARIA C","C",27,"N09","P",7776.84,0,2,0,15553.68]
[null,2,21,"020","PERSONAL TECNICO",1,83101,4,"S01202","AUXILIAR DE SERVICIOS GENERALES","C",27,"N06","P",7044.3,0,1,0,7044.3]
[null,2,21,"020","PERSONAL TECNICO",1,83101,4,"CF34201","TECNICO BIBLIOTECARIO","C",27,"N06","P",7631.46,0,1,0,7631.46]
[null,2,21,"020","PERSONAL TECNICO",1,83101,4,"S01201","ASISTENTE DE SERVICIOS BASICOS","C",27,"N05","P",6117.66,0,3,0,18352.98]
[null,2,21,"020","PERSONAL TECNICO",1,83101,4,"CF18201","AUXILIAR DE SEGURIDAD","C",27,"N02","P",6464.34,0,1,0,6464.34]
[null,2,21,"020","PERSONAL TECNICO",1,83101,4,"CF18203","SUPERVISOR DE MANTENIMIENTO","C",27,"N02","P",9044.7999999999993,0,2,0,18089.599999999999]
[null,2,21,"020","PERSONAL TECNICO",1,83101,4,"A03202","SECRETARIA C","C",27,"N05","P",7776.84,0,2,0,15553.68]
[null,2,21,"020","PERSONAL TECNICO",1,83101,4,"CF33206","JEFE DE PROYECTO","C",27,"N15","P",24664.66,0,3,0,73993.98]
[null,2,21,"020","PERSONAL TECNICO",1,83101,4,"CF33206","JEFE DE PROYECTO","C",27,"N15","P",22022.26,0,1,0,22022.26]
[null,2,21,"020","PERSONAL TECNICO",1,83101,4,"CF33203","TECNICO FINANCIERO","C",27,"N09","P",9044.7999999999993,0,1,0,9044.7999999999993]
[null,2,21,"020","PERSONAL TECNICO",1,83101,4,"S01202","AUXILIAR DE SERVICIOS GENERALES","C",27,"N02","P",6464.34,0,2,0,12928.68]
[null,2,21,"020","PERSONAL TECNICO",1,83101,5,"CF02104","DIRECTOR DE PLANTEL D Y E","C",27,"NA2","P",5165.88,0,1,0,5165.88]
[null,2,21,"020","PERSONAL TECNICO",1,83101,4,"CF33204","SUBJEFE TECNICO ESPECIALISTA","C",27,"N13","P",15996.4,0,1,0,15996.4]
[null,2,21,"020","PERSONAL TECNICO",1,83101,4,"CF18203","SUPERVISOR DE MANTENIMIENTO","C",27,"N09","P",9044.7999999999993,0,2,0,18089.599999999999]
[null,2,21,"020","PERSONAL TECNICO",1,83101,4,"CF18201","AUXILIAR DE SEGURIDAD","C",27,"N02","P",6852.1,0,1,0,6852.1]
[null,2,21,"020","PERSONAL TECNICO",1,83101,4,"CF04201","SECRETARIA B","C",27,"N07","P",8405.34,0,1,0,8405.34]
[null,2,21,"020","PERSONAL TECNICO",1,83101,4,"T08201","TECNICO EN GRAFICACION","C",27,"N08","P",8722.6,0,1,0,8722.6]
[null,2,21,"020","PERSONAL TECNICO",1,83101,4,"S01202","AUXILIAR DE SERVICIOS GENERALES","C",27,"N04","P",7467,0,1,0,7467]
[null,2,21,"020","PERSONAL TECNICO",1,83101,4,"CF19201","TUTOR ESCOLAR","C",27,"N06","P",7631.46,0,1,0,7631.46]
[null,2,21,"020","PERSONAL TECNICO",1,83101,4,"CF21202","ASISTENTE ESCOLAR Y SOCIAL","C",27,"N07","P",8405.34,0,1,0,8405.34]
[null,2,21,"020","PERSONAL TECNICO",1,83101,5,"CF02103","DIRECTOR DEL PLANTEL B Y C ","C",27,"NB1","P",5753.58,0,1,0,5753.58]
[null,2,21,"020","PERSONAL TECNICO",1,83101,5,"CF02105","COORDINADOR EJECUTIVO II","C",27,"OB2","P",5165.88,0,1,0,5165.88]
[null,2,21,"020","PERSONAL TECNICO",1,83101,4,"CF33206","JEFE DE PROYECTO","C",27,"N15","P",24664.66,0,5,0,123323.3]
[null,2,21,"020","PERSONAL TECNICO",1,83101,4,"CF33206","JEFE DE PROYECTO","C",27,"N15","P",22022.26,0,1,0,22022.26]
[null,2,21,"020","PERSONAL TECNICO",1,83101,4,"CF33204","SUBJEFE TECNICO ESPECIALISTA","C",27,"N13","P",15996.4,0,6,0,95978.4]
[null,2,21,"020","PERSONAL TECNICO",1,83101,4,"CF33204","SUBJEFE TECNICO ESPECIALISTA","C",27,"N13","P",14282.16,0,1,0,14282.16]
[null,2,21,"020","PERSONAL TECNICO",1,83101,4,"CF18203","SUPERVISOR DE MANTENIMIENTO","C",27,"N09","P",9044.7999999999993,0,2,0,18089.599999999999]
[null,2,21,"020","PERSONAL TECNICO",1,83101,4,"CF19201","TUTOR ESCOLAR","C",27,"N06","P",8089.36,0,1,0,8089.36]
[null,2,21,"020","PERSONAL TECNICO",1,83101,4,"CF04201","SECRETARIA B","C",27,"N07","P",8405.34,0,1,0,8405.34]
[null,2,21,"020","PERSONAL TECNICO",1,83101,4,"A03202","SECRETARIA C","C",27,"N05","P",7776.84,0,4,0,31107.360000000001]
[null,2,21,"020","PERSONAL TECNICO",1,83101,4,"S01202","AUXILIAR DE SERVICIOS GENERALES","C",27,"N03","P",7467,0,1,0,7467]
[null,2,21,"020","PERSONAL TECNICO",1,83101,4,"S01202","AUXILIAR DE SERVICIOS GENERALES","C",27,"N03","P",7044.3,0,2,0,14088.6]
[null,2,21,"020","PERSONAL TECNICO",1,83101,4,"S01202","AUXILIAR DE SERVICIOS GENERALES","C",27,"N03","P",6667.06,0,1,0,6667.06]
[null,2,21,"020","PERSONAL TECNICO",1,83101,4,"S01201","ASISTENTE DE SERVICIOS BASICOS","C",27,"N02","P",6464.34,0,3,0,19393.02]
[null,2,21,"020","PERSONAL TECNICO",1,83101,4,"S01201","ASISTENTE DE SERVICIOS BASICOS","C",27,"N02","P",6117.66,0,1,0,6117.66]
[null,2,21,"020","PERSONAL TECNICO",1,83101,4,"CF18201","AUXILIAR DE SEGURIDAD","C",27,"N02","P",6464.34,0,1,0,6464.34]
[null,2,21,"020","PERSONAL TECNICO",1,83101,4,"CF18201","AUXILIAR DE SEGURIDAD","C",27,"N02","P",6117.66,0,2,0,12235.32]
[null,2,21,"020","PERSONAL TECNICO",1,83101,5,"CF02100","SUBCOORDINADOR","C",27,"OC2","P",5165.8900000000003,0,3,0,15497.670000000002]
[null,2,21,"020","PERSONAL TECNICO",1,83101,4,"CF33206","JEFE DE PROYECTO","C",27,"N15","P",24664.65,0,6,0,147987.90000000002]
[null,2,21,"020","PERSONAL TECNICO",1,83101,4,"CF33206","JEFE DE PROYECTO","C",27,"N15","P",22022.23,0,1,0,22022.23]
[null,2,21,"020","PERSONAL TECNICO",1,83101,4,"CF34201","TECNICO BIBLIOTECARIO","C",27,"N06","P",7222.2,0,1,0,7222.2]
[null,2,21,"020","PERSONAL TECNICO",1,83101,4,"CF33204","SUBJEFE TECNICO ESPECIALISTA","C",27,"N13","P",15996.4,0,5,0,79982]
[null,2,21,"020","PERSONAL TECNICO",1,83101,5,"CF11100","DIRECTOR GENERAL ESTATAL","C",27,"MC2","P",11552.21,0,1,0,11552.21]
[null,2,21,"020","PERSONAL TECNICO",1,83101,4,"S01201","ASISTENTE DE SERVICIOS BASICOS","C",27,"N11","P",6117.66,0,1,0,6117.66]
[null,2,21,"020","PERSONAL TECNICO",1,83101,4,"CF34205","ADMINISTRATIVO TECNICO ESPECIALISTA","C",27,"N02","P",9698.2999999999993,0,1,0,9698.2999999999993]
[null,2,21,"020","PERSONAL TECNICO",1,83101,4,"ED01201","TECNICO EN MATERIALES DIDACTICOS","C",27,"N06","P",8089.35,0,1,0,8089.35]
[null,2,21,"020","PERSONAL TECNICO",1,83101,4,"T08201","TECNICO EN GRAFICACION","C",27,"N08","P",8722.6,0,1,0,8722.6]
[null,2,21,"020","PERSONAL TECNICO",1,83101,2,"E3725","DOCENTE","C",27,0,"H",0,472.65,0,4551,0]
[null,2,21,"020","PERSONAL TECNICO",1,83101,2,"E3713","DOCENTE","C",27,0,"H",0,409.55,0,909,0]
[null,2,21,"020","PERSONAL TECNICO",1,83101,2,"E3711","DOCENTE","C",27,0,"H",0,364.4,0,490,0]
[null,2,21,"020","PERSONAL TECNICO",1,83101,2,"E3701","DOCENTE","C",27,0,"H",0,267.89999999999998,0,51,0]
[null,2,21,"020","PERSONAL TECNICO",1,83101,2,"E3725","DOCENTE","A",27,0,"H",0,571.75,0,2322,0]
[null,2,21,"020","PERSONAL TECNICO",1,83101,2,"E3713","DOCENTE","A",27,0,"H",0,496.95,0,577,0]
[null,2,21,"020","PERSONAL TECNICO",1,83101,2,"E3711","DOCENTE","A",27,0,"H",0,439.7,0,763,0]
[null,2,21,"020","PERSONAL TECNICO",1,83101,2,"E3701","DOCENTE","A",27,0,"H",0,326.3,0,141,0]
[null,2,21,"020","PERSONAL TECNICO",1,83101,5,"CF11102","DIRECTOR DEL CENTRO","A",27,"NB2","P",5753.58,0,1,0,5753.58]
[null,2,21,"020","PERSONAL TECNICO",1,83101,5,"CF01601","JEFE DE UNIDAD","A",27,"OC1","P",5165.88,0,4,0,20663.52]
[null,2,21,"020","PERSONAL TECNICO",1,83101,4,"CF33204","SUBJEFE TECNICO ESPECIALISTA","A",27,"N13","P",18995.099999999999,0,5,0,94975.5]
[null,null,null,null,null,null,null,null,null,null,null,null,null,"Total Jornada:",{"$f":"SUBTOTAL(109,Tabla15[Monto mensual\npor plaza jornada])","v":1479619.8299999996},null,"Total Autorizado:",null,{"$f":"SUBTOTAL(109,Tabla15[Monto total autorizado])","v":3007674.1599999992}]
[null,null,null,null,null,null,null,null,null,null,null,null,null,"Total HSM",null,{"$f":"SUM(P17:P162)","v":3349.2}]
[]
[null,"Fuente : Información proporcionada por las Entidades Federativas"]
[]
[]
[null,null,null,null,null,null,null,null," "]

{"sheet":"II D) 7 2 ","index":12,"n_rows":172,"n_cols":18,"rows_kept":172,"cut":false,"hidden":false,"merged":[[14,8,15,8],[14,9,14,13],[14,14,14,16],[10,16,10,17],[11,1,11,9],[14,1,15,1],[14,2,15,2],[14,3,15,3],[14,17,15,17],[14,6,15,6],[14,7,15,7],[14,4,15,4],[14,5,15,5],[11,16,11,17]]}
[]
[]
[]
[]
[]
[]
[]
[]
[]
[]
[null,"Formato: Catálogo de Categorías y Tabuladores",null,null,null,null,null,null,null,null,null,null,null,null,null,"Entidad Federativa:",{"$f":"IF('1'!D21=\"Elige el Periodo…\",\"\",'1'!D21)","v":"CHIHUAHUA "}]
[null,{"$f":"IF('1'!D22=\"Elige el Periodo…\",\"\",'1'!D22)","v":"Fondo de Aportaciones para la Educación Tecnológica y de Adultos/Colegio Nacional de Educación Profesional Técnica (FAETA/CONALEP)"},null,null,null,null,null,null,null,null,null,null,null,null,null,null,"2do. Trimestre 2020"]
[]
[]
[null,"Identificador origen presupuestal de la plaza","Clave de categoría","Descripción de la categoría","Tipo de contratación","Tipo de categoría","Clave de concepto de pago","Clave de nivel de puesto","Clave de nivel de sueldo","Sueldo asignado por zona económica",null,null,null,null,"Datos adicionales de horas",null,null,"Fecha de actualización"]
[null,null,null,null,null,null,null,null,null,"Inicio de vigencia del sueldo","Fin de vigencia del sueldo","Monto Mensual Jornada ó de HSM\nZona A","Monto Mensual Jornada ó de HSM\nZona B","Monto Mensual Jornada ó de HSM\nZona C","Horas \nde compatibilidad","Horas de servicio (HSM)","Horas de docencia"]
[]
[null,"Identificador origen presupuestal de la plaza","Clave de categoría","Descripción de la categoría","Tipo de contratación","Tipo de categoría","Clave de concepto de pago","Clave de nivel de puesto","Clave de nivel de sueldo","Inicio de vigencia del sueldo","Fin de vigencia del sueldo","Monto Mensual Jornada ó de HSM\nZona A","Monto Mensual Jornada ó de HSM\nZona B","Monto Mensual Jornada ó de HSM\nZona C","Horas \nde compatibilidad","Horas de servicio (HSM)","Horas de docencia","Fecha de actualización"]
[null,1,"CF02103","DIRECTOR DEL PLANTEL B Y C ","P",5,1003,27,"NB1",199918,999999,0,0,5753.58,0,40,"00.0","20190201"]
[null,1,"CF02105","COORDINADOR EJECUTIVO II","P",5,1003,27,"OB2",199918,999999,0,0,5165.88,0,40,"00.0","20190201"]
[null,1,"CF33206","JEFE DE PROYECTO","P",2,1003,27,"N15",199918,999999,0,0,24646.6,0,40,"00.0","20190201"]
[null,1,"CF33206","JEFE DE PROYECTO","P",2,1003,27,"N15",199918,999999,0,0,22022.26,0,40,"00.0","20190201"]
[null,1,"CF33206","JEFE DE PROYECTO","P",2,1003,27,"N15",199918,999999,0,0,23268.959999999999,0,40,"00.0","20190201"]
[null,1,"CF33204","SUBJEFE TECNICO ESPECIALISTA","P",2,1003,27,"N13",199918,999999,0,0,14282.16,0,40,"00.0","20190201"]
[null,1,"CF33204","SUBJEFE TECNICO ESPECIALISTA","P",2,1003,27,"N13",199918,999999,0,0,15996.4,0,40,"00.0","20190201"]
[null,1,"CF33202","TECNICO EN CONTABILIDAD","P",2,1003,27,"N09",199918,999999,0,0,9044.7999999999993,0,40,"00.0","20190201"]
[null,1,"CF04201","SECRETARIA B","P",2,1003,27,"N07",199918,999999,0,0,8405.34,0,40,"00.0","20190201"]
[null,1,"A03202","SECRETARIA C","P",2,1003,27,"N05",199918,999999,0,0,7776.84,0,40,"00.0","20190201"]
[null,1,"S01201","ASISTENTE DE SERVICIOS BASICOS","P",2,1003,27,"N02",199918,999999,0,0,6464.34,0,40,"00.0","20190201"]
[null,1,"S01201","ASISTENTE DE SERVICIOS BASICOS","P",2,1003,27,"N02",199918,999999,0,0,6852.1,0,40,"00.0","20190201"]
[null,1,"S01201","ASISTENTE DE SERVICIOS BASICOS","P",2,1003,27,"N02",199918,999999,0,0,6117.66,0,40,"00.0","20190201"]
[null,1,"S01202","AUXILIAR DE SERVICIOS GENERALES","P",2,1003,27,"N04",199918,999999,0,0,7044.3,0,40,"00.0","20190201"]
[null,1,"S01202","AUXILIAR DE SERVICIOS GENERALES","P",2,1003,27,"N04",199918,999999,0,0,7467,0,40,"00.0","20190201"]
[null,1,"CF18201","AUXILIAR DE SEGURIDAD","P",2,1003,27,"N02",199918,999999,0,0,6464.34,0,40,"00.0","20190201"]
[null,1,"CF34201","TECNICO BIBLIOTECARIO","P",2,1003,27,"N06",199918,999999,0,0,8089.36,0,40,"00.0","20190201"]
[null,1,"CF34202","PROMOTOR CULTURAL Y DEPORTIVO","P",2,1003,27,"N05",199918,999999,0,0,7776.84,0,40,"00.0","20190201"]
[null,1,"CF19201","TUTOR ESCOLAR","P",2,1003,27,"N06",199918,999999,0,0,8089.36,0,40,"00.0","20190201"]
[null,1,"CF18203","SUPERVISOR DE MANTENIMIENTO","P",2,1003,27,"N09",199918,999999,0,0,9044.7999999999993,0,40,"00.0","20190201"]
[null,1,"CF21202","ASISTENTE ESCOLAR Y SOCIAL","P",2,1003,27,"N07",199918,999999,0,0,8405.34,0,40,"00.0","20190201"]
[null,1,"T08201","TECNICO EN GRAFICACION","P",2,1003,27,"N08",199918,999999,0,0,8722.6,0,40,"00.0","20190201"]
[null,1,"A03202","SECRETARIA C","P",2,1003,27,"N05",199918,999999,0,0,6973.96,0,40,"00.0","20190201"]
[null,1,"CF34202","PROMOTOR CULTURAL Y DEPORTIVO","P",2,1003,27,"N05",199918,999999,0,0,7336.7,0,40,"00.0","20190201"]
[null,1,"CF18201","AUXILIAR DE SEGURIDAD","P",2,1003,27,"N02",199918,999999,0,0,6117.66,0,40,"00.0","20190201"]
[null,1,"CF02103","DIRECTOR DEL PLANTEL B Y C ","P",5,1003,27,"NB2",199918,999999,5753.58,0,0,0,40,"00.0","20190201"]
[null,1,"CF02105","COORDINADOR EJECUTIVO II","P",5,1003,27,"N14",199918,999999,5165.88,0,0,0,40,"00.0","20190201"]
[null,1,"CF33206","JEFE DE PROYECTO ","P",2,1003,27,"N15",199918,999999,80158.5,0,0,0,40,"00.0","20190201"]
[null,1,"CF33206","JEFE DE PROYECTO ","P",2,1003,27,"N15",199918,999999,26343.1,0,0,0,40,"00.0","20190201"]
[null,1,"CF33206","JEFE DE PROYECTO ","P",2,1003,27,"N15",199918,999999,52303.32,0,0,0,40,"00.0","20190201"]
[null,1,"CF33204","SUBJEFE TECNICO ESPECIALISTA","P",2,1003,27,"N13",199918,999999,132965.70000000001,0,0,0,40,"00.0","20190201"]
[null,1,"CF33204","SUBJEFE TECNICO ESPECIALISTA","P",2,1003,27,"N13",199918,999999,17919.8,0,0,0,40,"00.0","20190201"]
[null,1,"CF33204","SUBJEFE TECNICO ESPECIALISTA","P",2,1003,27,"N13",199918,999999,14544.19,0,0,0,40,"00.0","20190201"]
[null,1,"CF18203","SUPERVISOR DE MANTENIMIENTO","P",2,1003,27,"N09",199918,999999,32221.5,0,0,0,40,"00.0","20190201"]
[null,1,"CF04201","SECRETARIA B","P",2,1003,27,"N07",199918,999999,9415.86,0,0,0,40,"00.0","20190201"]
[null,1,"CF19201","TUTOR ESCOLAR","P",2,1003,27,"N06",199918,999999,19212.72,0,0,0,40,"00.0","20190201"]
[null,1,"CF34202","PROMOTOR CULTURAL Y DEPORTIVO","P",2,1003,27,"N06",199918,999999,9371.94,0,0,0,40,"00.0","20190201"]
[null,1,"A03202","SECRETARIA C","P",2,1003,27,"N05",199918,999999,9371.94,0,0,0,40,"00.0","20190201"]
[null,1,"S01202","AUXILIAR DE SERVICIOS GENERALES","P",2,1003,27,"N05",199918,999999,35468,0,0,0,40,"00.0","20190201"]
[null,1,"S01202","AUXILIAR DE SERVICIOS GENERALES","P",2,1003,27,"N04",199918,999999,16729.68,0,0,0,40,"00.0","20190201"]
[null,1,"CF34201","TECNICO BIBLIOTECARIO","P",2,1003,27,"N06",199918,999999,9606.36,0,0,0,40,"00.0","20190201"]
[null,1,"S01201","ASISTENTE DE SERVICIOS BASICOS","P",2,1003,27,"N02",199918,999999,29060.639999999999,0,0,0,40,"00.0","20190201"]
[null,1,"ED01201","TECNICO EN MATERIALES DIDACTICOS","P",2,1003,27,"N02",199918,999999,19212.72,0,0,0,40,"00.0","20190201"]
[null,1,"CF18201","AUXILIAR DE SEGURIDAD","P",2,1003,27,"N02",199918,999999,7676.56,0,0,0,40,"00.0","20190201"]
[null,1,"CF18201","AUXILIAR DE SEGURIDAD","P",2,1003,27,"N06",199918,999999,7265.16,0,0,0,40,"00.0","20190201"]
[null,1,"CF02103","DIRECTOR DEL PLANTEL B Y C ","P",5,1003,27,"NB1",199918,999999,0,0,5753.58,0,40,"00.0","20190201"]
[null,1,"CF02105","COORDINADOR EJECUTIVO II","P",5,1003,27,"OB2",199918,999999,0,0,5165.8900000000003,0,40,"00.0","20190201"]
[null,1,"CF33206","JEFE DE PROYECTO","P",2,1003,27,"N15",199918,999999,0,0,24664.639999999999,0,40,"00.0","20190201"]
[null,1,"CF33206","JEFE DE PROYECTO","P",2,1003,27,"N15",199918,999999,0,0,22022.23,0,40,"00.0","20190201"]
[null,1,"CF33204","SUBJEFE TECNICO ESPECIALISTA","P",2,1003,27,"N13",199918,999999,0,0,15996.41,0,40,"00.0","20190201"]
[null,1,"CF33204","SUBJEFE TECNICO ESPECIALISTA","P",2,1003,27,"N13",199918,999999,0,0,15090.75,0,40,"00.0","20190201"]
[null,1,"CF33204","SUBJEFE TECNICO ESPECIALISTA","P",2,1003,27,"N13",199918,999999,0,0,14282.14,0,40,"00.0","20190201"]
[null,1,"CF33203","TECNICO FINANCIERO","P",2,1003,27,"N09",199918,999999,0,0,9044.7800000000007,0,40,"00.0","20190201"]
[null,1,"CF34202","PROMOTOR CULTURAL Y DEPORTIVO","P",2,1003,27,"N05",199918,999999,0,0,7776.84,0,40,"00.0","20190201"]
[null,1,"CF21202","ASISTENTE ESCOLAR Y SOCIAL","P",2,1003,27,"N07",199918,999999,0,0,8405.35,0,40,"00.0","20190201"]
[null,1,"CF19201","TUTOR ESCOLAR","P",2,1003,27,"N06",199918,999999,0,0,8089.37,0,40,"00.0","20190201"]
[null,1,"A03202","SECRETARIA C","P",2,1003,27,"N05",199918,999999,0,0,7776.84,0,40,"00.0","20190201"]
[null,1,"A03202","SECRETARIA C","P",2,1003,27,"N05",199918,999999,0,0,7336.71,0,40,"00.0","20190201"]
[null,1,"CF04201","SECRETARIA B","P",2,1003,27,"N05",199918,999999,0,0,8405.35,0,40,"00.0","20190201"]
[null,1,"CF34201","TECNICO BIBLIOTECARIO","P",2,1003,27,"N06",199918,999999,0,0,8089.37,0,40,"00.0","20190201"]
[null,1,"S01201","ASISTENTE DE SERVICIOS BASICOS","P",2,1003,27,"N02",199918,999999,0,0,6852.11,0,40,"00.0","20190201"]
[null,1,"S01201","ASISTENTE DE SERVICIOS BASICOS","P",2,1003,27,"N02",199918,999999,0,0,6464.34,0,40,"00.0","20190201"]
[null,1,"S01201","ASISTENTE DE SERVICIOS BASICOS","P",2,1003,27,"N02",199918,999999,0,0,6117.66,0,40,"00.0","20190201"]
[null,1,"S01202","AUXILIAR DE SERVICIOS GENERALES","P",2,1003,27,"N04",199918,999999,0,0,7467,0,40,"00.0","20190201"]
[null,1,"CF18201","AUXILIAR DE SEGURIDAD","P",2,1003,27,"N02",199918,999999,0,0,6852.11,0,40,"00.0","20190201"]
[null,1,"S01201","ASISTENTE DE SERVICIOS BASICOS","P",2,1003,27,"N02",199918,999999,7676.52,0,0,0,40,"00.0","20190201"]
[null,1,"S01201","ASISTENTE DE SERVICIOS BASICOS","P",2,1003,27,"N02",199918,999999,7676.52,0,0,0,40,"00.0","20190201"]
[null,1,"S01202","AUXILIAR DE SERVICIOS GENERALES","P",2,1003,27,"N04",199918,999999,8364.84,0,0,0,40,"00.0","20190201"]
[null,1,"S01202","AUXILIAR DE SERVICIOS GENERALES","P",2,1003,27,"N04",199918,999999,8867.02,0,0,0,40,"00.0","20190201"]
[null,1,"S01202","AUXILIAR DE SERVICIOS GENERALES","P",2,1003,27,"N04",199918,999999,8867.02,0,0,0,40,"00.0","20190201"]
[null,1,"CF34202","PROMOTOR CULTURAL Y DEPORTIVO","P",2,1003,27,"N05",199918,999999,9371.94,0,0,0,40,"00.0","20190201"]
[null,1,"A03202","SECRETARIA C","P",2,1003,27,"N05",199918,999999,9371.94,0,0,0,40,"00.0","20190201"]
[null,1,"A03202","SECRETARIA C","P",2,1003,27,"N05",199918,999999,9371.94,0,0,0,40,"00.0","20190201"]
[null,1,"A03202","SECRETARIA C","P",2,1003,27,"N05",199918,999999,9371.94,0,0,0,40,"00.0","20190201"]
[null,1,"A03202","SECRETARIA C","P",2,1003,27,"N05",199918,999999,9371.94,0,0,0,40,"00.0","20190201"]
[null,1,"CF19201","TUTOR ESCOLAR","P",2,1003,27,"N06",199918,999999,9606.34,0,0,0,40,"00.0","20190201"]
[null,1,"CF04201","SECRETARIA B","P",2,1003,27,"N07",199918,999999,9981.2000000000007,0,0,0,40,"00.0","20190201"]
[null,1,"CF18203","SUPERVISOR DE MANTENIMIENTO","P",2,1003,27,"N09",199918,999999,10740.5,0,0,0,40,"00.0","20190201"]
[null,1,"CF18203","SUPERVISOR DE MANTENIMIENTO","P",2,1003,27,"N09",199918,999999,10740.5,0,0,0,40,"00.0","20190201"]
[null,1,"CF33203","TECNICO FINANCIERO","P",2,1003,27,"N09",199918,999999,10740.5,0,0,0,40,"00.0","20190201"]
[null,1,"CF33204","SUBJEFE TECNICO ESPECIALISTA","P",2,1003,27,"N13",199918,999999,18995.5,0,0,0,40,"00.0","20190201"]
[null,1,"CF33204","SUBJEFE TECNICO ESPECIALISTA","P",2,1003,27,"N13",199918,999999,18995.5,0,0,0,40,"00.0","20190201"]
[null,1,"CF33204","SUBJEFE TECNICO ESPECIALISTA","P",2,1003,27,"N13",199918,999999,18995.5,0,0,0,40,"00.0","20190201"]
[null,1,"CF33204","SUBJEFE TECNICO ESPECIALISTA","P",2,1003,27,"N13",199918,999999,18995.5,0,0,0,40,"00.0","20190201"]
[null,1,"CF33204","SUBJEFE TECNICO ESPECIALISTA","P",2,1003,27,"N13",199918,999999,18995.5,0,0,0,40,"00.0","20190201"]
[null,1,"CF02105","COORDINADOR EJECUTIVO II","P",5,1003,27,"OB2",199918,999999,5165.88,0,0,0,40,"00.0","20190201"]
[null,1,"CF33206","JEFE DE PROYECTO","P",2,1003,27,"N15",199918,999999,26719.48,0,0,0,40,"00.0","20190201"]
[null,1,"CF33206","JEFE DE PROYECTO","P",2,1003,27,"N15",199918,999999,26719.48,0,0,0,40,"00.0","20190201"]
[null,1,"CF33206","JEFE DE PROYECTO","P",2,1003,27,"N15",199918,999999,26719.48,0,0,0,40,"00.0","20190201"]
[null,1,"CF33206","JEFE DE PROYECTO","P",2,1003,27,"N15",199918,201807,26151.64,0,0,0,40,"00.0","20190201"]
[null,1,"CF33206","JEFE DE PROYECTO","P",2,1003,27,"N15",199918,999999,26151.64,0,0,0,40,"00.0","20190201"]
[null,1,"CF33206","JEFE DE PROYECTO","P",2,1003,27,"N15",199918,999999,26151.64,0,0,0,40,"00.0","20190201"]
[null,1,"CF02103","DIRECTOR DEL PLANTEL B Y C ","P",5,1003,27,"NB2",199918,999999,5753.58,0,0,0,40,"00.0","20190201"]
[null,1,"CF02103","DIRECTOR DEL PLANTEL B Y C ","P",5,1003,27,"NB1",199918,999999,0,0,5753.58,0,40,"00.0","20190201"]
[null,1,"CF02105","COORDINADOR EJECUTIVO II","P",5,1003,27,"OB2",199918,999999,0,0,5165.88,0,40,"00.0","20190201"]
[null,1,"CF33206","JEFE DE PROYECTO ","P",2,1003,27,"N15",199918,999999,0,0,24664.66,0,40,"00.0","20190201"]
[null,1,"CF33206","JEFE DE PROYECTO ","P",2,1003,27,"N15",199918,999999,0,0,23268.959999999999,0,40,"00.0","20190201"]
[null,1,"CF33206","JEFE DE PROYECTO ","P",2,1003,27,"N15",199918,999999,0,0,22022.26,0,40,"00.0","20190201"]
[null,1,"CF33203","TECNICO FINANCIERO","P",2,1003,27,"N09",199918,999999,0,0,9044.7999999999993,0,40,"00.0","20190201"]
[null,1,"CF19201","TUTOR ESCOLAR","P",2,1003,27,"N04",199918,999999,0,0,8089.36,0,40,"00.0","20190201"]
[null,1,"A03202","SECRETARIA C","P",2,1003,27,"N09",199918,999999,0,0,7776.84,0,40,"00.0","20190201"]
[null,1,"S01202","AUXILIAR DE SERVICIOS GENERALES","P",2,1003,27,"N06",199918,999999,0,0,7044.3,0,40,"00.0","20190201"]
[null,1,"CF34201","TECNICO BIBLIOTECARIO","P",2,1003,27,"N06",199918,999999,0,0,7631.46,0,40,"00.0","20190201"]
[null,1,"S01201","ASISTENTE DE SERVICIOS BASICOS","P",2,1003,27,"N02",199918,999999,0,0,6117.66,0,40,"00.0","20190201"]
[null,1,"CF18201","AUXILIAR DE SEGURIDAD","P",2,1003,27,"N02",199918,999999,0,0,6464.34,0,40,"00.0","20190201"]
[null,1,"CF18201","AUXILIAR DE SEGURIDAD","P",2,1003,27,"N02",199918,999999,0,0,6117.66,0,40,"00.0","20190201"]
[null,1,"CF18203","SUPERVISOR DE MANTENIMIENTO","P",2,1003,27,"N02",199918,999999,0,0,9044.7999999999993,0,40,"00.0","20190201"]
[null,1,"A03202","SECRETARIA C","P",2,1003,27,"N05",199918,999999,0,0,7776.84,0,40,"00.0","20190201"]
[null,1,"CF33206","JEFE DE PROYECTO","P",2,1003,27,"N15",199918,999999,0,0,24664.66,0,40,"00.0","20190201"]
[null,1,"CF33206","JEFE DE PROYECTO","P",2,1003,27,"N15",199918,999999,0,0,22022.26,0,40,"00.0","20190201"]
[null,1,"CF33203","TECNICO FINANCIERO","P",2,1003,27,"N09",199918,999999,0,0,9044.7999999999993,0,40,"00.0","20190201"]
[null,1,"S01201","ASISTENTE DE SERVICIOS BASICOS","P",2,1003,27,"N02",199918,999999,0,0,6464.34,0,40,"00.0","20190201"]
[null,1,"CF02104","DIRECTOR DE PLANTEL D Y E","P",5,1003,27,"NA2",199918,999999,0,0,5165.88,0,40,"00.0","20190201"]
[null,1,"CF33204","SUBJEFE TECNICO ESPECIALISTA","P",2,1003,27,"N13",199918,999999,0,0,15996.4,0,40,"00.0","20190201"]
[null,1,"CF18203","SUPERVISOR DE MANTENIMIENTO","P",2,1003,27,"N09",199918,999999,0,0,9044.7999999999993,0,40,"00.0","20190201"]
[null,1,"CF18201","AUXILIAR DE SEGURIDAD","P",2,1003,27,"N02",199918,999999,0,0,6852.1,0,40,"00.0","20190201"]
[null,1,"CF04201","SECRETARIA B","P",2,1003,27,"N07",199918,999999,0,0,8405.34,0,40,"00.0","20190201"]
[null,1,"T08201","TECNICO EN GRAFICACION","P",2,1003,27,"N08",199918,999999,0,0,8722.6,0,40,"00.0","20190201"]
[null,1,"S01202","AUXILIAR DE SERVICIOS GENERALES","P",2,1003,27,"N04",199918,999999,0,0,7467,0,40,"00.0","20190201"]
[null,1,"CF19201","TUTOR ESCOLAR","P",2,1003,27,"N06",199918,999999,0,0,7631.46,0,40,"00.0","20190201"]
[null,1,"CF21202","ASISTENTE ESCOLAR Y SOCIAL","P",2,1003,27,"N07",199918,999999,0,0,8405.34,0,40,"00.0","20190201"]
[null,1,"CF02103","DIRECTOR DEL PLANTEL B Y C ","P",5,1003,27,"NB2",199918,999999,0,0,5753.58,0,40,"00.0","20190201"]
[null,1,"CF02105","COORDINADOR EJECUTIVO II","P",5,1003,27,"OB2",199918,999999,0,0,5165.88,0,40,"00.0","20190201"]
[null,1,"CF33206","JEFE DE PROYECTO","P",2,1003,27,"N15",199918,999999,0,0,24664.66,0,40,"00.0","20190201"]
[null,1,"CF33206","JEFE DE PROYECTO","P",2,1003,27,"N15",199918,999999,0,0,22022.26,0,40,"00.0","20190201"]
[null,1,"CF33204","SUBJEFE TECNICO ESPECIALISTA","P",2,1003,27,"N13",199918,999999,0,0,15996.4,0,40,"00.0","20190201"]
[null,1,"CF33204","SUBJEFE TECNICO ESPECIALISTA","P",2,1003,27,"N13",199918,999999,0,0,14282.16,0,40,"00.0","20190201"]
[null,1,"CF18203","SUPERVISOR DE MANTENIMIENTO","P",2,1003,27,"N09",199918,999999,0,0,9044.7999999999993,0,40,"00.0","20190201"]
[null,1,"CF19201","TUTOR ESCOLAR","P",2,1003,27,"N06",199918,999999,0,0,8089.36,0,40,"00.0","20190201"]
[null,1,"CF04201","SECRETARIA B","P",2,1003,27,"N07",199918,999999,0,0,8405.34,0,40,"00.0","20190201"]
[null,1,"A03202","SECRETARIA C","P",2,1003,27,"N05",199918,999999,0,0,7776.84,0,40,"00.0","20190201"]
[null,1,"S01201","ASISTENTE DE SERVICIOS BASICOS","P",2,1003,27,"N02",199918,999999,0,0,6464.34,0,40,"00.0","20190201"]
[null,1,"S01202","AUXILIAR DE SERVICIOS GENERALES","P",2,1003,27,"N04",199918,999999,0,0,7467,0,40,"00.0","20190201"]
[null,1,"S01202","AUXILIAR DE SERVICIOS GENERALES","P",2,1003,27,"N04",199918,999999,0,0,7044.3,0,40,"00.0","20190201"]
[null,1,"CF18201","AUXILIAR DE SEGURIDAD","P",2,1003,27,"N02",199918,999999,0,0,6464.34,0,40,"00.0","20190201"]
[null,1,"CF18201","AUXILIAR DE SEGURIDAD","P",2,1003,27,"N02",199918,999999,0,0,6117.66,0,40,"00.0","20190201"]
[null,1,"CF02100","SUBCOORDINADOR","P",5,1003,27,"OC2",199918,999999,0,0,5165.8900000000003,0,40,"00.0","20190201"]
[null,1,"CF33206","JEFE DE PROYECTO","P",2,1003,27,"N15",199918,999999,0,0,24664.65,0,40,"00.0","20190201"]
[null,1,"CF33206","JEFE DE PROYECTO","P",2,1003,27,"N15",199918,999999,0,0,22022.231400000001,0,40,"00.0","20190201"]
[null,1,"CF34201","TECNICO BIBLIOTECARIO","P",2,1003,27,"N06",199918,999999,0,0,7222.2,0,40,"00.0","20190201"]
[null,1,"CF33204","SUBJEFE TECNICO ESPECIALISTA","P",2,1003,27,"N13",199918,999999,0,0,15996.4,0,40,"00.0","20190201"]
[null,1,"CF11100","DIRECTOR GENERAL ESTATAL","P",5,1003,27,"MC2",199918,999999,0,0,11552.21,0,40,"00.0","20190201"]
[null,1,"S01201","ASISTENTE DE SERVICIOS BASICOS","P",2,1003,27,"N02",199918,999999,0,0,6117.66,0,40,"00.0","20190201"]
[null,1,"CF34205","ADMINISTRATIVO TECNICO ESPECIALISTA","P",2,1003,27,"N11",199918,999999,0,0,9698.2999999999993,0,40,"00.0","20190201"]
[null,1,"ED01201","TECNICO EN MATERIALES DIDACTICOS","P",2,1003,27,"N06",199918,999999,0,0,8089.35,0,40,"00.0","20190201"]
[null,1,"T08201","TECNICO EN GRAFICACION","P",2,1003,27,"N08",199918,999999,0,0,8722.6,0,40,"00.0","20190201"]
[null,1,"CF11102","DIRECTOR DEL CENTRO","P",5,1003,27,"NB2",199918,999999,5753.58,0,0,0,40,"00.0","20190201"]
[null,1,"CF01601","JEFE DE UNIDAD","P",5,1003,27,"OC1",199918,999999,5165.8900000000003,0,0,0,40,"00.0","20190201"]
[null,1,"CF33204","SUBJEFE TECNICO ESPECIALISTA","P",2,1003,27,"N13",199918,999999,18995.099999999999,0,0,0,40,"00.0","20190201"]
[null,null,null,null,null,null,null,null,null,null,"Total Zona A:",{"$f":"SUBTOTAL(109,Tabla16[Monto Mensual Jornada ó de HSM\nZona A])","v":974312.69999999972}]
[null,null,null,null,null,null,null,null,null,null,null,"Total Zona B:",{"$f":"SUM(M19:M168)","v":0}]
[null,null,null,null,null,null,null,null,null,null,null,null,"Total Zona C:",{"$f":"SUM(N19:N169)","v":1018863.4414000001}]
[]
[null,"Fuente : Información proporcionada por las Entidades Federativas"]

{"sheet":"II D) 7 3","index":13,"n_rows":95,"n_cols":11,"rows_kept":95,"cut":false,"hidden":false,"merged":[[9,1,9,7],[8,9,8,10],[9,9,9,10]]}
[]
[]
[]
[]
[]
[]
[]
[]
[null,"Formato: Catálogo de Percepciones y Deducciones",null,null,null,null,null,null,"Entidad Federativa:",{"$f":"IF('1'!D21=\"Elige el Periodo…\",\"\",'1'!D21)","v":"CHIHUAHUA "}]
[null,{"$f":"IF('1'!D22=\"Elige el Periodo…\",\"\",'1'!D22)","v":"Fondo de Aportaciones para la Educación Tecnológica y de Adultos/Colegio Nacional de Educación Profesional Técnica (FAETA/CONALEP)"},null,null,null,null,null,null,null,"2do. Trimestre 2020"]
[]
[]
[null,"Identificador origen presupuestal de la plaza","Tipo de concepto de pago ","Origen de financiamiento del concepto de percepciones.","Porcentaje de participación federal por fuente de recursos","Grupo al que pertenece concepto de pago (Percepción y/o Deducción)","Clave de concepto de pago","Descripción del concepto de pago ","Partida presupuestal","Fecha del","Fecha  al"]
[]
[null,"Identificador origen presupuestal de la plaza","Tipo de concepto de pago ","Origen de financiamiento del concepto de percepciones.","Porcentaje de participación federal por fuente de recursos","Grupo al que pertenece concepto de pago (Percepción y/o Deducción)","Clave de concepto de pago","Descripción del concepto de pago ","Partida presupuestal","Fecha del","Fecha  al"]
[null,1,"P","F",100,"P2",1003,"SALARIO BASE",83301,19990918,99999999]
[null,1,"P","F",100,"P3",2766,"PRIMA DE ANTIGÜEDAD",83301,19990918,99999999]
[null,1,"P","F",100,"P1",5050,"EXCESO DE CREDITO AL SALARIO",83301,19990918,99999999]
[null,1,"P","F",100,"P3",2627,"ESTIMULO 10 DE MAYO",83301,19990918,99999999]
[null,1,"P","F",100,"P1",2517,"ESTIMULO POR PRODUCTIVIDAD",83301,19990918,99999999]
[null,1,"P","F",100,"P1",2800,"DESPENSA",83301,19990918,99999999]
[null,1,"P","F",100,"P2",3623,"PRIMA VACACIONAL",83301,19990918,99999999]
[null,1,"P","F",100,"P3",2600,"PUNTUALIDAD Y ASISTENCIA",83301,19990918,99999999]
[null,1,"P","F",100,"P3",4468,"HORAS EXTRAS",83301,19990918,99999999]
[null,1,"P","F",100,"P1",1602,"DESARROLLO Y CAPACITACION",83301,19990918,99999999]
[null,1,"P","F",100,"P3",1624,"PRIMA DOMINICAL",83301,19990918,99999999]
[null,1,"P","F",100,"P3",2754,"GUARDERIA",83301,19990918,99999999]
[null,1,"P","F",100,"P1",2518,"COMPENSACION GARANTIZADA",83301,19990918,99999999]
[null,1,"P","F",100,"P3",2850,"LABORES EN CONDICIONES INSALUBRES",83301,19990918,99999999]
[null,1,"P","F",100,"P3",2680,"ANTEOJOS O LENTES DE CONTACTO",83301,19990918,99999999]
[null,1,"P","F",100,"P3",2655,"APARATOS ORTOPEDICOS",83301,19990918,99999999]
[null,1,"P","F",100,"P3",2810,"AYUDA PARA TITULACION",83301,19990918,99999999]
[null,1,"P","F",100,"P3",2615,"CANASTILLA MATERNAL",83301,19990918,99999999]
[null,1,"P","F",100,"P3",2553,"DIAS ECONOMICOS",83301,19990918,99999999]
[null,1,"P","F",100,"P3",2565,"AJUSTE SALARIAL",83301,19990918,99999999]
[null,1,"P","F",100,"P3",2573,"DIAS DE DESCANSO OBLIGATORIO",83301,19990918,99999999]
[null,1,"P","F",100,"P3",2625,"AYUDA UTILES ESCOLARES",83301,19990918,99999999]
[null,1,"P","F",100,"P2",3613,"AGUINALDO",83301,19990918,99999999]
[null,1,"P","F",100,"P3",2830,"BONIFICACION IMPUESTO",83301,19990918,99999999]
[null,1,"P","F",100,"P3",1601,"NUPCIAS",83301,19990918,99999999]
[null,1,"P","F",100,"P3",2955,"OTRAS PERCEPCIONES",83301,19990918,99999999]
[null,1,"P","F",100,"P1",2805,"PREVISION MULTIPLE",83301,20111116,99999999]
[null,1,"D",null,100,"D3",2950,"OTRAS DEDUCCIONES",null,19990918,99999999]
[null,1,"D",null,100,"D2",5045,"I.S.P.T. A RETENER",null,19990918,99999999]
[null,1,"D",null,100,"D2",2735,"SEGURO DE VIDA AHISA",null,19990918,99999999]
[null,1,"D",null,100,"D1",8523,"CUOTA SINDICAL",null,19990918,99999999]
[null,1,"D",null,100,"D2",2920,"SEGURO DE RETIRO",null,19990918,99999999]
[null,1,"D",null,100,"D3",8135,"PRESTAMO ISSSTE",null,19990918,99999999]
[null,1,"D",null,100,"D3",8095,"CREDITO HIPOTECARIO",null,19990918,99999999]
[null,1,"D",null,100,"D3",5710,"ANTICIPO DE SUELDO",null,19990918,99999999]
[null,1,"D",null,100,"D3",8580,"PENSION ALIMENTICIA",null,19990918,99999999]
[null,1,"D",null,100,"D3",6044,"IMPUESTO A RETENER",null,19990918,99999999]
[null,1,"D",null,100,"D3",1927,"SEGURO DE DAÑOS FOVISSSTE",null,19990918,99999999]
[null,1,"D",null,100,"D3",2910,"PRESTAMO KONDINERO",null,20180401,99999999]
[null,1,"D",null,100,"D3",2915,"SEGURO DE VIDA COMERCIAL AMERICA",null,19990918,99999999]
[null,1,"D",null,100,"D3",2929,"DEDUCCIONES EXTRAS",null,19990918,99999999]
[null,1,"D",null,100,"D2",6250,"ISSSTE SEG SALUD",null,19990918,99999999]
[null,1,"D",null,100,"D2",6251,"ISSSTE SEG SALUD PENSIONADO",null,19990918,99999999]
[null,1,"D",null,100,"D2",6252,"ISSSTE SEG INVALIDEZ Y VIDA",null,19990918,99999999]
[null,1,"D",null,100,"D2",6253,"ISSSTE SEG SOCIALES Y CULT",null,19990918,99999999]
[null,1,"D",null,100,"D2",6254,"ISSSTE SEG RET CESANTIA AVZDA",null,19990918,99999999]
[null,1,"D",null,100,"D3",2740,"PRESTAMO DIMEX",null,19990918,20150415]
[null,1,"D",null,100,"D3",2740,"OTRAS DEDUCCIONES",null,20150416,99999999]
[null,1,"D",null,100,"D3",2912,"AHORRO SOLIDARIO EMP",null,19990918,99999999]
[null,1,"D",null,100,"D3",2880,"CREDITO CREDIFIEL",null,20130601,99999999]
[null,1,"D",null,100,"D3",2717,"SEGURO GENERAL AUTO",null,20150416,99999999]
[null,1,"D",null,100,"D3",2748,"SEGURO GENERAL VIDA",null,20150416,99999999]
[null,1,"D",null,100,"D3",2965,"SEGURO GENERAL SALUD",null,20150416,99999999]
[null,4,"P","F",100,"P1",1001,"SALARIO BASE",83301,20111116,99999999]
[null,4,"P","F",100,"P2",1005,"ESTIMULO",83301,20111116,99999999]
[null,4,"P","F",100,"P2",1006,"HORAS RECUPERADAS",83301,20111116,99999999]
[null,4,"D",null,100,"D1",2001,"I.S.R.",null,20111116,99999999]
[null,4,"D",null,100,"D2",2002,"CUOTA SINDICAL LOCAL",null,20111116,99999999]
[null,4,"D",null,100,"D1",2003,"SEG. SALUD T. ACTIVO",null,20111116,99999999]
[null,4,"D",null,100,"D2",2005,"PENSION ALIMENTICIA",null,20111116,99999999]
[null,4,"D",null,100,"D2",2006,"HORAS NO IMPARTIDAS",null,20111116,99999999]
[null,4,"D",null,100,"D1",2007,"S. RET. CESANTIA AVANZADA",null,20111116,99999999]
[null,4,"D",null,100,"D2",2013,"PRESTAMO ISSSTE",null,20111116,99999999]
[null,4,"D",null,100,"D2",2014,"PRESTAMO ISSSTE CORTO PLAZO",null,20111116,99999999]
[null,4,"D",null,100,"D2",2015,"PRESTAMO HIPOTECARIO",null,20111116,99999999]
[null,4,"D",null,100,"D2",2016,"SEGURO DE DAÑOS FOVISSTE",null,20111116,99999999]
[null,4,"D",null,100,"D2",2019,"TELETON",null,20111116,99999999]
[null,4,"D",null,100,"D3",2020,"PRESTAMO PERSONAL",null,20111116,99999999]
[null,4,"D",null,100,"D3",2021,"PRESTAMO CREDIFIEL",null,20130601,99999999]
[null,4,"D",null,100,"D1",2023,"SEG. SALUD T. PENSIONADO",null,20111116,99999999]
[null,4,"D",null,100,"D2",2024,"APORT. VOL. CRUZ ROJA",null,20111116,99999999]
[null,4,"D",null,100,"D1",2025,"SEG. INV. Y VIDA",null,20111116,99999999]
[null,4,"D",null,100,"D1",2026,"S. SOCIEDAD Y CULT.",null,20111116,99999999]
[null,4,"D",null,100,"D2",2870,"PRESTAMO CREDIEXPRESS",null,20140916,99999999]
[null,4,"D",null,100,"D3",2004,"CREDITO SALVADOR",null,20140916,99999999]
[null,4,"P","F",100,"P1",1035,"RETROACTIVO DE AGUINALDO",83301,20141116,99999999]
[null,4,"D",null,100,"D3",2036,"KONDINERO",null,20180401,99999999]
[null,4,"D",null,100,"D3",2038,"SEGURO AUTO",null,20150416,99999999]
[null,4,"D",null,100,"D3",2039,"SEGURO VIDA",null,20150416,99999999]
[null,"Fuente : Información proporcionada por las Entidades Federativas"]

{"sheet":"E)","index":14,"n_rows":27,"n_cols":8,"rows_kept":27,"cut":false,"hidden":false,"merged":[[9,1,9,5],[12,1,14,1],[12,2,14,2],[13,7,14,7],[12,3,14,3],[12,4,14,4],[12,5,12,7],[13,5,14,5],[13,6,14,6],[9,6,9,7]]}
[]
[]
[]
[]
[]
[]
[]
[]
[null,"Formato: Trabajadores que Cobran con RFC / CURP con Formato Incorrecto"]
[null,{"$f":"IF('1'!D22=\"Elige el Periodo…\",\"\",'1'!D22)","v":"Fondo de Aportaciones para la Educación Tecnológica y de Adultos/Colegio Nacional de Educación Profesional Técnica (FAETA/CONALEP)"},null,null,null,null,"2do. Trimestre 2020"]
[]
[]
[null,"Entidad Federativa","RFC","CURP","NOMBRE TRABAJADOR","Motivo"]
[null,null,null,null,null,"Sin RFC o erroneo","RFC Sin Homoclave","Sin CURP o Erronea"]
[]
[]
[null,"Entidad Federativa","RFC","CURP","NOMBRE TRABAJADOR","Sin RFC o erroneo","RFC Sin Homoclave","Sin CURP o Erronea"]
[]
[]
[]
[]
[]
[]
[null,"Total Personas : ",null,null,"Total Sin RFC o Erroneo:"]
[null,null,null,null,null,"Total RFC Sin Homoclave:"]
[null,null,null,null,null,null,"Total Sin CURP o Erroneo:"]
[null,"Fuente : Información proporcionada por las Entidades Federativas"]

{"sheet":"F) 1","index":15,"n_rows":27,"n_cols":19,"rows_kept":27,"cut":false,"hidden":false,"merged":[[9,1,9,6],[12,15,13,15],[12,16,13,16],[12,17,12,18],[12,1,13,1],[12,2,13,2],[12,3,13,3],[12,4,13,4],[12,5,13,5],[12,6,13,6],[12,7,13,7],[12,8,12,14],[9,17,9,18]]}
[]
[]
[]
[]
[]
[]
[]
[]
[null,"Formato: Trabajadores con Doble Asignación Salarial en Municipios no Colindantes Geográficamente"]
[null,{"$f":"IF('1'!D22=\"Elige el Periodo…\",\"\",'1'!D22)","v":"Fondo de Aportaciones para la Educación Tecnológica y de Adultos/Colegio Nacional de Educación Profesional Técnica (FAETA/CONALEP)"},null,null,null,null,null,null,null,null,null,null,null,null,null,null,null,"2do. Trimestre 2020"]
[]
[]
[null,"Entidad Federativa","Municipio","Localidad","RFC","CURP","Nombre del Trabajador","Clave integrada","Clave Presupuestal",null,null,null,null,null,null,"Clave CT","Nombre CT","Periodo en el CT"]
[null,null,null,null,null,null,null,null,"Partida Presupuestal","Código de Pago","Clave de Unidad","Clave de Sub Unidad","Clave de Categoría","Horas Semana Mes ","Número de Plaza",null,null,"Desde","Hasta"]
[]
[null,"Entidad Federativa","Municipio","Localidad","RFC","CURP","Nombre del Trabajador","Clave integrada","Partida Presupuestal","Código de Pago","Clave de Unidad","Clave de Sub Unidad","Clave de Categoría","Horas semana mes","Número de Plaza","Clave CT","Nombre CT","Periodo en el CT\nDesde","Periodo en el CTH\nasta"]
[]
[]
[]
[]
[]
[]
[null,"Total Personas : ",null,null,null,null,null,null,null,null,null,null,"Total Plazas : "]
[]
[]
[null,"Fuente : Información proporcionada por las Entidades Federativas"]
[null,"Importante: Listar Sólo los Municipios no Colindantes"]

{"sheet":"F) 2","index":16,"n_rows":27,"n_cols":20,"rows_kept":27,"cut":false,"hidden":false,"merged":[[13,3,14,3],[13,4,14,4],[13,5,14,5],[10,1,10,9],[13,19,14,19],[13,18,14,18],[13,6,13,12],[13,13,14,13],[13,14,14,14],[13,15,14,15],[13,16,13,17],[13,1,14,1],[13,2,14,2]]}
[]
[]
[]
[]
[]
[]
[]
[]
[]
[null,"Formato: Trabajadores Ocupando Plazas que Superan el Número de Horas de Compatibilidad Autorizadas"]
[null,{"$f":"IF('1'!D22=\"Elige el Periodo…\",\"\",'1'!D22)","v":"Fondo de Aportaciones para la Educación Tecnológica y de Adultos/Colegio Nacional de Educación Profesional Técnica (FAETA/CONALEP)"},null,null,null,null,null,null,null,null,null,null,null,null,null,null,null,null,"2do. Trimestre 2020"]
[]
[]
[null,"Entidad Federativa","RFC","CURP","Nombre","Clave integrada","Clave Presupuestal",null,null,null,null,null,null,"CT","Nombre CT","Turno CT","Periodo",null,"Total de Horas en el CT","Horas de compatibilidad de la categoría"]
[null,null,null,null,null,null,"Partida Presupuestal","Código de Pago","Clave de Unidad","Clave de Sub Unidad","Clave de Categoría","Horas Semana Mes ","Número de Plaza",null,null,null,"Desde","Hasta"]
[]
[null,"Entidad Federativa","RFC","CURP","Nombre","Clave integrada","Partida Presupuestal","Código de Pago","Clave de Unidad","Clave de Sub Unidad","Clave de Categoría","Horas semana mes","Número de plaza","CT","Nombre CT","Turno CT","Periodo\nDesde","Periodo\nHasta","Total de Horas en el CT","Horas de compatibilidad de la categoría"]
[]
[]
[]
[]
[]
[]
[null,"Total Personas : ",null,null,null,null,null,null,null,null,"Total Plazas : "]
[]
[]
[null,"Fuente : Información proporcionada por las Entidades Federativas"]

{"sheet":"G)","index":17,"n_rows":31,"n_cols":20,"rows_kept":31,"cut":false,"hidden":false,"merged":[[10,18,10,19],[13,19,14,19],[13,13,14,13],[13,14,14,14],[13,15,13,16],[13,17,14,17],[13,18,14,18],[10,1,10,8],[12,5,12,11],[13,1,14,1],[13,2,14,2],[13,3,14,3],[13,4,14,4],[13,5,14,5],[13,6,13,12]]}
[]
[]
[]
[]
[]
[]
[]
[]
[]
[null,"Formato: Trabajadores Cuyo Salario Básico Supere los Ingresos Promedio de un Docente en la Categoría más Alta del Tabulador Salarial Correspondiente a Cada Entidad"]
[null,{"$f":"IF('1'!D22=\"Elige el Periodo…\",\"\",'1'!D22)","v":"Fondo de Aportaciones para la Educación Tecnológica y de Adultos/Colegio Nacional de Educación Profesional Técnica (FAETA/CONALEP)"},null,null,null,null,null,null,null,null,null,null,null,null,null,null,null,null,"2do. Trimestre 2020"]
[]
[]
[null,"Entidad Federativa","R.F.C.","CURP","Nombre","Clave integrada","Clave Presupuestal Integrada y Categoria aparte",null,null,null,null,null,null,"Clave CT Origen","Nombre CT","Periodo",null,"Monto de Remuneraciones Mensuales ","Monto de referencia","Diferencia\n(R-S)"]
[null,null,null,null,null,null,"Partida Presupuestal","Código de Pago","Clave de Unidad","Clave de Sub Unidad","Clave de Categoría","Horas Semana Mes ","Número de Plaza",null,null,"Desde","Hasta"]
[]
[null,"Entidad Federativa","R.F.C.","CURP","Nombre","Clave integrada","Partida Presupuestal","Código de Pago","Clave de Unidad","Clave de Sub Unidad","Clave de Categoría","Horas Semana Mes ","No. de plaza","CT","Nombre CT","Periodo\nDesde","Periodo\nHasta","Monto de Remuneraciones Mensuales ","Monto de referencia","Diferencia\n(R-S)"]
[]
[]
[]
[]
[]
[]
[]
[]
[]
[null,"Total Personas : ",null,null,null,null,null,null,null,null,null,null,null,null,"Total Remuneraciones Mensuales:"]
[]
[null,null,null,null,null,null,null,null,null,null,null,null,null,null,null,null,null,"Total Diferencia:"]
[]
[null,"Fuente : Información proporcionada por las Entidades Federativas"]

{"sheet":"H)","index":18,"n_rows":13,"n_cols":8,"rows_kept":13,"cut":false,"hidden":false,"merged":[[0,1,0,2]]}
[null,"2do. Trimestre 2020"]
[null,"Movimientos de Personal por Centro de Trabajo"]
[null,"Personal Registrado en la Nómina Federalizada"]
[null,"Nómina","Plaza (Clave presupuestal)","Categoría de la plaza","RFC","CURP","Nombre","Movimientos"]
[]
[]
[]
[]
[]
[]
[null,"Información reportada por la Entidad Federativa, correspondiente al periodo"]
[null,"La Entidad Federativa pudo haber reportado pagos a más de una persona con la misma plaza por distintos motivos de carácter administrativo"]
[null,"Alta: Se refiere a la incorporación de la plaza a la Base de Datos en este sistema"]

{"sheet":"Listas","index":19,"n_rows":42,"n_cols":8,"rows_kept":42,"cut":false,"hidden":true,"merged":[]}
[]
[]
[]
[null,"Elige un Fondo…"]
[null,"Fondo de Aportaciones para la Educación Básica y Normal (FAEB)"]
[null,"Fondo de Aportaciones para la Educación Tecnológica y de Adultos/Colegio Nacional de Educación Profesional Técnica (FAETA/CONALEP)"]
[null,"Fondo de Aportaciones para la Educación Tecnológica y de Adultos/Instituto Nacional para la Educación de los Adultos (FAETA/INEA)"]
[]
[]
[null,null,null,null,null,null,null,"Elige la Entidad Federativa…"]
[null,"Elige el Periodo…",null,null,null,null,null,"AGUASCALIENTES"]
[null,"1er. Trimestre",null,null,null,null,null,"BAJA CALIFORNIA"]
[null,"2do. Trimestre",null,null,null,null,null,"BAJA CALIFORNIA SUR"]
[null,"3er. Trimestre",null,null,null,null,null,"CAMPECHE"]
[null,"4to. Trimestre",null,null,null,null,null,"COAHUILA "]
[null,null,null,"Elige el Año…",null,null,null,"COLIMA "]
[null,null,null,2013,null,null,null,"CHIAPAS "]
[null,null,null,2014,null,null,null,"CHIHUAHUA "]
[null,null,null,2015,null,null,null,"DISTRITO FEDERAL"]
[null,null,null,2016,null,null,null," DURANGO "]
[null,null,null,2017,null,null,null," GUANAJUATO "]
[null,null,null,2018,null,null,null," GUERRERO "]
[null,null,null,null,null,null,null," HIDALGO"]
[null,null,null,null,null,null,null," JALISCO "]
[null,null,null,null,null,null,null," MEXICO "]
[null,null,null,null,null,null,null," MICHOACAN "]
[null,null,null,null,null,null,null," MORELOS "]
[null,null,null,null,null,null,null," NAYARIT "]
[null,null,null,null,null,null,null," NUEVO LEON"]
[null,null,null,null,null,null,null," OAXACA "]
[null,null,null,null,null,null,null," PUEBLA "]
[null,null,null,null,null,null,null," QUERETARO "]
[null,null,null,null,null,null,null," QUINTANA ROO"]
[null,null,null,null,null,null,null," SAN LUIS"]
[null,null,null,null,null,null,null," SINALOA "]
[null,null,null,null,null,null,null," SONORA "]
[null,null,null,null,null,null,null," TABASCO "]
[null,null,null,null,null,null,null," TAMAULIPAS "]
[null,null,null,null,null,null,null," TLAXCALA "]
[null,null,null,null,null,null,null," VERACRUZ"]
[null,null,null,null,null,null,null," YUCATÁN "]
[null,null,null,null,null,null,null," ZACATECAS "]