{"text_format":"1","workbook":"xlsx","n_sheets":20,"sheets":["1","CARATULA RESUMEN","A Y  II D3","A Y II D4","B)","II B) Y 1","II C y 1_","II D) 2","II D) 4","II D) 4 A","II D) 6","II D) 7 1","II D) 7 2 ","II D) 7 3","E)","F) 1","F) 2","G)","H)","Listas"],"not_rendered":{"charts":0,"images":16,"macros":1,"external_links":0,"defined_names":18,"comments":16,"pivot_tables":0},"unopened":[],"bounds":{"document_bytes":16777216,"sheet_cells":100000,"rows_first":2000,"rows_last":500,"rows_between":2000,"halvings":0,"cell_chars":16384,"cell_head_chars":4096},"cells_cut":0,"cells_raw":0,"read":"whole","date_system":"1900"}

{"sheet":"1","index":0,"n_rows":73,"n_cols":18,"rows_kept":73,"cut":false,"hidden":false,"merged":[[36,3,36,6],[10,3,10,18],[11,3,11,18],[12,3,12,18],[34,3,34,6],[35,3,35,6],[46,3,46,6],[47,3,47,6],[48,3,48,6],[37,3,37,6],[38,3,38,6],[39,3,39,6],[40,3,40,6],[41,3,41,6],[42,3,42,6],[69,2,69,5],[71,2,71,5],[72,2,72,5],[73,2,73,5],[20,3,20,14],[21,3,21,14],[22,3,22,14],[49,3,49,6],[62,2,62,5],[63,2,63,5],[65,2,65,5],[66,2,66,5],[68,2,68,5],[43,3,43,6],[44,3,44,6],[45,3,45,6]]}
[]
[]
[]
[]
[]
[]
[]
[]
[]
[]
[]
[null,null,null,"FORMATOS ENTREGADOS PARA DAR CUMPLIMIENTO AL ARTICULO 73 DE \"LA LEY GENERAL DE CONTABILIDAD GUBERNAMENTAL\""]
[]
[]
[]
[]
[]
[]
[]
[]
[null,null,"Entidad Federativa :","CHIHUAHUA "]
[null,null,"Fondo :","Fondo de Aportaciones para la Educación Tecnológica y de Adultos/Colegio Nacional de Educación Profesional Técnica (FAETA/CONALEP)"]
[null,null,"Periodo :","2do. Trimestre"]
[]
[]
[]
[]
[]
[]
[]
[]
[null,null,null,null,null,null,null,"TOTAL REGISTROS ",null,"Num. de Paginas",null,"TOTAL PERSONAS",null,"TOTAL PLAZAS",null,"Total Pto. Federal",null,"Total Ppto. Otras Fuentes"]
[]
[]
[null,1,"A Y II D3","Personal Comisionado",null,null,null,null,null,null,null,null,null,null,null,null,null,0]
[null,2,"A Y II D4","Personal con Licencia",null,null,null,null,null,null,null,null,null,null,null,null,null,0]
[null,3,"B)   ","Registro Federal de Contribuyentes de Trabajadores con Pagos Retroactivos con un Periodo Mayor a 45 días",null,null,null,"N/A",null,"N/A",null,"N/A",null,"N/A",null,"N/A",null,"N/A"]
[null,4,"II B) Y 1","Plaza / Función",null,null,null,null,null,null,null,null,null,"N/A",null,"N/A",null,"N/A"]
[null,5,"II C y 1_","Personal Federalizado por Registro Federal de Contribuyentes",null,null,null,null,null,null,null,null,null,null,null,null,null,0]
[null,6,"II D) 2","Movimientos de Plazas",null,null,null,null,null,null,null,null,null,null,null,"N/A",null,"N/A"]
[null,7,"II D) 4","Trabajadores Jubilados en el Periodo",null,null,null,null,null,null,null,null,null,null,null,"N/A",null,"N/A"]
[null,8,"II D) 4 A","Trabajadores que Tramitaron Licencia Prejubilatoria en el Periodo",null,null,null,null,null,null,null,null,null,null,null,null,null,0]
[null,9,"II D) 6","Trabajadores Contratados por Honorarios en el Periodo",null,null,null,null,null,null,null,null,null,"N/A",null,"N/A",null,"N/A"]
[null,10,"II D) 7 1 ","Analítico de Categorías / Plazas Autorizadas con su Tabulador",null,null,null,null,null,null,null,"N/A",null,"N/A",null,"N/A",null,"N/A"]
[null,11,"II D) 7 2 ","Catálogo de Categorías y Tabuladores",null,null,null,null,null,null,null,"N/A",null,"N/A",null,"N/A",null,"N/A"]
[null,12,"II D) 7 3 ","Catálogo de Percepciones y Deducciones",null,null,null,null,null,null,null,"N/A",null,"N/A",null,"N/A",null,"N/A"]
[null,13,"E)","Trabajadores que Cobran con RFC / CURP con Formato Incorrecto",null,null,null,"N/A",null,"N/A",null,"N/A",null,"N/A",null,"N/A",null,"N/A"]
[null,14,"F) 1","Trabajadores con Doble Asignación Salarial en Municipios no Colindantes Geográficamente",null,null,null,"N/A",null,"N/A",null,"N/A",null,"N/A",null,"N/A",null,"N/A"]
[null,15,"F) 2","Trabajadores Ocupando Plazas que Superan el Número de Horas de Compatibilidad Autorizadas",null,null,null,"N/A",null,"N/A",null,"N/A",null,"N/A",null,"N/A",null,"N/A"]
[null,16,"G)","Trabajadores Cuyo Salario Básico Supere los Ingresos Promedio de un Docente en la Categoría más Alta del Tabulador Salarial Correspondiente a Cada Entidad",null,null,null,"N/A",null,"N/A",null,"N/A",null,"N/A",null,"N/A",null,"N/A"]
[]
[]
[]
[]
[]
[]
[]
[]
[]
[]
[]
[]
[null,null,"LIC. JESUS ALFONSO RAMIREZ MARRUFO"]
[null,null,"Nombre del  Responsable"]
[]
[null,null,"SUBJEFE TECNICO ESPECIALISTA DE RECURSOS HUMANOS"]
[null,null,"Cargo"]
[]
[]
[null,null,"Firma"]
[]
[null,null,"2016-04-13"]
[null,null,"Fecha"]

{"sheet":"CARATULA RESUMEN","index":1,"n_rows":73,"n_cols":18,"rows_kept":73,"cut":false,"hidden":false,"merged":[[22,3,22,14],[10,3,10,18],[11,3,11,18],[12,3,12,18],[20,3,20,14],[21,3,21,14],[45,3,45,6],[34,3,34,6],[35,3,35,6],[36,3,36,6],[37,3,37,6],[38,3,38,6],[39,3,39,6],[40,3,40,6],[41,3,41,6],[42,3,42,6],[43,3,43,6],[44,3,44,6],[46,3,46,6],[47,3,47,6],[48,3,48,6],[49,3,49,6],[62,2,62,5],[73,2,73,5],[50,3,50,6],[65,2,65,5],[66,2,66,5],[68,2,68,5],[69,2,69,5],[71,2,71,5],[72,2,72,5],[63,2,63,5]]}
[]
[]
[]
[]
[]
[]
[]
[]
[]
[]
[]
[null,null,null,"FORMATOS ENTREGADOS PARA DAR CUMPLIMIENTO AL ARTICULO 73 DE \"LA LEY GENERAL DE CONTABILIDAD GUBERNAMENTAL\""]
[]
[]
[]
[]
[]
[]
[]
[]
[null,null,"Entidad Federativa :","CHIHUAHUA "]
[null,null,"Fondo :","Fondo de Aportaciones para la Educación Tecnológica y de Adultos/Colegio Nacional de Educación Profesional Técnica (FAETA/CONALEP)"]
[null,null,"Periodo :","2do. Trimestre 2018"]
[]
[]
[]
[]
[]
[]
[]
[]
[null,null,null,null,null,null,null,"TOTAL REGISTROS ",null,"Num. de Paginas",null,"TOTAL PERSONAS",null,"TOTAL PLAZAS",null,"Total Pto. Federal",null,"Total Ppto. Otras Fuentes"]
[]
[]
[null,1,"A Y II D3","Personal Comisionado",null,null,null,15,null,1,null,15,null,15,null,1023817.88,null,"N/A"]
[null,2,"A Y II D4","Personal con Licencia",null,null,null,25,null,1,null,25,null,12,null,450912.54,null,"N/A"]
[null,3,"B)   ","Registro Federal de Contribuyentes de Trabajadores con Pagos Retroactivos con un Periodo Mayor a 45 días",null,null,null,"N/A",null,"N/A",null,"N/A",null,"N/A",null,"N/A",null,"N/A"]
[null,4,"II B) Y 1","Plaza / Función",null,null,null,827,null,17,null,827,null,243,null,28928029.880000018,null,"N/A"]
[null,5,"II C y 1_","Personal Federalizado por Registro Federal de Contribuyentes",null,null,null,827,null,19,null,827,null,243,null,28928029.880000014,null,"N/A"]
[null,6,"II D) 2","Movimientos de Plazas",null,null,null,33,null,1,null,33,null,17,null,"N/A",null,"N/A"]
[null,7,"II D) 4","Trabajadores Jubilados en el Periodo",null,null,null,2,null,1,null,2,null,2,null,"N/A",null,"N/A"]
[null,8,"II D) 4 A","Trabajadores que Tramitaron Licencia Prejubilatoria en el Periodo",null,null,null,2,null,1,null,2,null,2,null,146668.46,null,"N/A"]
[null,9,"II D) 6","Trabajadores Contratados por Honorarios en el Periodo",null,null,null,1,null,1,null,1,null,"N/A",null,28359,null,"N/A"]
[null,10,"II D) 7 1 ","Analítico de Categorías / Plazas Autorizadas con su Tabulador",null,null,null,145,null,4,null,"N/A",null,"N/A",null,"N/A",null,"N/A"]
[null,11,"II D) 7 2 ","Catálogo de Categorías y Tabuladores",null,null,null,147,null,5,null,"N/A",null,"N/A",null,"N/A",null,"N/A"]
[null,12,"II D) 7 3 ","Catálogo de Percepciones y Deducciones",null,null,null,79,null,3,null,"N/A",null,"N/A",null,"N/A",null,"N/A"]
[null,13,"E)","Trabajadores que Cobran con RFC / CURP con Formato Incorrecto",null,null,null,"N/A",null,"N/A",null,"N/A",null,"N/A",null,"N/A",null,"N/A"]
[null,14,"F) 1","Trabajadores con Doble Asignación Salarial en Municipios no Colindantes Geográficamente",null,null,null,"N/A",null,"N/A",null,"N/A",null,"N/A",null,"N/A",null,"N/A"]
[null,15,"F) 2","Trabajadores Ocupando Plazas que Superan el Número de Horas de Compatibilidad Autorizadas",null,null,null,"N/A",null,"N/A",null,"N/A",null,"N/A",null,"N/A",null,"N/A"]
[null,16,"G)","Trabajadores Cuyo Salario Básico Supere los Ingresos Promedio de un Docente en la Categoría más Alta del Tabulador Salarial Correspondiente a Cada Entidad",null,null,null,"N/A",null,"N/A",null,"N/A",null,"N/A",null,"N/A",null,"N/A"]
[null,17,"H) ","Movimientos de Personal por Centro de Trabajo",null,null,null,"N/A",null,"N/A",null,"N/A",null,"N/A",null,"N/A",null,"N/A"]
[]
[]
[]
[]
[]
[]
[]
[]
[]
[]
[]
[null,null,"LIC. JESUS ALFONSO RAMIREZ MARRUFO"]
[null,null,"Nombre del  Responsable"]
[]
[null,null,"SUBJEFE TECNICO ESPECIALISTA DE RECURSOS HUMANOS"]
[null,null,"Cargo"]
[]
[]
[null,null,"Firma"]
[]
[null,null,"2018-07-10"]
[null,null,"Fecha"]

{"sheet":"A Y  II D3","index":2,"n_rows":37,"n_cols":25,"rows_kept":37,"cut":false,"hidden":false,"merged":[[33,12,33,14],[12,24,13,24],[12,13,12,14],[12,15,13,15],[12,16,13,16],[12,17,13,17],[12,18,12,19],[12,20,13,20],[31,13,31,14],[12,21,13,21],[12,22,13,22],[12,23,13,23],[9,1,9,7],[12,6,12,12],[12,1,13,1],[12,2,13,2],[12,3,13,3],[12,4,13,4],[12,5,13,5]]}
[]
[]
[]
[]
[]
[]
[]
[]
[null,"Formato: Personal Comisionado"]
[null,{"$f":"IF('1'!D22=\"Elige el Periodo…\",\"\",'1'!D22)","v":"Fondo de Aportaciones para la Educación Tecnológica y de Adultos/Colegio Nacional de Educación Profesional Técnica (FAETA/CONALEP)"},null,null,null,null,null,null,null,null,null,null,null,null,null,null,null,null,null,null,null,null,null,"2do. Trimestre 2018"]
[]
[]
[null,"Entidad Federativa","R.F.C.","CURP","Nombre","Clave integrada","Clave Presupuestal",null,null,null,null,null,null,"Fecha Comisión",null,"Percepciones pagadas en el Periodo de Comisión con Presupuesto Federal*","Percepciones pagadas en el Periodo de Comisión con Presupuesto de otra fuente*","Clave CT Origen","CT Destino dentro del sector",null,"Lugar de la comisión fuera del sector educativo","Tipo de Comisión","Función Específica","Objeto de la comision","No. Oficio"]
[null,null,null,null,null,null,"Partida Presupuestal","Código de Pago","Clave de Unidad","Clave de Sub Unidad","Clave de Categoría","Horas Semana Mes ","Número de Plaza","Inicio","Conclusión",null,null,null,"Clave","Turno"]
[]
[null,"Entidad Federativa","R.F.C.","CURP","Nombre","Clave integrada","Partida Presupuestal","Código de Pago","Clave de Unidad","Clave de Sub Unidad","Clave de Categoría","Horas Semana Mes ","Número de Plaza","Fecha Comisión\nInicio","Fecha Comisión\nConclusión","Percepciones pagadas en el Periodo de Comisión con Presupuesto Federal*","Percepciones pagadas en el Periodo de Comisión con Presupuesto de otra fuente*","Clave CT Origen","Clave","Turno","Lugar de la comisión fuera del sector educativo","Tipo de Comisión","Función Específica","Objeto de la comision","No. Oficio"]
[null,"CHIHUAHUA","REVB701115KRA","REVB701115MCHGTH02","BHERDINA REGALADO VITELA","8310110030225CF3320400.09333",83101,1003,"02","25","CF33204","00.0",9333,20170216,99999999,81140.679999999993,0,"08DTP0001C","08DTP0001C",120,"/","h","SUBJEFE TECNICO ESPECIALISTA","APOYO PARA EL DEPARTAMENTO","AJ/OFC/04/2017"]
[null,"CHIHUAHUA","AUPC720823T59","AUPC720823MZSGLL09","CLARA AGÜERO PALACIOS","8310110030026CF3420200.02457",83101,1003,"00","26","CF34202","00.0",2457,20120216,99999999,44284.91,0,"08DPT0002B","08DPT0007X",200,"/","h","PROMOTOR DEP. Y CULTURAL","APOYO PARA EL DEPARTAMENTO","DGE/159-A/2012"]
[null,"CHIHUAHUA","CIBA710920FVA","CIBA710920MDGTRL04","ALMA ROSA CITAL BERTAHUD","8310110030026CF3320600.014304",83101,1003,"00","26","CF33206","00.0",14304,20100716,99999999,118401.97,0,"08DPT0002B","08DPT0013H",124,"/","h","DIRECCION DEL PLANTEL ","COORDINAR INICIO PLANTEL III","DGE/515/2010"]
[null,"CHIHUAHUA","LOCJ681030V96","LOCJ681030HCHZLS07","JESUS EDUARDO LOZOYA CALDERON","8310110030026A0320200.02419",83101,1003,"00","26","A03202","00.0",2419,20130216,99999999,48549.9,0,"08DPT0002B","08DPT0007X",200,"/","h","AUXILIAR DE SERVICIOS GENERALES","APOYO PARA EL DEPARTAMENTO","RH/087/2013"]
[null,"CHIHUAHUA","ROGJ6511161S5","ROGJ651116HDGCRN00","JUAN JESUS ROCHA GARCIA","8310110030026CF1820300.0131",83101,1003,"00","26","CF18203","00.0",131,20120216,99999999,48921.11,0,"08DPT0002B","08DPT0007X",200,"/","h","SUPERVISOR DE MANTENIMIENTO","APOYO PARA EL DEPARTAMENTO","DGE/156-B/2012"]
[null,"CHIHUAHUA","VASC8109266G6","VASC810926MCHLLL08","CLAUDIA VALVERDE SALAZAR","8310110030026ED0120100.02445",83101,1003,"00","26","ED01201","00.0",2445,20160701,99999999,47197.31,0,"08DPT0002B","08DPT0007X",700,"/","h","DELEGADA SINDICAL ESTATAL","COMISION SINDICAL POR TIEMPO COMPLETO","DP/1086/2016"]
[null,"CHIHUAHUA","LOCJ6307091T8","LOCJ630709HCHPRS08","JESUS MARTIN LOPEZ CARO","8310110030026CF3320600.013757",83101,1003,"00","26","CF33206","00.0",13757,20170316,99999999,117769.37,0,"08DPT0002B","00XXX0000X",123,"/","h","JEFE DE PROYECTO","APOYO EN AREA DE CAPACITACION","DGE/109/2017"]
[null,"CHIHUAHUA","CAEA740422SF8","CAEA740422MCHBSL02","ALMA SOFIA CABALLERO ESPARZA","8310110030207CF3320600.013431",83101,1003,"02","07","CF33206","00.0",13431,20170201,20180415,18759.48,0,"08DPT0007X","08DPT0002B",100,"/","h","JEFE DE PROYECTO CAPACITACION","APOYO PARA EL DEPARTAMENTO","DGE/108/2017"]
[null,"CHIHUAHUA","HEGJ620729F26","HEGJ620729HCHRNV07","JOSE JAVIER HERNANDEZ GONZALEZ","8310110030207CF3320600.014112",83101,1003,"02","07","CF33206","00.0",14112,20170201,99999999,77278.259999999995,0,"08DPT0007X","08DPT0002B",100,"/","h","JEFE DE PROYECTO INFORMATICA","APOYO PARA EL DEPARTAMENTO","AJ/OFC/03/2017"]
[null,"CHIHUAHUA","FEPD840911LH2","FEPD840911MCHRZN04","DENISSE JANETT FERNANDEZ PAEZ","8330110030219CF3320400.09714",83301,1003,"02","19","CF33204","00.0",9714,20130716,99999999,68716.37,0,"08DPT0011J","00XXX0000X",120,"/","h","SUBJEFE TECNICO ESPECIALISTA","APOYO AL DEPARTAMENTO DE RECURSOS HUMANOS","DGE/364/2013"]
[null,"CHIHUAHUA","MACE880915VB1","MACE880915HCHRNR04","MARTELL CONTRERAS ERICK ","8330110030219CF3320400.09705",83301,1003,"02","19","CF33204","00.0",9705,20170201,99999999,51286.68,0,"08DPT0011J","00XXX0000X",120,"/","h","SUBJEFE TECNICO ESPECIALISTA","APOYO AL PLANTEL PARRAL ","AJ/OFC/02/2017"]
[null,"CHIHUAHUA","CATC7205274V8","CATC720527HCHNRR09","CARLOS CANO TORRES","8310110030704CF3320400.010990",83101,1003,"07","04","CF33204","00.0",10990,20110104,99999999,88055.44,0,"00XXX0000X","08DPT0013H",124,"/","h","PREFECTO","APOYO PARA EL DEPARTAMENTO","DGE/001-B/2011"]
[null,"CHIHUAHUA","MONL710121CT7","MONL710121MSLGVR08","LORENA INES MOGUEL NOVELO","8310110030704CF0160100.010993",83101,1003,"07","04","CF01601","00.0",10993,20170201,99999999,66459.899999999994,0,"00XXX0000X","08DPT0007X",124,"/","h","PROMOCION Y VINCULACION","APOYO PARA EL DEPARTAMENTO","DGE/105/2017"]
[null,"CHIHUAHUA","PALU750621U84","PAXL750621HCHLXS05","LUIS ENRIQUE PALACIOS","8310110030704CF3320400.010995",83101,1003,"07","04","CF33204","00.0",10995,20170201,99999999,80536.600000000006,0,"00XXX0000X","08DPT0002B",124,"/","h","JEFE DE INFORMÁTICA","APOYO PARA EL DEPARTAMENTO","DGE/104/2017"]
[null,"CHIHUAHUA","QUEG630216GA8","QUEG630216MCHXSR02","QUIÑONEZ ESTRADA GRACIELA","8310110030704CF0160100.011822",83101,1003,"07","04","CF01601","00.0",11822,20171016,99999999,66459.899999999994,0,"00XXX0000X","00XXX0000X",124,"/","h","RELACIONES PUBLICAS","APOYO PARA EL DEPARTAMENTO","RH/105/2017"]
[null,"Total Personas : ",15,null,null,null,null,null,null,null,"Total Plazas : ",null,15,"Total Pto. Federal",null,{"$f":"SUBTOTAL(109,Tabla1[Percepciones pagadas en el Periodo de Comisión con Presupuesto Federal*])","v":1023817.88}]
[]
[null,null,null,null,null,null,null,null,null,null,null,null,"Total Ppto. Otras Fuentes",null,null,null,0]
[]
[null,"*Total de Percepciones reportadas por la Entidad Federativa como pagadas al trabajador durante la comisión."]
[null,"Fuente : Información proporcionada por las Entidades Federativas."]

{"sheet":"A Y II D4","index":3,"n_rows":47,"n_cols":21,"rows_kept":47,"cut":false,"hidden":false,"merged":[[9,1,9,6],[41,13,41,14],[12,16,13,16],[12,17,13,17],[12,20,13,20],[12,1,13,1],[12,3,13,3],[12,4,13,4],[12,5,13,5],[12,6,12,12],[12,13,12,14],[12,2,13,2],[12,18,12,19],[12,15,13,15]]}
[]
[]
[]
[]
[]
[]
[]
[]
[null,"Formato: Personal con Licencia"]
[null,{"$f":"IF('1'!D22=\"Elige el Periodo…\",\"\",'1'!D22)","v":"Fondo de Aportaciones para la Educación Tecnológica y de Adultos/Colegio Nacional de Educación Profesional Técnica (FAETA/CONALEP)"},null,null,null,null,null,null,null,null,null,null,null,null,null,null,null,null,null,null,"2do. Trimestre 2018"]
[]
[]
[null,"Entidad Federativa","R.F.C.","CURP","NOMBRE","Clave integrada","Clave Presupuestal",null,null,null,null,null,null,"Periodo Licencia",null,"Percepciones pagadas en el Periodo de la Licencia con Presupuesto Federal*","Percepciones pagadas en el Periodo de la Licencia con Presupuesto de otra fuente*","Clave CT Origen","Licencia",null,"Descripción de la Licencia"]
[null,null,null,null,null,null,"Partida Presupuestal","Código de Pago","Clave de Unidad","Clave de Sub Unidad","Clave de Categoría","Horas Semana Mes ","Número de Plaza","Inicio","Conclusión",null,null,null,"Clave","Tipo"]
[]
[null,"Entidad Federativa","R.F.C.","CURP","NOMBRE","Clave integrada","Partida Presupuestal","Código de Pago","Clave de Unidad","Clave de Sub Unidad","Clave de Categoría","Horas Semana Mes ","Número de Plaza","Periodo Licencia\nInicio","Periodo Licencia\nConclusión","Percepciones pagadas en el Periodo de la Licencia con Presupuesto Federal*","Percepciones pagadas en el Periodo de la Licencia con Presupuesto de otra fuente*","Clave CT Origen","Licencia\nClave","Licencia\nTipo","Descripción de la Licencia"]
[null,"CHIHUAHUA","BAPF541102CN1","BAPF541102HCHCRR00","FRANCISCO ALBERTO BACA PEREZ","8310110030025CF3420100.02376",83101,1003,"00","25","CF34201","00.0",2376,20180301,20180531,48594.71,0,"08DPT0001C",26,"GOCE","PREPENSIONARIA"]
[null,"CHIHUAHUA","HEFA581028JT6","HEFA581028HSRRLR03","ARISTEO HERNANDEZ FLORES","8310110030025S0120100.02398",83101,1003,"00","25","S01201","00.0",2398,20180409,20190709,0,0,"08DPT0001C",16,"SIN GOCE","SIN GOCE DE SUELDO"]
[null,"CHIHUAHUA","LOGM811218IW7","LOGM811218MCHRNY01","MYRNA GUADALUPE LOERA GONZALEZ","8310110010025L5XCBll15.00",83101,1001,"00","25","L5XCBll","15.0",0,20180501,20181101,0,0,"08DPT0001C",16,"SIN GOCE","SIN GOCE DE SUELDO"]
[null,"CHIHUAHUA","GOCY840110NQ4","GOCY840110MCHNLS07","YSELA GONZALEZ CALDERA","8310110010026L5XCB120.00",83101,1001,"00","26","L5XCB1","20.0",0,20180401,20180519,15437.25,0,"08DPT0002B",25,"GOCE","POR GRAVIDEZ"]
[null,"CHIHUAHUA","ROGJ6511161S5","ROGJ651116HDGCRN00","JUAN JESUS ROCHA GARCIA","8310110030026CF1820300.0131",83101,1003,"00","26","CF18203","00.0",131,20180402,20180429,19746.599999999999,0,"08DPT0002B",14,"GOCE","INCAPACIDAD MEDICA"]
[null,"CHIHUAHUA","ROGJ6511161S5","ROGJ651116HDGCRN00","JUAN JESUS ROCHA GARCIA","8310110030026CF1820300.0131",83101,1003,"00","26","CF18203","00.0",131,20180430,20180527,14084.72,0,"08DPT0002B",14,"GOCE","INCAPACIDAD MEDICA"]
[null,"CHIHUAHUA","ROGJ6511161S5","ROGJ651116HDGCRN00","JUAN JESUS ROCHA GARCIA","8310110030026CF1820300.0131",83101,1003,"00","26","CF18203","00.0",131,20180528,20180624,15089.79,0,"08DPT0002B",14,"GOCE","INCAPACIDAD MEDICA"]
[null,"CHIHUAHUA","CARJ6012178GA","CARJ601217HCHRLS07","JOSE DE JESUS CARRILLO RUELAS","8310110030026S0120200.02430",83101,1003,"00","26","S01202","00.0",2430,20180603,20180623,15809.02,0,"08DPT0002B",14,"GOCE","INCAPACIDAD MEDICA"]
[null,"CHIHUAHUA","RALK790326386","RALK790326MCHMPR08","KARINA CECILIA RAMIREZ LOPEZ","8310110010026L5XCB100.00",83101,1001,"00","26","L5XCB1","00.0",0,20180410,20180506,11435,0,"08DPT0002B",14,"GOCE","INCAPACIDAD MEDICA"]
[null,"CHIHUAHUA","RALK790326386","RALK790326MCHMPR08","KARINA CECILIA RAMIREZ LOPEZ","8310110010026L5XCB100.00",83101,1001,"00","26","L5XCB1","00.0",0,20180507,20180603,11435,0,"08DPT0002B",14,"GOCE","INCAPACIDAD MEDICA"]
[null,"CHIHUAHUA","RALK790326386","RALK790326MCHMPR08","KARINA CECILIA RAMIREZ LOPEZ","8310110010026L5XCB100.00",83101,1001,"00","26","L5XCB1","00.0",0,20180604,20180701,11435,0,"08DPT0002B",14,"GOCE","INCAPACIDAD MEDICA"]
[null,"CHIHUAHUA","MEPF691219UT3","MEPF691219HCHLRR06","FRANCISCO JAVIER MELENDEZ PEREYRA","8310110010026L5XCB100.00",83101,1001,"00","26","L5XCB1","00.0",0,20180509,20180605,10291.5,0,"08DPT0002B",14,"GOCE","INCAPACIDAD MEDICA"]
[null,"CHIHUAHUA","GODK810903VC5","GODK810903MCHNVN04","KENNIS GONZALEZ DAVILA","8310110030156CF0210500.014575",83101,1003,"01","56","CF02105","00.0",14575,20180430,20180715,0,0,"08DPT0003A",16,"SIN GOCE","SIN GOCE DE SUELDO"]
[null,"CHIHUAHUA","YADR7710046J3","YADR771004MCHXZS02","ROSA IVONNE YAﾑEZ DIAZ","8310110030156CF3320400.07481",83101,1003,"01","56","CF33204","00.0",7481,20180115,20180414,0,0,"08DPT0003A",16,"SIN GOCE","SIN GOCE DE SUELDO"]
[null,"CHIHUAHUA","CAGL680404GU5","CAGL680404MCHSTT08","LETICIA CASILLAS GUTIERREZ","8310110010156L5XCBI20.00",83101,1001,"01","56","L5XCBI","20.0",0,20180502,20180511,4726.46,0,"08DPT0003A",14,"GOCE","INCAPACIDAD MEDICA"]
[null,"CHIHUAHUA","DERI7801118J5","DEXR780111HCHLXC03","RICARDO DELGADO","8310110010156L5XCBI20.00",83101,1001,"01","56","L5XCBI","20.0",0,20180611,20180629,4017.53,0,"08DPT0003A",14,"GOCE","INCAPACIDAD MEDICA"]
[null,"CHIHUAHUA","GAAN631226D5A","GAAN631226MCHNNR03","NORMA GANDARA ANGUIANO","8310110010207L5XCBI9.00",83101,1001,"02","07","L5XCBI","9.0",0,20180423,20180624,8945.1200000000008,0,"08DPT0007X",14,"GOCE","INCAPACIDAD MEDICA"]
[null,"CHIHUAHUA","HEOA9003177A9","HEOA900317MCHRGN09","ANGELICA LIZETTE HERRERA OGAZ","8310110010207L5XCBI17.00",83101,1001,"02","07","L5XCBI","17.0",0,20180216,20180731,0,0,"08DPT0007X",16,"SIN GOCE","SIN GOCE DE SUELDO"]
[null,"CHIHUAHUA","LAGL890709J41","LAGL890709MCHZNL07","LLUVIA CRISTINA LAZO GONZALEZ","8310110010218L5XCBII19.00",83101,1001,"02","18","L5XCBII","19.0",0,20180301,20180529,15562.92,0,"08DPT0012I",25,"GOCE","POR GRAVIDEZ"]
[null,"CHIHUAHUA","GOCS820528T91","GOCS820528MCHNLN05","SANDRA BERENICE GONZALEZ COLMENERO","8310110010218L5XC20.00",83101,1001,"02","18","L5XC","20.0",0,20180416,20180714,23632.5,0,"08DPT0012I",25,"GOCE","POR GRAVIDEZ"]
[null,"CHIHUAHUA","VIMD590726DU0","VIMD590726HCHLRN05","DONACIANO VILLALOBOS MORENO","8310110030218CF3320600.013932",83101,1003,"02","18","CF33206","00.0",13932,20180416,20180715,98073.75,0,"08DPT0012I",26,"GOCE","PREPENSIONARIA"]
[null,"CHIHUAHUA","ROVC830522ILA","ROVC830522MCHDLR00","CRISTINA RODRIGUEZ VALVERDE","8310110010218L5XCBI18.00",83101,1001,"02","18","L5XCBI","18.0",0,20180626,20180923,3279.6,0,"08DPT0012I",25,"GOCE","POR GRAVIDEZ"]
[null,"CHIHUAHUA","PICM810405PX1","PICM810405MCHRRR02","PRIETO CARRASCO MARIANA","8310110030219S0120140.09723",83101,1003,"02","19","S01201","40.0",9723,20180401,20180525,12045.43,0,"08DPT0011J",14,"GOCE","INCAPACIDAD MEDICA"]
[null,"CHIHUAHUA","PEGC781114HZ3","PEGC781114HCHRRS06","CESAR VALENTE PEREA GARCIA","8310110030512S0120100.09718",83101,1003,"05","12","S01201","00.0",9718,20180409,20180630,20192.57,0,"00xxx0000x",22,"GOCE","INCAPACIDAD MEDICA"]
[null,"CHIHUAHUA","EATH590728P67","EATH590728HCHSRG00","HUGO ESNAYRA TRISTAN","8310110030704CF0160100.010992",83101,1003,"07","04","CF01601","00.0",10992,20180401,20180630,87078.07,0,"00XXX0000X",25,"GOCE","POR GRAVIDEZ"]
[null,"Total Personas : ",25,null,null,null,null,null,null,null,"Total Plazas : ",null,12,"Total Pto. Federal",null,{"$f":"SUBTOTAL(109,Tabla3[Percepciones pagadas en el Periodo de la Licencia con Presupuesto Federal*])","v":450912.54}]
[]
[null,null,null,null,null,null,null,null,null,null,null,null,null,"Total Ppto. Otras Fuentes",null,null,0]
[]
[null,"*Total de Percepciones reportadas por la Entidad Federativa como pagadas al trabajador durante la Licencia."]
[null,"Fuente : Información proporcionada por las Entidades Federativas."]

{"sheet":"B)","index":4,"n_rows":26,"n_cols":19,"rows_kept":26,"cut":false,"hidden":false,"merged":[[12,18,13,18],[12,12,13,12],[12,13,13,13],[12,14,13,14],[12,15,12,16],[12,17,13,17],[9,1,9,10],[12,1,13,1],[12,2,13,2],[12,3,13,3],[12,4,13,4],[12,5,12,11]]}
[]
[]
[]
[]
[]
[]
[]
[]
[null,"Formato: Registro Federal de Contribuyentes de Trabajadores con Pagos Retroactivos con un Periodo Mayor a 45 días"]
[null,{"$f":"IF('1'!D22=\"Elige el Periodo…\",\"\",'1'!D22)","v":"Fondo de Aportaciones para la Educación Tecnológica y de Adultos/Colegio Nacional de Educación Profesional Técnica (FAETA/CONALEP)"},null,null,null,null,null,null,null,null,null,null,null,null,null,null,null,"2do. Trimestre 2018"]
[]
[]
[null,"Entidad Federativa","RFC","CURP","Nombre","Clave Presupuestal",null,null,null,null,null,null,"Clave de Centro de Trabajo","Fecha de emisión de pago","Motivo del Pago Retroactivo","Periodo pagado",null,"Días transcurridos para el pago","Percepciones pagadas en el periodo reportado *"]
[null,null,null,null,null,"Partida Presupuestal","Código de Pago","Clave de Unidad","Clave de Sub Unidad","Clave de Categoría","Horas Semana Mes ","Número de Plaza",null,null,null,"Desde","Hasta"]
[]
[null,"Entidad Federativa","RFC","CURP","Nombre","Partida Presupuestal","Código de Pago","Clave de Unidad","Clave de Sub Unidad","Clave de Categoría","Horas semana mes","Número de plaza","Clave de Centro de Trabajo","Fecha de emisión de pago","Motivo del Pago Retroactivo","Periodo pagado\nDesde","Periodo pagado\nHasta","Días transcurridos para el pago","Percepciones pagadas en el periodo reportado *"]
[]
[]
[]
[]
[null,"Total Personas : ",null,null,null,null,null,null,null,null,"Total Plazas : ",null,null,null,null,"Total Percepciones Pagadas:"]
[]
[]
[]
[null,"*Total de Percepciones reportadas por la Entidad Federativa como pagadas en el periodo "]
[null,"Fuente : Información proporcionada por las Entidades Federativas"]

{"sheet":"II B) Y 1","index":5,"n_rows":847,"n_cols":25,"rows_kept":847,"cut":false,"hidden":false,"merged":[[12,4,14,4],[12,3,14,3],[12,2,14,2],[9,1,9,9],[844,21,844,23],[12,1,14,1],[12,5,14,5],[12,24,14,24],[13,6,13,8],[13,9,13,11],[13,12,13,14],[13,15,13,17],[13,18,13,20],[12,6,12,20],[12,21,14,21],[12,22,14,22],[12,23,14,23]]}
[]
[]
[]
[]
[]
[]
[]
[]
[null,"Formato: Plaza / Función"]
[null,{"$f":"IF('1'!D22=\"Elige el Periodo…\",\"\",'1'!D22)","v":"Fondo de Aportaciones para la Educación Tecnológica y de Adultos/Colegio Nacional de Educación Profesional Técnica (FAETA/CONALEP)"},null,null,null,null,null,null,null,null,null,null,null,null,null,null,null,null,null,null,null,null,null,"2do. Trimestre 2018"]
[]
[]
[null,"Entidad Federativa","RFC","CURP","Nombre","Centros de Trabajo","Plazas por tipo de función",null,null,null,null,null,null,null,null,null,null,null,null,null,null,"Total plazas Jornada","Total \nHSM","Total de Honorarios","Total de recursos presupuestales ejercidos en servicios personales en el periodo\n(2)"]
[null,null,null,null,null,null,"Apoyo a la labor educativa",null,null,"Administrativo y de servicio",null,null,"Docente y Apoyo Técnico Pedagógico",null,null,"Directivos y Supervisión",null,null,"Mandos medios y superiores"]
[null,null,null,null,null,null,"Jornada","HSM","Honorarios","Jornada","HSM","Honorarios","Jornada","HSM","Honorarios","Jornada","HSM","Honorarios","Jornada","HSM","Honorarios"]
[]
[null,"Columna1","Columna2","Columna3","Columna4","Columna5","Columna6","Columna7","Columna8","Columna9","Columna10","Columna11","Columna12","Columna13","Columna14","Columna15","Columna16","Columna17","Columna18","Columna19","Columna20","Columna21","Columna22","Columna23","Columna24"]
[null,"CHIHUAHUA","AOML571117QI9","AOML571117MCHCRZ09","LUZ DEL CARMEN ACOSTA MARTINEZ","08DPT0001C",null,null,null,1,0,0,null,null,null,null,null,null,null,null,null,1,0,0,49500.85]
[null,"CHIHUAHUA","AEEF700614J96","AEEF700614HCHLNR00","JOSE FRANCISCO ALDERETE ENRIQUEZ","08DPT0001C",null,null,null,1,0,0,null,null,null,null,null,null,null,null,null,1,0,0,113187.84]
[null,"CHIHUAHUA","BAPF541102CN1","BAPF541102HCHCRR00","FRANCISCO ALBERTO BACA PEREZ","08DPT0001C",null,null,null,1,0,0,null,null,null,null,null,null,null,null,null,1,0,0,30507.94]
[null,"CHIHUAHUA","CACM660522B70","CACM660522HCHNHR08","MARIO RUBEN CANO CHEW","08DPT0001C",null,null,null,1,0,0,null,null,null,null,null,null,null,null,null,1,0,0,65685.84]
[null,"CHIHUAHUA","DIAM641007CI5","DIAM641007HCHZCN00","MANUEL DIAZ ACOSTA","08DPT0001C",null,null,null,1,0,0,null,null,null,null,null,null,null,null,null,1,0,0,34026.720000000001]
[null,"CHIHUAHUA","FEPH590719P2A","FEPH590719MCHRRR08","HORTENSIA FERNANDEZ PARGA","08DPT0001C",null,null,null,1,0,0,null,null,null,null,null,null,null,null,null,1,0,0,34391.39]
[null,"CHIHUAHUA","GADE730513AY2","GADE730513HCHRZL06","ELIAS GARCIA DIAZ","08DPT0001C",null,null,null,1,0,0,null,null,null,null,null,null,null,null,null,1,0,0,41013.360000000001]
[null,"CHIHUAHUA","GAVL610223PN1","GAVL610223MGTRLN08","LEONOR GARZON VALDEZ","08DPT0001C",null,null,null,null,null,null,null,null,null,null,null,null,1,0,0,1,0,0,85992.48]
[null,"CHIHUAHUA","GOBS630720GU7","GOBS630720MCHNLL02","SILVIA CECILIA GONZALEZ BALDERRAMA","08DPT0001C",null,null,null,1,0,0,null,null,null,null,null,null,null,null,null,1,0,0,30260.959999999999]
[null,"CHIHUAHUA","GUSL800307M72","GUSL800307MCHTNL01","LILIANA GUTIERREZ SANDOVAL","08DPT0001C",null,null,null,1,0,0,null,null,null,null,null,null,null,null,null,1,0,0,29336.080000000002]
[null,"CHIHUAHUA","HEFA581028JT6","HEFA581028HSRRLR03","ARISTEO HERNANDEZ FLORES","08DPT0001C",null,null,null,1,0,0,null,null,null,null,null,null,null,null,null,1,0,0,4531.12]
[null,"CHIHUAHUA","HEMM670602FX4","HEMM670602HCHRRL08","MELCHOR HERNANDEZ MORALES","08DPT0001C",null,null,null,1,0,0,null,null,null,null,null,null,null,null,null,1,0,0,117965.47]
[null,"CHIHUAHUA","IAAM650713G14","IAAM650713HCLBRR06","MARTIN GENARO IBARRA ARREDONDO","08DPT0001C",null,null,null,1,0,0,null,null,null,null,null,null,null,null,null,1,0,0,21414.66]
[null,"CHIHUAHUA","JUVD951202BR4","JUVD951202HCHRLN06","DANIEL FRANCISCO JUAREZ VILLALOBOS","08DPT0001C",null,null,null,1,0,0,null,null,null,null,null,null,null,null,null,1,0,0,27457.09]
[null,"CHIHUAHUA","LOCS740722BY1","LOCS740722MCHYSN03","SANDRA LOYA CASTAÑEDA","08DPT0001C",null,null,null,1,0,0,null,null,null,null,null,null,null,null,null,1,0,0,46199]
[null,"CHIHUAHUA","LOLG6105041C1","LOLG610504HCHZPR03","GERARDO LOZANO LOPEZ","08DPT0001C",null,null,null,1,0,0,null,null,null,null,null,null,null,null,null,1,0,0,42313.84]
[null,"CHIHUAHUA","MASS920625T67","MASS920625MCHNTT05","STEPHANIE MANCHA SOTO","08DPT0001C",null,null,null,1,0,0,null,null,null,null,null,null,null,null,null,1,0,0,30832.38]
[null,"CHIHUAHUA","MACN5607036J8","MACN560703MCHRHR01","NORMA MARGARITA MARRUFO CHAPARRO","08DPT0001C",null,null,null,1,0,0,null,null,null,null,null,null,null,null,null,1,0,0,100585.93]
[null,"CHIHUAHUA","MERA640505HY3","MERA640505HCHNYR01","ARMANDO MENDEZ REYES","08DPT0001C",null,null,null,1,0,0,null,null,null,null,null,null,null,null,null,1,0,0,27544.81]
[null,"CHIHUAHUA","MOAP870129UT9","MOAP870129MCHLCT09","PATRICIA ARALI MOLINA ACOSTA","08DPT0001C",null,null,null,1,0,0,null,null,null,null,null,null,null,null,null,1,0,0,58930.53]
[null,"CHIHUAHUA","MOTJ521007RU5","MOTJ521007HCHRRS02","JESUS ALBERTO MORENO TORRES","08DPT0001C",null,null,null,1,0,0,null,null,null,null,null,null,null,null,null,1,0,0,46227.81]
[null,"CHIHUAHUA","NAOG680625QA5","NAOG680625HCHRRL00","GUILLERMO NICOLAS NARVAEZ ORDAZ","08DPT0001C",null,null,null,1,0,0,null,null,null,null,null,null,null,null,null,1,0,0,45670.97]
[null,"CHIHUAHUA","NAWA860622JI6","NAWA860622HCHVGL05","ALEJANDRO MAURICIO NAVARRO WAGNER","08DPT0001C",null,null,null,null,null,null,null,null,null,null,null,null,1,0,0,1,0,0,66459.899999999994]
[null,"CHIHUAHUA","OOSJ921202I59","OOSJ921202HCHCTR06","JORGE ROBERTO OCHOA SOTELO","08DPT0001C",null,null,null,1,0,0,null,null,null,null,null,null,null,null,null,1,0,0,19463.55]
[null,"CHIHUAHUA","PEZR580319EY1","PEZR580319MCLRVS09","ROSA MARIA PEREZ ZUBIA","08DPT0001C",null,null,null,1,0,0,null,null,null,null,null,null,null,null,null,1,0,0,36023.629999999997]
[null,"CHIHUAHUA","PIRE860510KC2","PIRE860510HCHZBS00","PIZANO RUBIO ESTALI","08DPT0001C",null,null,null,1,0,0,null,null,null,null,null,null,null,null,null,1,0,0,30301.61]
[null,"CHIHUAHUA","PODM630929V60","PODM630929HCHRZG02","MIGUEL PORTILLO DIAZ","08DPT0001C",null,null,null,1,0,0,null,null,null,null,null,null,null,null,null,1,0,0,37124.120000000003]
[null,"CHIHUAHUA","QUHM750313QX2","QUHM750313HZSNZN02","MANUEL QUINTERO HUIZAR","08DPT0001C",null,null,null,1,0,0,null,null,null,null,null,null,null,null,null,1,0,0,2361.17]
[null,"CHIHUAHUA","RAGN6608306N3","RAGN660830MCHMMR01","NORMA RAMIREZ GOMEZ","08DPT0001C",null,null,null,1,0,0,null,null,null,null,null,null,null,null,null,1,0,0,46220.73]
[null,"CHIHUAHUA","REVB701115KRA","REVB701115MCHGTH02","BERDINA REGALADO VITELA","08DPT0001C",null,null,null,1,0,0,null,null,null,null,null,null,null,null,null,1,0,0,81140.679999999993]
[null,"CHIHUAHUA","REMV840531384","REMV840531HCHYRC03","VICTOR MANUEL REYES MURILLO","08DPT0001C",null,null,null,1,0,0,null,null,null,null,null,null,null,null,null,1,0,0,61189.7]
[null,"CHIHUAHUA","REOS610731NK2","REOS610731MCHZLL01","SILVIA PATRICIA REZA OLIVAS","08DPT0001C",null,null,null,1,0,0,null,null,null,null,null,null,null,null,null,1,0,0,121308.29]
[null,"CHIHUAHUA","ROCG710423BI2","ROCG710423MCHDNL05","GILDA ALEJANDRINA RODRIGUEZ CANO","08DPT0001C",null,null,null,1,0,0,null,null,null,null,null,null,null,null,null,1,0,0,41386.06]
[null,"CHIHUAHUA","ROVB9202105WA","ROVB920210HCHDLR05","BRYAN ARMANDO RODRIGUEZ VALVERDE","08DPT0001C",null,null,null,1,0,0,null,null,null,null,null,null,null,null,null,1,0,0,27922.81]
[null,"CHIHUAHUA","RUDA711227IH4","RUDA711227HCHLLR08","ARTURO RUELAS DELGADO","08DPT0001C",null,null,null,1,0,0,null,null,null,null,null,null,null,null,null,1,0,0,75692.649999999994]
[null,"CHIHUAHUA","SOPF600927M49","SOPF600927MCHTRR08","FERNANDA SOTELO PEREZ","08DPT0001C",null,null,null,1,0,0,null,null,null,null,null,null,null,null,null,1,0,0,30726.5]
[null,"CHIHUAHUA","TOEB620314DK2","TOEB620314HCHRNR09","BERNARDO TORRES ENRIQUEZ","08DPT0001C",null,null,null,1,0,0,null,null,null,null,null,null,null,null,null,1,0,0,37612.29]
[null,"CHIHUAHUA","VAAH770519CJ9","VAAH770519HCHZRC04","HECTOR MANUEL VAZQUEZ ARMENDARIZ","08DPT0001C",null,null,null,1,0,0,null,null,null,null,null,null,null,null,null,1,0,0,32264.81]
[null,"CHIHUAHUA","VIRC720302LS1","VIRC720302MCHLVR06","MARIA CRISTINA VILLAGRAN RIVERA","08DPT0001C",null,null,null,1,0,0,null,null,null,null,null,null,null,null,null,1,0,0,44828.72]
[null,"CHIHUAHUA","VIJD921113BZ7","VIJD921113HCHLRG00","DIEGO EMMANUEL VILLALBA JUAREZ","08DPT0001C",null,null,null,1,0,0,null,null,null,null,null,null,null,null,null,1,0,0,57879.54]
[null,"CHIHUAHUA","AOZL821127LL7","AOZL821127HCHCVS03","ACOSTA ZAVALA LUIS ALBERTO","08DPT0001C",null,null,null,null,null,null,0,120,0,null,null,null,null,null,null,0,120,0,14179.5]
[null,"CHIHUAHUA","AUAJ750122A5A","AUAJ750122HCHGGS03","JESUS AGUILAR AGUILAR","08DPT0001C",null,null,null,null,null,null,0,120,0,null,null,null,null,null,null,0,120,0,14179.5]
[null,"CHIHUAHUA","AULE8612293K4","AULE861229MCHGRL05","ELDA EUNICE AGUIRRE LOERA","08DPT0001C",null,null,null,null,null,null,0,180,0,null,null,null,null,null,null,0,180,0,16398]
[null,"CHIHUAHUA","AAMF560125R89","AAMF560125HCHLNL07","FLAVIO RAUL ALVAREZ MONTOYA","08DPT0001C",null,null,null,null,null,null,0,180,0,null,null,null,null,null,null,0,180,0,21269.279999999999]
[null,"CHIHUAHUA","AATL801210PB4","AATL801210MCHLNR06","LOURDES ALVAREZ TINTORI","08DPT0001C",null,null,null,null,null,null,0,180,0,null,null,null,null,null,null,0,180,0,21269.279999999999]
[null,"CHIHUAHUA","AIOM820517TC5","AIOM820517MCHVLR08","MARIANA AVILA OLIVAS","08DPT0001C",null,null,null,null,null,null,0,240,0,null,null,null,null,null,null,0,240,0,28359]
[null,"CHIHUAHUA","AAGJ821023VC5","AAGJ821023MCHZZS17","JESSICA CORAL AZAETA GUZMAN","08DPT0001C",null,null,null,null,null,null,0,180,0,null,null,null,null,null,null,0,180,0,16398]
[null,"CHIHUAHUA","BAFR630210M78","BAFR630210HCHQEC02","RICARDO BAQUERA FRESCAS","08DPT0001C",null,null,null,null,null,null,0,228,0,null,null,null,null,null,null,0,228,0,23344.38]
[null,"CHIHUAHUA","BAAA801202930","BAAA801202HCHRLL09","ALBERTO GUERRERO BARRAZA ALVAREZ","08DPT0001C",null,null,null,null,null,null,0,240,0,null,null,null,null,null,null,0,240,0,28359]
[null,"CHIHUAHUA","BURS661015RT6","BURS661015HCHSSL07","SALVADOR BUSTILLOS RASCON","08DPT0001C",null,null,null,null,null,null,0,108,0,null,null,null,null,null,null,0,108,0,12761.58]
[null,"CHIHUAHUA","CAAM640422S63","CAAM640422MSRMRR03","MARTHA LETICIA CAMPOS ARISMEDI","08DPT0001C",null,null,null,null,null,null,0,216,0,null,null,null,null,null,null,0,216,0,25523.1]
[null,"CHIHUAHUA","CARG7105218G9","CARG710521HCHMMR07","GERARDO CAMPOS RAMIREZ","08DPT0001C",null,null,null,null,null,null,0,228,0,null,null,null,null,null,null,0,228,0,26941.08]
[null,"CHIHUAHUA","CASR730827BZ2","CASR730827HCHNTM09","RAMON ARMANDO CANO SOTO","08DPT0001C",null,null,null,null,null,null,0,240,0,null,null,null,null,null,null,0,240,0,24573]
[null,"CHIHUAHUA","CABA600225IW2","CABA600225MCHRRR09","ARACELI CARRASCO BARRAZA","08DPT0001C",null,null,null,null,null,null,0,180,0,null,null,null,null,null,null,0,180,0,21269.279999999999]
[null,"CHIHUAHUA","CAON860317HL0","CAON860317MCHRCL00","NALLELY YESENIACARRASCO OCHOA","08DPT0001C",null,null,null,null,null,null,0,108,0,null,null,null,null,null,null,0,108,0,12761.58]
[null,"CHIHUAHUA","CAJM671130A58","CAJM671130HCHRRR04","CARRILLO JUAREZ MAURO GERARDO","08DPT0001C",null,null,null,null,null,null,0,228,0,null,null,null,null,null,null,0,228,0,23344.38]
[null,"CHIHUAHUA","CAAI5611206JA","CAAI561120MCHSRD05","IDELIA CASTRO ARMENDARIZ","08DPT0001C",null,null,null,null,null,null,0,228,0,null,null,null,null,null,null,0,228,0,26941.08]
[null,"CHIHUAHUA","CAFL660707EI1","CAFL660707MCHZLY06","LYDIA CAZARES FLORES","08DPT0001C",null,null,null,null,null,null,0,180,0,null,null,null,null,null,null,0,180,0,18429.78]
[null,"CHIHUAHUA","CEBE680921RL5","CEBE680921HCHNCL06","ELEAZAR MATEO CENICEROS BECERRA","08DPT0001C",null,null,null,null,null,null,0,168,0,null,null,null,null,null,null,0,168,0,19851.3]
[null,"CHIHUAHUA","CEMC581222Q78","CEMC581222MCHRLL09","CLARA CERVANTES MELENDEZ","08DPT0001C",null,null,null,null,null,null,0,240,0,null,null,null,null,null,null,0,240,0,28359]
[null,"CHIHUAHUA","CAJF670208887","CAJF670208HCHHRR03","FERNANDO CHACON JURADO","08DPT0001C",null,null,null,null,null,null,0,228,0,null,null,null,null,null,null,0,228,0,26941.08]
[null,"CHIHUAHUA","CAGL640918UT9","CAGL640918MCHHMR07","MARIA DE LOURDES CHAVIRA GOMEZ","08DPT0001C",null,null,null,null,null,null,0,180,0,null,null,null,null,null,null,0,180,0,21269.279999999999]
[null,"CHIHUAHUA","DIAF6905309M4","DIAF690530HDGZLR08","DIAZ ALVARADO FRANCISCO ROBERTO","08DPT0001C",null,null,null,null,null,null,0,144,0,null,null,null,null,null,null,0,144,0,12286.5]
[null,"CHIHUAHUA","DOTM5605051B1","DOTM560505MCHMRR05","MARGARITA DOMINGUEZ TREVIZO","08DPT0001C",null,null,null,null,null,null,0,180,0,null,null,null,null,null,null,0,180,0,21269.279999999999]
[null,"CHIHUAHUA","EARE580710MW7","EARE580710MMCRQL06","ELSA AMALIA ERRAQUIN ROQUE","08DPT0001C",null,null,null,null,null,null,0,144,0,null,null,null,null,null,null,0,144,0,17015.400000000001]
[null,"CHIHUAHUA","EOOC700117F69","EOOC700117HCHSRR08","CARLOS ESCOBEDO ORTEGA","08DPT0001C",null,null,null,null,null,null,0,180,0,null,null,null,null,null,null,0,180,0,21269.279999999999]
[null,"CHIHUAHUA","EACM621211KN0","EACM621211HCHSHR04","JOSE MARTIN ESPARZA CHAVEZ","08DPT0001C",null,null,null,null,null,null,0,204,0,null,null,null,null,null,null,0,204,0,24105.18]
[null,"CHIHUAHUA","EADR661019BU9","EADR661019HCHSZM08","ESPARZA DIAZ RAMON","08DPT0001C",null,null,null,null,null,null,0,120,0,null,null,null,null,null,null,0,120,0,10932]
[null,"CHIHUAHUA","EILJ680419MG0","EILJ680419HCHSNR05","JORGE ALBERTO ESPINOZA LUNA","08DPT0001C",null,null,null,null,null,null,0,204,0,null,null,null,null,null,null,0,204,0,24105.18]
[null,"CHIHUAHUA","FECA6103137A4","FECA610313HDFRLB09","ABELARDO FERNANDEZ CALDERON","08DPT0001C",null,null,null,null,null,null,0,216,0,null,null,null,null,null,null,0,216,0,22115.7]
[null,"CHIHUAHUA","FOFL641113DP1","FOFL641113HCHLLS06","LUIS FLORES FLORES","08DPT0001C",null,null,null,null,null,null,0,180,0,null,null,null,null,null,null,0,180,0,21269.279999999999]
[null,"CHIHUAHUA","GAMR760920E78","GAMR760920MCHLNT06","RUTH GALLEGOS MONARCA","08DPT0001C",null,null,null,null,null,null,0,192,0,null,null,null,null,null,null,0,192,0,22687.200000000001]
[null,"CHIHUAHUA","GAVF750826318","GAVF750826HCHLLR05","FRANCISCO AGUSTIN GALLEGOS VILLASEÑOR","08DPT0001C",null,null,null,null,null,null,0,144,0,null,null,null,null,null,null,0,144,0,17015.400000000001]
[null,"CHIHUAHUA","GALR830327972","GALR830327MCHRYS00","ROSA HERLINDA GARCIA LOYA","08DPT0001C",null,null,null,null,null,null,0,120,0,null,null,null,null,null,null,0,120,0,14179.5]
[null,"CHIHUAHUA","GALJ810323DN3","GALJ810323HCHRZS03","JESUS RAUL GARCIA LOZANO","08DPT0001C",null,null,null,null,null,null,0,216,0,null,null,null,null,null,null,0,216,0,25523.1]
[null,"CHIHUAHUA","GAMG821026JM8","GAMG821026HDGRRB08","GABINO GARCIA MARRUFO","08DPT0001C",null,null,null,null,null,null,0,240,0,null,null,null,null,null,null,0,240,0,28359]
[null,"CHIHUAHUA","GAOM870316CN9","GAOM870316HCHRRG00","JOSE MIGUEL GARCIA ORTIZ","08DPT0001C",null,null,null,null,null,null,0,216,0,null,null,null,null,null,null,0,216,0,25523.1]
[null,"CHIHUAHUA","GAGJ811020H48","GAGJ811020HCHRNN01","JUAN EDUARDO GARDEA GINER","08DPT0001C",null,null,null,null,null,null,0,228,0,null,null,null,null,null,null,0,228,0,23344.38]
[null,"CHIHUAHUA","GAVV7810103W7","GAVV781010MCHRZR06","VERONICA GARDEA VASQUEZ","08DPT0001C",null,null,null,null,null,null,0,180,0,null,null,null,null,null,null,0,180,0,21269.279999999999]
[null,"CHIHUAHUA","GOAC860518J59","GOAC860518HCHMVR06","CARLOS JOEL GOMEZ AVILA","08DPT0001C",null,null,null,null,null,null,0,228,0,null,null,null,null,null,null,0,228,0,23344.38]
[null,"CHIHUAHUA","GOHS731228LU7","GOHS731228HCHNLM00","SIMON GONZALEZ HOLGUIN","08DPT0001C",null,null,null,null,null,null,0,180,0,null,null,null,null,null,null,0,180,0,18429.78]
[null,"CHIHUAHUA","HEAM7409112X6","HEAM740911MCHRRR00","MARCELA HERNANDEZ ARMENDARIZ","08DPT0001C",null,null,null,null,null,null,0,240,0,null,null,null,null,null,null,0,240,0,28359]
[null,"CHIHUAHUA","HERA781214D5A","HERA781214HCHRMR02","AARON TERCERO HERNANDEZ ROMO","08DPT0001C",null,null,null,null,null,null,0,216,0,null,null,null,null,null,null,0,216,0,25523.1]
[null,"CHIHUAHUA","HESM4812063X7","HESM481206HDFRGR09","MARIO HERNANDEZ SEGURA","08DPT0001C",null,null,null,null,null,null,0,180,0,null,null,null,null,null,null,0,180,0,21269.279999999999]
[null,"CHIHUAHUA","HEMB811018BN2","HEMB811018MCHRNT06","BEATRIZ ELENA HERRERA MENDOZA","08DPT0001C",null,null,null,null,null,null,0,216,0,null,null,null,null,null,null,0,216,0,25523.1]
[null,"CHIHUAHUA","JIVG670122BN0","JIVG670122HVZMLD07","GAUDENCIO JIMENEZ VALENTIN","08DPT0001C",null,null,null,null,null,null,0,180,0,null,null,null,null,null,null,0,180,0,21269.279999999999]
[null,"CHIHUAHUA","LESO760401T71","LESO760401HCHLXM07","OMAR LEAL SEAÑEZ","08DPT0001C",null,null,null,null,null,null,0,108,0,null,null,null,null,null,null,0,108,0,12761.58]
[null,"CHIHUAHUA","LOGM811218IW7","LOGM811218MCHRNY01","MYRNA GUADALUPE LOERA GONZALEZ","08DPT0001C",null,null,null,null,null,null,0,60,0,null,null,null,null,null,null,0,60,0,6143.26]
[null,"CHIHUAHUA","LOMM630709QH3","LOMM630709MCHPRR06","MIRIAM CAROLINA LOPEZ MARQUEZ","08DPT0001C",null,null,null,null,null,null,0,144,0,null,null,null,null,null,null,0,144,0,17015.400000000001]
[null,"CHIHUAHUA","LOCJ610711AFA","LOCJ610711HCHYHV06","JAVIER BENJAMIN LOYA CHAVIRA","08DPT0001C",null,null,null,null,null,null,0,240,0,null,null,null,null,null,null,0,240,0,28359]
[null,"CHIHUAHUA","LOHL711219AQ3","LOHL711219MCHYRL02","LILIANA IVONNE LOYA HERNANDEZ","08DPT0001C",null,null,null,null,null,null,0,180,0,null,null,null,null,null,null,0,180,0,21269.279999999999]
[null,"CHIHUAHUA","LORJ800906MC9","LORJ800906HCHYDS03","JESUS ARTURO LOYA RODRIGUEZ","08DPT0001C",null,null,null,null,null,null,0,180,0,null,null,null,null,null,null,0,180,0,18429.78]
[null,"CHIHUAHUA","MAGP631129C83","MAGP631129HCHRNR03","PERFECTO MARQUEZ GONZALEZ","08DPT0001C",null,null,null,null,null,null,0,192,0,null,null,null,null,null,null,0,192,0,19658.400000000001]
[null,"CHIHUAHUA","MACC861013NB9","MACC861013HCHRLR03","CARLOS ISAAC MARRUFO CALDERON","08DPT0001C",null,null,null,null,null,null,0,180,0,null,null,null,null,null,null,0,180,0,21269.279999999999]
[null,"CHIHUAHUA","MELE840906AR7","MELE840906HCHDYD07","EDGAR  IVAN MEDINA LOYA","08DPT0001C",null,null,null,null,null,null,0,216,0,null,null,null,null,null,null,0,216,0,22115.7]
[null,"CHIHUAHUA","MEMM770410518","MEMM770410HCHRNN08","MANUEL MERAZ MENDEZ","08DPT0001C",null,null,null,null,null,null,0,192,0,null,null,null,null,null,null,0,192,0,22687.200000000001]
[null,"CHIHUAHUA","MURE810806BI4","MURE810806HCHXJM08","EMMANUEL MUÑOZ ROJAS","08DPT0001C",null,null,null,null,null,null,0,240,0,null,null,null,null,null,null,0,240,0,24573]
[null,"CHIHUAHUA","NAME521010PW5","NAME521010HCHVNN03","ENRIQUE NAVARRO MENDOZA","08DPT0001C",null,null,null,null,null,null,0,192,0,null,null,null,null,null,null,0,192,0,22687.200000000001]
[null,"CHIHUAHUA","OIAO791026IM2","OIAO791026HCHLPS00","OSCAR ERNESTO OLIVAS APONTE","08DPT0001C",null,null,null,null,null,null,0,120,0,null,null,null,null,null,null,0,120,0,14179.5]
[null,"CHIHUAHUA","OILR550330775","OILR550330HCHLPG01","ROGELIO ANASTACIO OLIVAS LOPEZ","08DPT0001C",null,null,null,null,null,null,0,204,0,null,null,null,null,null,null,0,204,0,24105.18]
[null,"CHIHUAHUA","OEZH720627D54","OEZH720627HCHRBG04","HUGO SOCORRO ORTEGA ZUBIATE","08DPT0001C",null,null,null,null,null,null,0,192,0,null,null,null,null,null,null,0,192,0,22687.200000000001]
[null,"CHIHUAHUA","PARM520707MY1","PARM520707HPLLCG03","MIGUEL ANGEL PALMA ROCHA","08DPT0001C",null,null,null,null,null,null,0,96,0,null,null,null,null,null,null,0,96,0,8745.6]
[null,"CHIHUAHUA","PAGM7008098P1","PAGM700809HCHRRR01","MAURO RUBEN PARADA GRANADOS","08DPT0001C",null,null,null,null,null,null,0,96,0,null,null,null,null,null,null,0,96,0,11343.6]
[null,"CHIHUAHUA","PARF590815ED3","PARF590815MVZVSL20","FELICITAS PAVON ROSAS","08DPT0001C",null,null,null,null,null,null,0,216,0,null,null,null,null,null,null,0,216,0,20477.5]
[null,"CHIHUAHUA","PAVE830228SH0","PAVE830228HCHZLN00","ENRIQUE PAZOS VALLES","08DPT0001C",null,null,null,null,null,null,0,228,0,null,null,null,null,null,null,0,228,0,23344.38]
[null,"CHIHUAHUA","PEFR790621C3A","PEFR790621HCHRGB13","ROBERTO AARON PEREA FIGUEROA","08DPT0001C",null,null,null,null,null,null,0,144,0,null,null,null,null,null,null,0,144,0,13118.4]
[null,"CHIHUAHUA","PECA750727I8A","PECA750727HJCRRL03","JOSE ALEJANDRO PEREZ CORTES","08DPT0001C",null,null,null,null,null,null,0,144,0,null,null,null,null,null,null,0,144,0,17015.400000000001]
[null,"CHIHUAHUA","PICN620328PA0","PICN620328HVZNRR07","JOSE NORBERTO PINEDA CRUZ","08DPT0001C",null,null,null,null,null,null,0,144,0,null,null,null,null,null,null,0,144,0,17015.400000000001]
[null,"CHIHUAHUA","PIRL7804262E7","PIRL780426MCHXZZ09","MARIA LIZETH PIÑON RUIZ","08DPT0001C",null,null,null,null,null,null,0,240,0,null,null,null,null,null,null,0,240,0,28359]
[null,"CHIHUAHUA","QURM640822CE7","QURM640822MCHNZR02","MARTINA LILIA QUINTANA RUIZ","08DPT0001C",null,null,null,null,null,null,0,204,0,null,null,null,null,null,null,0,204,0,24105.18]
[null,"CHIHUAHUA","RAGG600206G85","RAGG600206MCHMTR04","GRACIELA IMELDA RAMIREZ GUTIERREZ","08DPT0001C",null,null,null,null,null,null,0,144,0,null,null,null,null,null,null,0,144,0,17015.400000000001]
[null,"CHIHUAHUA","RAMA741011N9A","RAMA741011MCHMRN00","ANABEL RAMOS MORALES","08DPT0001C",null,null,null,null,null,null,0,240,0,null,null,null,null,null,null,0,240,0,28359]
[null,"CHIHUAHUA","RARN711008BK5","RARN711008MCHSMR09","NORMA PATRICIA RASCON RAMIREZ","08DPT0001C",null,null,null,null,null,null,0,240,0,null,null,null,null,null,null,0,240,0,28359]
[null,"CHIHUAHUA","RECN560808KM6","RECN560808MCHYRR00","MARIA NORMA REYES CARREON","08DPT0001C",null,null,null,null,null,null,0,168,0,null,null,null,null,null,null,0,168,0,19851.3]
[null,"CHIHUAHUA","REOL730620M72","REOL730620MCHYRC05","LUCIA REYES ORTIZ","08DPT0001C",null,null,null,null,null,null,0,240,0,null,null,null,null,null,null,0,240,0,28359]
[null,"CHIHUAHUA","RIMI820220GQ7","RIMI820220HCHVCV02","IVAN JOEL RIVERA MACIAS","08DPT0001C",null,null,null,null,null,null,0,96,0,null,null,null,null,null,null,0,96,0,9829.2000000000007]
[null,"CHIHUAHUA","ROSL660422DP2","ROSL660422HCHDLZ09","MARIA DE LA LUZ RODARTE SOLIS","08DPT0001C",null,null,null,null,null,null,0,204,0,null,null,null,null,null,null,0,204,0,24105.18]
[null,"CHIHUAHUA","ROAA871025FU9","ROAA871025HCHDGL07","ALBERTO RODRIGUEZ AGUIRRE","08DPT0001C",null,null,null,null,null,null,0,216,0,null,null,null,null,null,null,0,216,0,22115.7]
[null,"CHIHUAHUA","ROGJ6301201E0","ROGJ630120MCHDZS08","MA DE JESUS RODRIGUEZ GUZMAN","08DPT0001C",null,null,null,null,null,null,0,192,0,null,null,null,null,null,null,0,192,0,22687.200000000001]
[null,"CHIHUAHUA","ROAL730412EQ6","ROAL730412HCHJRS01","LUIS JAVIER ROJAS ARAGONEZ","08DPT0001C",null,null,null,null,null,null,0,228,0,null,null,null,null,null,null,0,228,0,26941.08]
[null,"CHIHUAHUA","ROPV750812QL5","ROPV750812HCHMCC00","VICTOR MANUEL ROMERO PACHECO","08DPT0001C",null,null,null,null,null,null,0,120,0,null,null,null,null,null,null,0,120,0,12286.5]
[null,"CHIHUAHUA","ROTO850629550","ROTO850629HCHNRS06","OSCAR ARMANDO RONQUILLO TERAN ","08DPT0001C",null,null,null,null,null,null,0,120,0,null,null,null,null,null,null,0,120,0,10932]
[null,"CHIHUAHUA","ROVI820310797","ROVI820310HCLNLV07","IVAN RAMON RONQUILLO VILLALBA","08DPT0001C",null,null,null,null,null,null,0,216,0,null,null,null,null,null,null,0,216,0,25523.1]
[null,"CHIHUAHUA","RUNH860818SE6","RUNH860818HCHBJM07","HUMERTO ALONSO RUBIO NAJERA","08DPT0001C",null,null,null,null,null,null,0,180,0,null,null,null,null,null,null,0,180,0,13118.4]
[null,"CHIHUAHUA","RUMS740226UR4","RUMS740226MCHZRL09","MARIA SOLEDAD RUIZ MARQUEZ","08DPT0001C",null,null,null,null,null,null,0,216,0,null,null,null,null,null,null,0,216,0,25523.1]
[null,"CHIHUAHUA","SAQG720512BW2","SAQG720512MCHNXD07","MARIA GUADALUPE SAENZ QUIÑONEZ","08DPT0001C",null,null,null,null,null,null,0,204,0,null,null,null,null,null,null,0,204,0,24105.18]
[null,"CHIHUAHUA","SEAI880810AV4","SEAI880810MCHRMR02","IRIS ROSALI SERNA AMPARAN","08DPT0001C",null,null,null,null,null,null,0,192,0,null,null,null,null,null,null,0,192,0,19658.400000000001]
[null,"CHIHUAHUA","SIML5803182A8","SIML580318HCHLJS14","JOSE LUIS CARLOS SILVEYRA MEJIA","08DPT0001C",null,null,null,null,null,null,0,240,0,null,null,null,null,null,null,0,240,0,28359]
[null,"CHIHUAHUA","TAAD800122GU1","TAAD800122HCHRRL07","DELFINO TARIN ARMENDARIZ","08DPT0001C",null,null,null,null,null,null,0,216,0,null,null,null,null,null,null,0,216,0,25523.1]
[null,"CHIHUAHUA","UIOM910617AH6","UIOM910617MCHRRR04","MARIBEL URIZA ORTIZ","08DPT0001C",null,null,null,null,null,null,0,168,0,null,null,null,null,null,null,0,168,0,17201.099999999999]
[null,"CHIHUAHUA","VACA610212RT2","VACA610212HCHLHD03","ADOLFO VALLES CHAVEZ","08DPT0001C",null,null,null,null,null,null,0,240,0,null,null,null,null,null,null,0,240,0,28359]
[null,"CHIHUAHUA","VADS631230CN3","VADS631230MCHLVL06","SILVIA LETICIA VALVERDE DAVILA","08DPT0001C",null,null,null,null,null,null,0,240,0,null,null,null,null,null,null,0,240,0,28359]
[null,"CHIHUAHUA","VIRR710926945","VIRR710926HCHLDB12","RUBEN VILLALOBOS RODRIGUEZ","08DPT0001C",null,null,null,null,null,null,0,240,0,null,null,null,null,null,null,0,240,0,28359]
[null,"CHIHUAHUA","VIPR570927K44","VIPR570927HCHLYF07","RAFAEL JESUS VILLEGAS PAYAN","08DPT0001C",null,null,null,null,null,null,0,240,0,null,null,null,null,null,null,0,240,0,28359]
[null,"CHIHUAHUA","AUPC720823T59","AUPC720823MZSGLL09","CLARA AGÜERO PALACIOS","08DPT0002B",null,null,null,1,0,0,null,null,null,null,null,null,null,null,null,1,0,0,44284.91]
[null,"CHIHUAHUA","AUSL630319SGO","AUSL630319HZSGFC09","JOSE LUCIANO AGUILERA SIFUENTES","08DPT0002B",null,null,null,1,0,0,null,null,null,null,null,null,null,null,null,1,0,0,125302.86999999998]
[null,"CHIHUAHUA","AAAJ9101208M3","AAAJ910120HCHLCS03","JESUS FABIAN ALVARADO  ACOSTA","08DPT0002B",null,null,null,1,0,0,null,null,null,null,null,null,null,null,null,1,0,0,37046.269999999997]
[null,"CHIHUAHUA","AAAN671110TZ0","AAAN671110MCHLCC06","NICOLASA ALVARADO  ACOSTA","08DPT0002B",null,null,null,1,0,0,null,null,null,null,null,null,null,null,null,1,0,0,113781.95]
[null,"CHIHUAHUA","AAEM620508I55","AAEM620508HCLLSG04","MIGUEL ANGEL ALVARADO  ESPARZA","08DPT0002B",null,null,null,1,0,0,null,null,null,null,null,null,null,null,null,1,0,0,42358.09]
[null,"CHIHUAHUA","AISJ790419494","AISJ790419HCHRTN04","JUAN MANUEL ARIAS  SOTELO","08DPT0002B",null,null,null,1,0,0,null,null,null,null,null,null,null,null,null,1,0,0,83636.36]
[null,"CHIHUAHUA","AIBC800120C20","AIBC800120HCHVLS02","CESAR NOE AVILA BOLIVAR","08DPT0002B",null,null,null,1,0,0,null,null,null,null,null,null,null,null,null,1,0,0,20530.050000000003]
[null,"CHIHUAHUA","BAML650601B92","BAML650601HDFRLS03","JOSE LUIS  BARRIENTOS MILAN","08DPT0002B",null,null,null,1,0,0,null,null,null,null,null,null,null,null,null,1,0,0,33984.14]
[null,"CHIHUAHUA","BOMA6710214E1","BOMA671021HDFLXR07","ARMANDO BOLAÑOS MUÑOZ","08DPT0002B",null,null,null,1,0,0,null,null,null,null,null,null,null,null,null,1,0,0,100343.75]
[null,"CHIHUAHUA","CAPL820818LQ5","CAPL820818HCHMRS04","LUIS ROBERTO CAMPOS PORTILLO","08DPT0002B",null,null,null,1,0,0,null,null,null,null,null,null,null,null,null,1,0,0,40701.46]
[null,"CHIHUAHUA","CACL731031A17","CACL731031MCHRNR01","LORENA CARRILLO CANO","08DPT0002B",null,null,null,1,0,0,null,null,null,null,null,null,null,null,null,1,0,0,33829.14]
[null,"CHIHUAHUA","CARJ6012178GA","CARJ601217HCHRLS07","JOSE DE JESUS CARRILLO RUELAS","08DPT0002B",null,null,null,1,0,0,null,null,null,null,null,null,null,null,null,1,0,0,47045.380000000005]
[null,"CHIHUAHUA","CARP8408274S7","CARP840827MCHHCR02","PERLA CHAVEZ ROCHA","08DPT0002B",null,null,null,1,0,0,null,null,null,null,null,null,null,null,null,1,0,0,83716.670000000013]
[null,"CHIHUAHUA","CIBA710920FVA","CIBA710920MDGTRL04","ALMA ROSA CITAL BERTAHUD","08DPT0002B",null,null,null,1,0,0,null,null,null,null,null,null,null,null,null,1,0,0,118401.97]
[null,"CHIHUAHUA","COMA6908143J5","COXM690814HCHNXR11","MARIO CONTRERAS N/A","08DPT0002B",null,null,null,1,0,0,null,null,null,null,null,null,null,null,null,1,0,0,57249.820000000014]
[null,"CHIHUAHUA","CURL721031RX6","CURL721031HCHVVS02","JOSE LUIS CUEVAS RIVERA","08DPT0002B",null,null,null,1,0,0,null,null,null,null,null,null,null,null,null,1,0,0,16172.04]
[null,"CHIHUAHUA","DEMA661118M56","DEMA661118HCHLRB07","JOSE ABELARDO DELGADO  MORALES","08DPT0002B",null,null,null,1,0,0,null,null,null,null,null,null,null,null,null,1,0,0,95414.380000000019]
[null,"CHIHUAHUA","EAGK7806257R9","EAGK780625MCHSBR04","KARLA ESPARZA GABALDON","08DPT0002B",null,null,null,1,0,0,null,null,null,null,null,null,null,null,null,1,0,0,98474.37]
[null,"CHIHUAHUA","FACF8611101I7","FACF861110HCHVNR02","FERNANDO FAVELA  CONTRERAS","08DPT0002B",null,null,null,1,0,0,null,null,null,null,null,null,null,null,null,1,0,0,38680.76]
[null,"CHIHUAHUA","FIGS610608SA8","FIGS610608MJCGNL02","SILVIA FIGUEROA GONZALEZ","08DPT0002B",null,null,null,1,0,0,null,null,null,null,null,null,null,null,null,1,0,0,92214.83]
[null,"CHIHUAHUA","GAMA6609167M4","GAXM660916MCHLXR06","MARIBEL GALLARDO N/A","08DPT0002B",null,null,null,1,0,0,null,null,null,null,null,null,null,null,null,1,0,0,47104.44]
[null,"CHIHUAHUA","GAAD780823GZ6","GAAD780823MCHRLL01","DULCE AURORA DEL CONSUELO GARCIA ALEMAN","08DPT0002B",null,null,null,1,0,0,null,null,null,null,null,null,null,null,null,1,0,0,57032.53]
[null,"CHIHUAHUA","GALE580105G5A","GALE580105HCHRNN03","ENRIQUE GARCIA DE LUNA","08DPT0002B",null,null,null,1,0,0,null,null,null,null,null,null,null,null,null,1,0,0,42941.8]
[null,"CHIHUAHUA","LAGP591112155","LAGP591112HCHRYD07","PEDRO LARES GAYTAN","08DPT0002B",null,null,null,1,0,0,null,null,null,null,null,null,null,null,null,1,0,0,42632.03]
[null,"CHIHUAHUA","LIHJ9107073M0","LIHJ910707HCHRRS09","JASSON RAYMUNDO LIRA HERRERA","08DPT0002B",null,null,null,1,0,0,null,null,null,null,null,null,null,null,null,1,0,0,35891.589999999997]
[null,"CHIHUAHUA","LOCJ6307091T8","LOCJ630709HCHPRS08","JESUS MARTIN LOPEZ CARO","08DPT0002B",null,null,null,1,0,0,null,null,null,null,null,null,null,null,null,1,0,0,117769.37]
[null,"CHIHUAHUA","LORE9304089K5","LORE930408HCHYSR01","EARVIN MANUEL LOYA  RIOS","08DPT0002B",null,null,null,1,0,0,null,null,null,null,null,null,null,null,null,1,0,0,32450.11]
[null,"CHIHUAHUA","LOCJ681030V96","LOCJ681030HCHZLS07","JESUS EDUARDO LOZOYA  CALDERON","08DPT0002B",null,null,null,1,0,0,null,null,null,null,null,null,null,null,null,1,0,0,48549.899999999994]
[null,"CHIHUAHUA","MODC711228F67","MODC711228HCLNRR07","CARLOS EDUARDO MONTANO DURAN","08DPT0002B",null,null,null,null,null,null,null,null,null,null,null,null,1,0,0,1,0,0,100611.18]
[null,"CHIHUAHUA","MOSG761016858","MOSG761016HCLNNR06","GERARDO MONTOYA SANCHEZ","08DPT0002B",null,null,null,1,0,0,null,null,null,null,null,null,null,null,null,1,0,0,40022.89]
[null,"CHIHUAHUA","OOGL660522NA4","OOGL660522HCHCRS08","LUIS FELIX OCHOA GARCIA","08DPT0002B",null,null,null,1,0,0,null,null,null,null,null,null,null,null,null,1,0,0,37519.53]
[null,"CHIHUAHUA","OORE7405071DA","OORE740507MCHRYS00","MARIA ESTHER OROZCO REYES","08DPT0002B",null,null,null,1,0,0,null,null,null,null,null,null,null,null,null,1,0,0,47440.04]
[null,"CHIHUAHUA","RARF8407015TA","RARF840701MCHMML00","FLOR MINERVA RAMIREZ RAMIREZ","08DPT0002B",null,null,null,1,0,0,null,null,null,null,null,null,null,null,null,1,0,0,47671.87]
[null,"CHIHUAHUA","ROGJ6511161S5","ROGJ651116HDGCRN00","JUAN JESUS ROCHA GARCIA","08DPT0002B",null,null,null,1,0,0,null,null,null,null,null,null,null,null,null,1,0,0,48921.11]
[null,"CHIHUAHUA","ROGM631230AD4","ROGM631230MCHMRR18","MARCIA IMELDA ROMERO GARCIA","08DPT0002B",null,null,null,1,0,0,null,null,null,null,null,null,null,null,null,1,0,0,44496.149999999994]
[null,"CHIHUAHUA","SAPP7109042V0","SAPP710904HCHLLD06","PEDRO SALAS PALOMINO","08DPT0002B",null,null,null,1,0,0,null,null,null,null,null,null,null,null,null,1,0,0,95414.38]
[null,"CHIHUAHUA","TULO5510064A6","TULO551006MCHDYL01","OLGA ESPERANZA TUDA LEYVA","08DPT0002B",null,null,null,1,0,0,null,null,null,null,null,null,null,null,null,1,0,0,84978.680000000008]
[null,"CHIHUAHUA","VASF7408232D8","VASF740823HCHLLR05","FRANCISCO JAVIER VALERDE SALAZAR","08DPT0002B",null,null,null,1,0,0,null,null,null,null,null,null,null,null,null,1,0,0,47197.31]
[null,"CHIHUAHUA","VASC8109266G6","VASC810926MCHLLL08","CLAUDIA VALVERDE SALAZAR","08DPT0002B",null,null,null,1,0,0,null,null,null,null,null,null,null,null,null,1,0,0,6273.09]
[null,"CHIHUAHUA","VAFM681203S84","VAFM681203MCHZGR05","MARICRUZ VAZQUEZ FIGUEROA","08DPT0002B",null,null,null,1,0,0,null,null,null,null,null,null,null,null,null,1,0,0,84086.670000000013]
[null,"CHIHUAHUA","AARL701222GC6","AARL701222MCHRVB04","LIBIA GABRIELA ARAGON RIVERA","08DPT0002B",null,null,null,null,null,null,0,240,0,null,null,null,null,null,null,0,240,0,34305]
[null,"CHIHUAHUA","BAGR640911VB4","BAGR640911HCHRND09","RODOLFO ELI BARONA GONZALEZ","08DPT0002B",null,null,null,null,null,null,0,120,0,null,null,null,null,null,null,0,120,0,14908.5]
[null,"CHIHUAHUA","BOAI840527A86","BOAI840527MCHRGN00","MARIA INES BORUNDA AGUILAR","08DPT0002B",null,null,null,null,null,null,0,240,0,null,null,null,null,null,null,0,240,0,34305]
[null,"CHIHUAHUA","CACS480226NE5","CACS480226HGTMPL06","SALVADOR CAMPOS CAPETILLO","08DPT0002B",null,null,null,null,null,null,0,180,0,null,null,null,null,null,null,0,180,0,25728.780000000002]
[null,"CHIHUAHUA","CAPH630209KZO","CAPH630209MCHRSL06","HILDA MARGARITA CARRASCO POSADA","08DPT0002B",null,null,null,null,null,null,0,120,0,null,null,null,null,null,null,0,120,0,17152.5]
[null,"CHIHUAHUA","COCD901004DB8","COCD901004MCHRHN09","DAINA ROCIO CORTES CHAVEZ","08DPT0002B",null,null,null,null,null,null,0,216,0,null,null,null,null,null,null,0,216,0,26835.3]
[null,"CHIHUAHUA","EABM680229EQ9","EABM680229MCHSDR08","MARTHA GUADALUPE ESCALANTE BADILLO","08DPT0002B",null,null,null,null,null,null,0,240,0,null,null,null,null,null,null,0,240,0,29817]
[null,"CHIHUAHUA","EOHA790831RH0","EOHA790831MZSSRN01","MARIA DE LOS ANGELES ESCOBAR DE HARO","08DPT0002B",null,null,null,null,null,null,0,240,0,null,null,null,null,null,null,0,240,0,34305]
[null,"CHIHUAHUA","FAMA641105R5A","FAMA641105MCHVRL07","ALMA ISABEL FAVELA MARTINEZ","08DPT0002B",null,null,null,null,null,null,0,120,0,null,null,null,null,null,null,0,120,0,15437.280000000002]
[null,"CHIHUAHUA","FOLS800726I38","FOLS800726MCHLCN07","SANDYANA FLORES LUCERO","08DPT0002B",null,null,null,null,null,null,0,228,0,null,null,null,null,null,null,0,228,0,32589.780000000002]
[null,"CHIHUAHUA","FONE671109ME3","FONE671109MCHLVS06","ESPERANZA FLORES NAVARRO","08DPT0002B",null,null,null,null,null,null,0,216,0,null,null,null,null,null,null,0,216,0,30874.5]
[null,"CHIHUAHUA","GAGC810607AX3","GAGC810607MCHRRH23","CHRISTIAN BELEN GARCIA GARCIA","08DPT0002B",null,null,null,null,null,null,0,240,0,null,null,null,null,null,null,0,240,0,34305]
[null,"CHIHUAHUA","GALJ860302G54","GALJ860302HGTRNV04","JAVIER GARCIA LUNA","08DPT0002B",null,null,null,null,null,null,0,120,0,null,null,null,null,null,null,0,120,0,17152.5]
[null,"CHIHUAHUA","GOLC890608AQ0","GOLC890608MCHMRY05","CYNTHIA LILIANA GOMEZ LARA","08DPT0002B",null,null,null,null,null,null,0,216,0,null,null,null,null,null,null,0,216,0,23743.8]
[null,"CHIHUAHUA","GOAJ891103DFA","GOAJ891103HCHNLR08","JORGE OMAR GONZALEZ ALVIDREZ","08DPT0002B",null,null,null,null,null,null,0,144,0,null,null,null,null,null,null,0,144,0,15829.2]
[null,"CHIHUAHUA","GOCY840110NQ4","GOCY840110MCHNLS07","YSELA GONZALEZ CALDERA","08DPT0002B",null,null,null,null,null,null,0,216,0,null,null,null,null,null,null,0,216,0,30874.5]
[null,"CHIHUAHUA","GOMA851115JC8","GOMA851115HCHNRR07","AARON ROBERTO GONZALEZ MORAN","08DPT0002B",null,null,null,null,null,null,0,204,0,null,null,null,null,null,null,0,204,0,29159.280000000002]
[null,"CHIHUAHUA","GOPS780818LH4","GOPS780818HCHNRR01","SERGIO GONZALEZ PEREZ","08DPT0002B",null,null,null,null,null,null,0,240,0,null,null,null,null,null,null,0,240,0,34305]
[null,"CHIHUAHUA","GUFD63111111A","GUFD631111MSLVRN17","DINA YESENIA GUEVARA FIERRO","08DPT0002B",null,null,null,null,null,null,0,240,0,null,null,null,null,null,null,0,240,0,34305]
[null,"CHIHUAHUA","HEDC640302NR2","HEDC640302HZSRZR01","CARLOS HERNANDEZ DIAZ","08DPT0002B",null,null,null,null,null,null,0,240,0,null,null,null,null,null,null,0,240,0,34305]
[null,"CHIHUAHUA","IARL8304031L7","IARL830403HZSBMS09","LUIS ROMAN IBARRA  RAMOS","08DPT0002B",null,null,null,null,null,null,0,192,0,null,null,null,null,null,null,0,192,0,23853.599999999999]
[null,"CHIHUAHUA","JAAZ890626IJ1","JAAZ890626MCHSVM08","ZIMRI DANIEL JASSO AVILA","08DPT0002B",null,null,null,null,null,null,0,228,0,null,null,null,null,null,null,0,228,0,28326.179999999997]
[null,"CHIHUAHUA","LARR970308D62","LARR970308HCHRSY09","RAYMUNDO LARA RIOS","08DPT0002B",null,null,null,null,null,null,0,240,0,null,null,null,null,null,null,0,240,0,19578]
[null,"CHIHUAHUA","LAOE880302RW2","LAOE880302MCHZRL08","ELIZA ARELY LAZALDE ORTIZ","08DPT0002B",null,null,null,null,null,null,0,228,0,null,null,null,null,null,null,0,228,0,28326.179999999997]
[null,"CHIHUAHUA","LEGF590530LW9","LEGF590530HCHNTR00","FERNANDO LEON GUTIERREZ","08DPT0002B",null,null,null,null,null,null,0,240,0,null,null,null,null,null,null,0,240,0,34305]
[null,"CHIHUAHUA","LOCA790201FP3","LXCA790201HCHRSD09","ADRIAN FRANCISCO LOERA  CASTRO","08DPT0002B",null,null,null,null,null,null,0,240,0,null,null,null,null,null,null,0,240,0,34305]
[null,"CHIHUAHUA","LORF830406762","LORF830406HCHPML02","FELIPE LOPEZ RAMIREZ","08DPT0002B",null,null,null,null,null,null,0,180,0,null,null,null,null,null,null,0,180,0,22362.780000000002]
[null,"CHIHUAHUA","LURG880415UKA","LURG880415MCHNVB04","GABRIELA ALEJANDRA LUNA  RIVAS","08DPT0002B",null,null,null,null,null,null,0,216,0,null,null,null,null,null,null,0,216,0,30874.5]
[null,"CHIHUAHUA","MARJ6706253G1","MARJ670625HCHRSN08","JUAN FRANCISCO MARQUEZ DE LA ROSA","08DPT0002B",null,null,null,null,null,null,0,240,0,null,null,null,null,null,null,0,240,0,29817]
[null,"CHIHUAHUA","MAHR7303052U1","MAHR730305HCHRRG05","RIGOBERTO MARTINEZ HERNANDEZ","08DPT0002B",null,null,null,null,null,null,0,240,0,null,null,null,null,null,null,0,240,0,29817]
[null,"CHIHUAHUA","MARE920423KX8","MARE920423MCHRNR05","ERIKA ELIZABETH MARTINEZ RANGEL","08DPT0002B",null,null,null,null,null,null,0,180,0,null,null,null,null,null,null,0,180,0,22362.780000000002]
[null,"CHIHUAHUA","MAER7001128F3","MAER700112MCHTSQ04","RAQUEL  MATA ESPARZA","08DPT0002B",null,null,null,null,null,null,0,240,0,null,null,null,null,null,null,0,240,0,34305]
[null,"CHIHUAHUA","MEMA740518TM8","MEMA740518HCHLLL03","ALFONSO NATANAEL MELENDEZ MELENDEZ","08DPT0002B",null,null,null,null,null,null,0,228,0,null,null,null,null,null,null,0,228,0,28326.179999999997]
[null,"CHIHUAHUA","MEPF691219UT3","MEPF691219HCHLRR06","FRANCISCO JAVIER MELENDEZ PEREYRA","08DPT0002B",null,null,null,null,null,null,0,216,0,null,null,null,null,null,null,0,216,0,30874.5]
[null,"CHIHUAHUA","MERE811126DU3","MERE811126MCHLMD02","EDNA MELINA MELERO RAMIREZ","08DPT0002B",null,null,null,null,null,null,0,216,0,null,null,null,null,null,null,0,216,0,30874.5]
[null,"CHIHUAHUA","MEMN800616CH0","MEMN800616MZSNRR04","NORA DE LOURDES MENDEZ MARRUFO","08DPT0002B",null,null,null,null,null,null,0,216,0,null,null,null,null,null,null,0,216,0,30874.5]
[null,"CHIHUAHUA","MEPM521007BW0","MEPM521007MSPNTR05","MARINA MENDOZA PATIÑO","08DPT0002B",null,null,null,null,null,null,0,240,0,null,null,null,null,null,null,0,240,0,34305]
[null,"CHIHUAHUA","MEHE771226AK0","MEHE771226MCHZRM07","EMMA MARINA MEZA HERNANDEZ","08DPT0002B",null,null,null,null,null,null,0,228,0,null,null,null,null,null,null,0,228,0,32589.780000000002]
[null,"CHIHUAHUA","MONJ730522LH4","MONJ730522HCHLXN04","JUAN BENJAMIN MOLINA NUÑEZ","08DPT0002B",null,null,null,null,null,null,0,216,0,null,null,null,null,null,null,0,216,0,23743.8]
[null,"CHIHUAHUA","MOAI970902SU8","MOAI970902HCHNRS09","ISAAC MONREAL ARVIZU","08DPT0002B",null,null,null,null,null,null,0,240,0,null,null,null,null,null,null,0,240,0,19578]
[null,"CHIHUAHUA","MOMC840319BC9","MOMC840319MCHRRR09","CARMINA SARA MORENO MORALES","08DPT0002B",null,null,null,null,null,null,0,240,0,null,null,null,null,null,null,0,240,0,29817]
[null,"CHIHUAHUA","NARE6212101N2","NARE621210HCHVDL15","ELISEO MANUEL NAVA RODRIGUEZ","08DPT0002B",null,null,null,null,null,null,0,192,0,null,null,null,null,null,null,0,192,0,27444]
[null,"CHIHUAHUA","NAMR911217QR2","NAMR911217MCHVRY09","REYNA GUADALUPE NAVARRETE MARROQUIN","08DPT0002B",null,null,null,null,null,null,0,240,0,null,null,null,null,null,null,0,240,0,26382]
[null,"CHIHUAHUA","OICT750827I13","OICT750827MCHLRR05","MARIA TERESA OLIVAS  CORONADO","08DPT0002B",null,null,null,null,null,null,0,168,0,null,null,null,null,null,null,0,168,0,24013.5]
[null,"CHIHUAHUA","OEZA770117EH9","OEZA770117HCHRPL04","ALFREDO LORENZO ORTEGA ZEPEDA","08DPT0002B",null,null,null,null,null,null,0,240,0,null,null,null,null,null,null,0,240,0,34305]
[null,"CHIHUAHUA","PAVM750409GD9","PAVM750409HCLLRR05","JOSE MARIA PALACIOS VARELA","08DPT0002B",null,null,null,null,null,null,0,96,0,null,null,null,null,null,null,0,96,0,10552.8]
[null,"CHIHUAHUA","PEGC920119FE4","PEGC920119MCHXRL07","CLAUDIA SELENE PEÑA GUARDADO","08DPT0002B",null,null,null,null,null,null,0,192,0,null,null,null,null,null,null,0,192,0,21105.599999999999]
[null,"CHIHUAHUA","PEGF4912049U3","PEGF491204HCHRRR02","FRANCISCO PEREZ GUERRERO","08DPT0002B",null,null,null,null,null,null,0,228,0,null,null,null,null,null,null,0,228,0,32589.780000000002]
[null,"CHIHUAHUA","PELI800928FR2","PELI800928HCHRPG01","JOSE IGNACIO PEREZ LOPEZ","08DPT0002B",null,null,null,null,null,null,0,156,0,null,null,null,null,null,null,0,156,0,17148.3]
[null,"CHIHUAHUA","PIMR770113LW6","PIMR770113MCLNXC04","ROCIO PINTO MUÑOZ","08DPT0002B",null,null,null,null,null,null,0,228,0,null,null,null,null,null,null,0,228,0,32589.780000000002]
[null,"CHIHUAHUA","POGH680928E46","POGH680928HCHRTC09","HECTOR MIGUEL PORRAS GUTIERREZ","08DPT0002B",null,null,null,null,null,null,0,228,0,null,null,null,null,null,null,0,228,0,32589.780000000002]
[null,"CHIHUAHUA","QUMJ930605SD1","QUMJ930605HCHZRV04","JAVIER ARTURO QUEZADA MORA","08DPT0002B",null,null,null,null,null,null,0,216,0,null,null,null,null,null,null,0,216,0,23743.8]
[null,"CHIHUAHUA","RABM8107186R9","RAVM810718MCHMRR16","MIRIAM SUSANA RAMIREZ BARRERA","08DPT0002B",null,null,null,null,null,null,0,240,0,null,null,null,null,null,null,0,240,0,34305]
[null,"CHIHUAHUA","RACJ670625F74","RACJ670625HCHMRN00","JUAN RAMON RAMIREZ CORRAL","08DPT0002B",null,null,null,null,null,null,0,180,0,null,null,null,null,null,null,0,180,0,25728.780000000002]
[null,"CHIHUAHUA","RALK790326386","RALK790326MCHMPR08","KARINA CECILIA RAMIREZ LOPEZ","08DPT0002B",null,null,null,null,null,null,0,240,0,null,null,null,null,null,null,0,240,0,28587.5]
[null,"CHIHUAHUA","RAVJ750924S61","RAVJ750924HCHMLN06","JUAN GABRIEL RAMIREZ VELA","08DPT0002B",null,null,null,null,null,null,0,228,0,null,null,null,null,null,null,0,228,0,28326.179999999997]
[null,"CHIHUAHUA","REFG8206303T2","REFG820630MCLYLR05","GRISELDA REYES FLORES","08DPT0002B",null,null,null,null,null,null,0,180,0,null,null,null,null,null,null,0,180,0,19786.5]
[null,"CHIHUAHUA","RIOH600504T14","RIOH600504HCHVLC08","HECTOR RAMON RIVERA OLIVAS","08DPT0002B",null,null,null,null,null,null,0,204,0,null,null,null,null,null,null,0,204,0,29159.280000000002]
[null,"CHIHUAHUA","ROAL7201241P5","ROAL720124MCHDVD01","LIDIA ANGELICA RODRIGUEZ AVILA","08DPT0002B",null,null,null,null,null,null,0,228,0,null,null,null,null,null,null,0,228,0,32589.780000000002]
[null,"CHIHUAHUA","ROMM8706134U5","ROMM870613HCHDNN05","MANUEL ANTONIO RODRIGUEZ MONREAL","08DPT0002B",null,null,null,null,null,null,0,144,0,null,null,null,null,null,null,0,144,0,15829.2]
[null,"CHIHUAHUA","ROPE5908038V9","ROPE590803HCHDRL01","ELIGIO RODRIGUEZ PRIETO","08DPT0002B",null,null,null,null,null,null,0,240,0,null,null,null,null,null,null,0,240,0,29817]
[null,"CHIHUAHUA","SAVY820923BCA","SAVY820923MCHLLM00","YAMET VERENICE SALAZAR VELAZQUEZ","08DPT0002B",null,null,null,null,null,null,0,240,0,null,null,null,null,null,null,0,240,0,34305]
[null,"CHIHUAHUA","SELV800114DJ4","SELV800114HCHGZC03","VICTOR ANDRES SEGOVIA LOZOYA","08DPT0002B",null,null,null,null,null,null,0,228,0,null,null,null,null,null,null,0,228,0,32589.780000000002]
[null,"CHIHUAHUA","SOOA7210299X8","SOOA721029MCHLLN06","ANA LUISA SOLIS OLIVAS","08DPT0002B",null,null,null,null,null,null,0,180,0,null,null,null,null,null,null,0,180,0,25728.780000000002]
[null,"CHIHUAHUA","TERG520428J43","TERG520428HDFLVL09","GUILLERMO TELLEZ REVILLA","08DPT0002B",null,null,null,null,null,null,0,240,0,null,null,null,null,null,null,0,240,0,34305]
[null,"CHIHUAHUA","VAOA630813IE8","VAOA630813MDGLRN07","ANGELA MARIA VALTIERRA  ORTEGA","08DPT0002B",null,null,null,null,null,null,0,240,0,null,null,null,null,null,null,0,240,0,34305]
[null,"CHIHUAHUA","GOCE790701I32","GOXC790701MCHNLX06","CELIA BRISA GONZALEZ ","08DPT0002B",null,null,null,null,null,null,0,192,0,null,null,null,null,null,null,0,192,0,27444]
[null,"CHIHUAHUA","YAGC851128SX6","YAGC851128MCHXNY03","CYNTHIA AURORA YAÑEZ GONZALEZ","08DPT0002B",null,null,null,null,null,null,0,180,0,null,null,null,null,null,null,0,180,0,25728.780000000002]
[null,"CHIHUAHUA","AUVJ9103083J2","AUVJ910308HCHGLN15","AGUIRRE VILLARREAL JUAN DE DIOS","08DPT0003A",null,null,null,1,0,0,null,null,null,null,null,null,null,null,null,1,0,0,17845.55]
[null,"CHIHUAHUA","AOOC791125GF8","AOOC791125HCHLRR17","ALOR ORTEGA CRISTHIAN OMAR","08DPT0003A",null,null,null,1,0,0,null,null,null,null,null,null,null,null,null,1,0,0,76485.63]
[null,"CHIHUAHUA","AEHL721013358","AEHL721013MCHRRR04","ARMENDARIZ HUERTA LAURA ELENA","08DPT0003A",null,null,null,1,0,0,null,null,null,null,null,null,null,null,null,1,0,0,43933.17]
[null,"CHIHUAHUA","AOGA850323MS8","AOGA850323MCHRRD09","ARZOLA GARIBAY ADRIANA","08DPT0003A",null,null,null,1,0,0,null,null,null,null,null,null,null,null,null,1,0,0,41884.6]
[null,"CHIHUAHUA","BALJ741015QJ5","BALJ741015HNTCPR09","BACA LOPEZ JORGE GERARDO","08DPT0003A",null,null,null,null,null,null,null,null,null,1,0,1,null,null,null,1,0,0,85992.48]
[null,"CHIHUAHUA","CALS630411D26","CALS630411HCHNSL01","CANO LEOS SALVADOR","08DPT0003A",null,null,null,1,0,0,null,null,null,null,null,null,null,null,null,1,0,0,93363.41]
[null,"CHIHUAHUA","COSC761202AU8","COSC761202MCHRNL00","CORONADO SAENZ CLAUDIA","08DPT0003A",null,null,null,1,0,0,null,null,null,null,null,null,null,null,null,1,0,0,50737.69]
[null,"CHIHUAHUA","CORE740806FH5","CORE740806HCHRYN08","CORRAL REYES ENCARNACION","08DPT0003A",null,null,null,1,0,0,null,null,null,null,null,null,null,null,null,1,0,0,33593.42]
[null,"CHIHUAHUA","EABJ810502G45","EABJ810502HCHSYR08","ESPARZA BAYLON JORGE HUMBERTO","08DPT0003A",null,null,null,1,0,0,null,null,null,null,null,null,null,null,null,1,0,0,29780.9]
[null,"CHIHUAHUA","EIHE740513ST9","EIHE740513MCHSRV03","ESPINOSA HERNANDEZ EVA CELINA","08DPT0003A",null,null,null,1,0,0,null,null,null,null,null,null,null,null,null,1,0,0,76080.350000000006]
[null,"CHIHUAHUA","FAJA861008RA4","FAJA861008MCHRRL05","FRANCO JURADO MARIA ALEJANDRA","08DPT0003A",null,null,null,1,0,0,null,null,null,null,null,null,null,null,null,1,0,0,68950.06]
[null,"CHIHUAHUA","GAFS650908R84","GAFS650908HCHRLR07","GARCIA FLORES SERGIO MARTIN","08DPT0003A",null,null,null,1,0,0,null,null,null,null,null,null,null,null,null,1,0,0,39981.51]
[null,"CHIHUAHUA","GAAG630825HU2","GAAG630825HCHRLR06","GARDEA ALEMAN GREGORIO","08DPT0003A",null,null,null,1,0,0,null,null,null,null,null,null,null,null,null,1,0,0,45369.86]
[null,"CHIHUAHUA","GAAV670716S40","GAAV670716HCHRRC06","GARDEA ARREDONDO VICTOR MANUEL","08DPT0003A",null,null,null,1,0,0,null,null,null,null,null,null,null,null,null,1,0,0,69766.929999999993]
[null,"CHIHUAHUA","GAHA8701284V2  ","GAHA870128HCHRRL07","GARDEA HEREDIA ALVARO","08DPT0003A",null,null,null,1,0,0,null,null,null,null,null,null,null,null,null,1,0,0,29719.66]
[null,"CHIHUAHUA","GOVJ720801R43","GOVJ720801MCHNLD09","GONZALEZ VALLES JUDITH","08DPT0003A",null,null,null,1,0,0,null,null,null,null,null,null,null,null,null,1,0,0,119981.17]
[null,"CHIHUAHUA","HESH611022NF3","HESH611022HCHRNL03","HEREDIA SAENZ HILADRIO","08DPT0003A",null,null,null,1,0,0,null,null,null,null,null,null,null,null,null,1,0,0,39342.9]
[null,"CHIHUAHUA","HEGM7510295L3","HEGM751029MCHRTY07","HERNANDEZ GUTIERREZ MAYRA VERONICA","08DPT0003A",null,null,null,1,0,0,null,null,null,null,null,null,null,null,null,1,0,0,48338.03]
[null,"CHIHUAHUA","MEHP811017GD5","MEHP811017HCHNRL02","MENDEZ HERRERA PAUL ALONSO","08DPT0003A",null,null,null,1,0,0,null,null,null,null,null,null,null,null,null,1,0,0,37178.07]
[null,"CHIHUAHUA","MEMD550401S32","MEMD550401HCHNTL01","MENDEZ MOTA JOSE DOLORES","08DPT0003A",null,null,null,1,0,0,null,null,null,null,null,null,null,null,null,1,0,0,37524.33]
[null,"CHIHUAHUA","MOIR7306072Z5","MOIR730607HCHLBM08","MOLINA IBARRA RAMON HUMBERTO","08DPT0003A",null,null,null,1,0,0,null,null,null,null,null,null,null,null,null,1,0,0,27922.799999999999]
[null,"CHIHUAHUA","MOAM570729HK3","MOAM570729HCHNRN02","MONTES ARZOLA MANUEL","08DPT0003A",null,null,null,1,0,0,null,null,null,null,null,null,null,null,null,1,0,0,145529.88]
[null,"CHIHUAHUA","MOME900109M68","MOME900109MCHNNS03","MONTES MONTES ESMERALDA JANETH","08DPT0003A",null,null,null,1,0,0,null,null,null,null,null,null,null,null,null,1,0,0,28222.799999999999]
[null,"CHIHUAHUA","MOHR810216267","MOHR810216HCHNLN06","MONTES HOLGUIN RENE GUADALUPE","08DPT0003A",null,null,null,1,0,0,null,null,null,null,null,null,null,null,null,1,0,0,29145.18]
[null,"CHIHUAHUA","MOCY820701FR6","MOCY820701MCHRHS01","ORTIZ CHAVEZ MARTHA ELVIRA","08DPT0003A",null,null,null,1,0,0,null,null,null,null,null,null,null,null,null,1,0,0,57786.65]
[null,"CHIHUAHUA","PECF611129NU5","PECF611129MOCRSL04","PEREZ CASTRO FILOMENA IRMA","08DPT0003A",null,null,null,1,0,0,null,null,null,null,null,null,null,null,null,1,0,0,50237.54]
[null,"CHIHUAHUA","PESB570420393","PESB570420HCHRSN03","PEREZ SOSA BENJAMIN","08DPT0003A",null,null,null,1,0,0,null,null,null,null,null,null,null,null,null,1,0,0,38178.959999999999]
[null,"CHIHUAHUA","QURM641112699","QURM641112HCHXMR08","QUIÑONEZ RAMIREZ MARTIN RENE","08DPT0003A",null,null,null,1,0,0,null,null,null,null,null,null,null,null,null,1,0,0,43943.55]
[null,"CHIHUAHUA","QUYA890925Q52","QUYA890925MCHXXN07","QUIÑONEZ YAÑEZ ANABEL","08DPT0003A",null,null,null,1,0,0,null,null,null,null,null,null,null,null,null,1,0,0,34250.74]
[null,"CHIHUAHUA","RAGH640227EZ9","RAGH640227HCLMTR04","RAMIREZ GUTIERREZ JOSE HORACIO","08DPT0003A",null,null,null,1,0,0,null,null,null,null,null,null,null,null,null,1,0,0,55139.85]
[null,"CHIHUAHUA","SUCM720601QH7","SUCM720601MCHRRY01","SUAREZ CORRAL MYRNA MANUELA","08DPT0003A",null,null,null,1,0,0,null,null,null,null,null,null,null,null,null,1,0,0,81732.100000000006]
[null,"CHIHUAHUA","YADR7710046J3","YADR771004MCHXZS02","YAÑEZ DIAZ ROSA IVONNE","08DPT0003A",null,null,null,1,0,0,null,null,null,null,null,null,null,null,null,1,0,0,21081.5]
[null,"CHIHUAHUA","AOCF7610047IA","AOCF761204HCHCBR06","FRANCISCO ACOSTA CONTRERAS","08DPT0003A",null,null,null,null,null,null,0,260,0,null,null,null,null,null,null,0,260,0,29573]
[null,"CHIHUAHUA","AOMM7702115QA","AOMM770211MCHCRD18","MIDIAM LOURDES ACOSTA MERAZ","08DPT0003A",null,null,null,null,null,null,0,260,0,null,null,null,null,null,null,0,260,0,29573]
[null,"CHIHUAHUA","AUQN701229G72","AUQN701229MCHGNR05","NORMA AGUIRRE QUINTANA ","08DPT0003A",null,null,null,null,null,null,0,234,0,null,null,null,null,null,null,0,234,0,27115.7]
[null,"CHIHUAHUA","AAHE730629HA8","AAHE730629HDGLRD05","EDGAR JESUS ALBA HERNANDEZ","08DPT0003A",null,null,null,null,null,null,0,260,0,null,null,null,null,null,null,0,260,0,29573]
[null,"CHIHUAHUA","AEOP850816BU5","AEOP850816HCHRLD08","PEDRO RAFAEL ARMENDARIZ OLIVAS","08DPT0003A",null,null,null,null,null,null,0,195,0,null,null,null,null,null,null,0,195,0,26269]
[null,"CHIHUAHUA","AERG670801H43","AERG670801HCHRVB09","GABRIEL ARMENDARIZ RIVAS","08DPT0003A",null,null,null,null,null,null,0,195,0,null,null,null,null,null,null,0,195,0,26269.279999999999]
[null,"CHIHUAHUA","BAMF820909BC1","BAMF820909MCHLRT08","FATIMA DEL CARMEN BALDERAS MORALES","08DPT0003A",null,null,null,null,null,null,0,234,0,null,null,null,null,null,null,0,234,0,30523.1]
[null,"CHIHUAHUA","CACF650131IUA","CACF650131HCHNHL00","FILIBERTO CANO CHAVEZ","08DPT0003A",null,null,null,null,null,null,0,247,0,null,null,null,null,null,null,0,247,0,25770.799999999999]
[null,"CHIHUAHUA","CALA591128150","CALA591128HCHNSB00","ABRAHAM CANO LEOS","08DPT0003A",null,null,null,null,null,null,0,130,0,null,null,null,null,null,null,0,130,0,19179.5]
[null,"CHIHUAHUA","CATI910806HS0","CATI910806HCHRRV03","IVAN DOROTEO CARRERA DE LA TORRE","08DPT0003A",null,null,null,null,null,null,0,260,0,null,null,null,null,null,null,0,260,0,29573]
[null,"CHIHUAHUA","CATN8302135X1","CATN830213MCHRRD06","NADIA BEATRIZ CARRERA DE LA TORRE","08DPT0003A",null,null,null,null,null,null,0,260,0,null,null,null,null,null,null,0,260,0,33359]
[null,"CHIHUAHUA","CAGG681119QE9","CAGG681119MCHRRB25","MARIA GABRIELA CARRILLO GARDEA","08DPT0003A",null,null,null,null,null,null,0,247,0,null,null,null,null,null,null,0,247,0,31941.08]
[null,"CHIHUAHUA","CAMA550415A18","CAMA550415HCHRLR08","ARISTEO CARRILLO MALDONADO","08DPT0003A",null,null,null,null,null,null,0,130,0,null,null,null,null,null,null,0,130,0,13037]
[null,"CHIHUAHUA","CATA900830PFA","CATA900830MCHRRL03","ALEJANDRA IVETTE  CARRILLO TRUJILLO","08DPT0003A",null,null,null,null,null,null,0,234,0,null,null,null,null,null,null,0,234,0,27115.7]
[null,"CHIHUAHUA","CATI851219KEA","CATI851219MCHRRR12","IRMA RAQUEL CARRILLO TRUJILLO","08DPT0003A",null,null,null,null,null,null,0,234,0,null,null,null,null,null,null,0,234,0,30523.1]
[null,"CHIHUAHUA","CAGL680404GU5","CAGL680404MCHSTT08","LETICIA CASILLAS GUTIERREZ","08DPT0003A",null,null,null,null,null,null,0,156,0,null,null,null,null,null,null,0,156,0,22015.4]
[null,"CHIHUAHUA","CEBC880121MJ0","CEBC880121MCHBCL06","CLAUDIA INES CEBALLOS BACA","08DPT0003A",null,null,null,null,null,null,0,195,0,null,null,null,null,null,null,0,195,0,23429.78]
[null,"CHIHUAHUA","CEHF701204P69","CEHF701204HDGRRR02","FRANCISCO JAVIER CERENIL HERRERA","08DPT0003A",null,null,null,null,null,null,0,234,0,null,null,null,null,null,null,0,234,0,30523.1]
[null,"CHIHUAHUA","CASC781201J96","CASC781201MCHHNR02","CORINA CHAVEZ SANCHEZ","08DPT0003A",null,null,null,null,null,null,0,234,0,null,null,null,null,null,null,0,234,0,30523.1]
[null,"CHIHUAHUA","DERI7801118J5","DEXR780111HCHLXC03","RICARDO DELGADO","08DPT0003A",null,null,null,null,null,null,0,221,0,null,null,null,null,null,null,0,221,0,29105.18]
[null,"CHIHUAHUA","LEPJ860727765","LEPJ860727HCHNRV08","JAVIER EDUVIGES DE LEON PARADA","08DPT0003A",null,null,null,null,null,null,0,260,0,null,null,null,null,null,null,0,260,0,26864]
[null,"CHIHUAHUA","EARD8007284EA","EARD800728MCHSCL06","DULCE MARGARITA ELIZABETH ESCALANTE ROCHA","08DPT0003A",null,null,null,null,null,null,0,260,0,null,null,null,null,null,null,0,260,0,33359]
[null,"CHIHUAHUA","FEAL8707295J5","DUPB710508MCHRRR02","LUIS RAUL FERNANDEZ ACOSTA","08DPT0003A",null,null,null,null,null,null,0,260,0,null,null,null,null,null,null,0,260,0,33359]
[null,"CHIHUAHUA","GAQL770122HI2","GAQL770122MCHLXZ06","LUZ ELIZABETH GALVAN QUIÑONEZ","08DPT0003A",null,null,null,null,null,null,0,234,0,null,null,null,null,null,null,0,234,0,30523.1]
[null,"CHIHUAHUA","GACP590517MU6","GACP590517MCHRHT05","PATRICIA EUGENIA GARCIA CHAVEZ","08DPT0003A",null,null,null,null,null,null,0,234,0,null,null,null,null,null,null,0,234,0,30523.1]
[null,"CHIHUAHUA","GARJ67122131A","GARJ671221HCHRZM09","JAIME GARCIA RUIZ","08DPT0003A",null,null,null,null,null,null,0,260,0,null,null,null,null,null,null,0,260,0,33359]
[null,"CHIHUAHUA","GAAC630426E79","GAAC630429HCHRRR03","CARLOS DAVID GARDEA ARREDONDO","08DPT0003A",null,null,null,null,null,null,0,247,0,null,null,null,null,null,null,0,247,0,20770.8]
[null,"CHIHUAHUA","GOGA810922999","GOGA810922HCHNRG02","AGUSTIN GONZALEZ GARCIA","08DPT0003A",null,null,null,null,null,null,0,260,0,null,null,null,null,null,null,0,260,0,33359]
[null,"CHIHUAHUA","GOGJ8811064X6","GOGJ881106MCHNTS09","JESSICA JANETH GONZALEZ GUTIERREZ","08DPT0003A",null,null,null,null,null,null,0,260,0,null,null,null,null,null,null,0,260,0,29573]
[null,"CHIHUAHUA","GOHD580525IP0","GOHD580525HCHNRV01","DAVID GONZALEZ HERNANDEZ","08DPT0003A",null,null,null,null,null,null,0,234,0,null,null,null,null,null,null,0,234,0,24677.599999999999]
[null,"CHIHUAHUA","GUCG610126B56","GUCG610126HCHTNR03","JOSE GERARDO GUTIERREZ CONTRERAS","08DPT0003A",null,null,null,null,null,null,0,130,0,null,null,null,null,null,null,0,130,0,19179.5]
[null,"CHIHUAHUA","HEAV711202QZ8","HEAV711202MCHRGV01","VIVIANA HERNANDEZ AGUILERA","08DPT0003A",null,null,null,null,null,null,0,117,0,null,null,null,null,null,null,0,117,0,17761.580000000002]
[null,"CHIHUAHUA","HEAA900716PY3","HEAA900716HCHRGL00","ALFREDO HERNANDEZ AGUIRRE","08DPT0003A",null,null,null,null,null,null,0,208,0,null,null,null,null,null,null,0,208,0,22491.200000000001]
[null,"CHIHUAHUA","HEAA881029IG6","HEAA881029MCHRNN04","ANGELICA HERNANDEZ ANGEL","08DPT0003A",null,null,null,null,null,null,0,208,0,null,null,null,null,null,null,0,208,0,27687.200000000001]
[null,"CHIHUAHUA","HISE750912LP7","HISE750912MCHNNT05","ETHEL JANETH HINOJOS SANCHEZ","08DPT0003A",null,null,null,null,null,null,0,247,0,null,null,null,null,null,null,0,247,0,28344.38]
[null,"CHIHUAHUA","HOOJ841127R23","HOOJ841127HCHLJS04","JESUS MANUEL HOLGUIN OJEDA","08DPT0003A",null,null,null,null,null,null,0,260,0,null,null,null,null,null,null,0,260,0,28632.5]
[null,"CHIHUAHUA","HOQS841119E44","HOQS841119MCHLNL02","SILVIA HOLGUIN QUINTANA","08DPT0003A",null,null,null,null,null,null,0,195,0,null,null,null,null,null,null,0,195,0,26269.279999999999]
[null,"CHIHUAHUA","IEPA690710Q2A","IEPA690710HZSRRL07","ALEJANDRO IRENE PEREZ","08DPT0003A",null,null,null,null,null,null,0,195,0,null,null,null,null,null,null,0,195,0,26269.279999999999]
[null,"CHIHUAHUA","JUEM870729SW2","JUEM870729MCHRSR04","MARINA JUAREZ ESPARZA","08DPT0003A",null,null,null,null,null,null,0,260,0,null,null,null,null,null,null,0,260,0,26864]
[null,"CHIHUAHUA","JUGE790622JJ2","JUGE790622HCHRRD03","EDGAR ELIEL JUAREZ GRAJEDA","08DPT0003A",null,null,null,null,null,null,0,260,0,null,null,null,null,null,null,0,260,0,33359]
[null,"CHIHUAHUA","LARJ611212G44","LARJ611212HCHZDL03","JOEL GUADALUPE LAZCANO RODRIGUEZ","08DPT0003A",null,null,null,null,null,null,0,130,0,null,null,null,null,null,null,0,130,0,15932]
[null,"CHIHUAHUA","LISA761208237","LISA761208HCHCLN05","ANGEL LICERIO SILVEYRA","08DPT0003A",null,null,null,null,null,null,0,130,0,null,null,null,null,null,null,0,130,0,10932]
[null,"CHIHUAHUA","LOGJ770422620","LOGJ770422HCHPRL08","JOEL ALONSO LOPEZ GRANADOS","08DPT0003A",null,null,null,null,null,null,0,260,0,null,null,null,null,null,null,0,260,0,33359]
[null,"CHIHUAHUA","LOSS7606157X9","LOSS760615MCHPLL02","SILVIA LOPEZ SALCIDO","08DPT0003A",null,null,null,null,null,null,0,260,0,null,null,null,null,null,null,0,260,0,33359]
[null,"CHIHUAHUA","LOCM7912081Q9","LOCM791208MCHYLR09","MARTHA LAURA LOYA CELESTIN","08DPT0003A",null,null,null,null,null,null,0,234,0,null,null,null,null,null,null,0,234,0,30523.1]
[null,"CHIHUAHUA","LUMA890208UY4","LUMA890208HCHNLL06","ALEJANDRO LUNA MOLINA","08DPT0003A",null,null,null,null,null,null,0,234,0,null,null,null,null,null,null,0,234,0,30523.1]
[null,"CHIHUAHUA","MAAK800331I60","MAAK800331MCHCGR00","KAREN LOURDES MACIAS AGUIRRE","08DPT0003A",null,null,null,null,null,null,0,169,0,null,null,null,null,null,null,0,169,0,23433.38]
[null,"CHIHUAHUA","MAMF571028UH3","MAMF571028HCHRCR08","FRANCISCO ROBERTO MARTINEZ MACIAS","08DPT0003A",null,null,null,null,null,null,0,247,0,null,null,null,null,null,null,0,247,0,31941.08]
[null,"CHIHUAHUA","MAMS761009L43","MASS761009HCHRCR04","SERGIO RENE MARTINEZ MACIAS","08DPT0003A",null,null,null,null,null,null,0,260,0,null,null,null,null,null,null,0,260,0,26864]
[null,"CHIHUAHUA","MAML781222TP2","MAML781222MCHRNR05","LAURA GABRIELA MARTINEZ MONARREZ","08DPT0003A",null,null,null,null,null,null,0,169,0,null,null,null,null,null,null,0,169,0,23433.38]
[null,"CHIHUAHUA","MAPJ881207NN8","MAPJ881207MCHRRN07","JANETH DERAT MARTINEZ PROSPERO","08DPT0003A",null,null,null,null,null,null,0,247,0,null,null,null,null,null,null,0,247,0,31941.08]
[null,"CHIHUAHUA","MARB780909MG5","MARB780909MCHRSR07","BRENDA SOCORRO MARTINEZ RIOS","08DPT0003A",null,null,null,null,null,null,0,247,0,null,null,null,null,null,null,0,247,0,31941.08]
[null,"CHIHUAHUA","MEMP850117HB8","MEMP850117MCHNNL01","PALOMA DEL CARMEN MENDEZ MENDEZ","08DPT0003A",null,null,null,null,null,null,0,234,0,null,null,null,null,null,null,0,234,0,30523.1]
[null,"CHIHUAHUA","MOHE7612192R9","MOHE761219HCHNLD06","EDGAR OBEK MONTES HOLGUIN","08DPT0003A",null,null,null,null,null,null,0,247,0,null,null,null,null,null,null,0,247,0,31941.08]
[null,"CHIHUAHUA","MOMA830930QR2","MOMA830930MCHRRN04","ANTONIA MORENO MORALES","08DPT0003A",null,null,null,null,null,null,0,234,0,null,null,null,null,null,null,0,234,0,30523.1]
[null,"CHIHUAHUA","NAMR830722I63","NAMR830722MCHXNB01","REBECA DIANA NANEZ MENDOZA","08DPT0003A",null,null,null,null,null,null,0,260,0,null,null,null,null,null,null,0,260,0,29573]
[null,"CHIHUAHUA","PAQR840612BHA","PAQR840612HCHLXM03","JOSE RAMON PALMA QUIÑONEZ","08DPT0003A",null,null,null,null,null,null,0,260,0,null,null,null,null,null,null,0,260,0,26864]
[null,"CHIHUAHUA","PAMZ880803S42","PAMZ880803MCHTRM09","ZAMISH GABRIELA PATIÑO MORALES","08DPT0003A",null,null,null,null,null,null,0,234,0,null,null,null,null,null,null,0,234,0,24677.599999999999]
[null,"CHIHUAHUA","PERO820514295","PERO820514HCHRMM06","OMAR ARMANDO PEREZ RAMIREZ","08DPT0003A",null,null,null,null,null,null,0,260,0,null,null,null,null,null,null,0,260,0,33359]
[null,"CHIHUAHUA","QUVC860208IX4","QUVC860208MCHNLR06","CRISTINA QUINTANA VILLEGAS","08DPT0003A",null,null,null,null,null,null,0,156,0,null,null,null,null,null,null,0,156,0,18118.400000000001]
[null,"CHIHUAHUA","QUGG830326LY2","QUGG830326MCHXRR05","GEORGINA ALHELI QUIÑONEZ GARCIA","08DPT0003A",null,null,null,null,null,null,0,234,0,null,null,null,null,null,null,0,234,0,30523.1]
[null,"CHIHUAHUA","QUYD920620SG7","QUYD920620MCHXXN07","DANIA ANGELICA QUIÑONEZ YAÑEZ","08DPT0003A",null,null,null,null,null,null,0,260,0,null,null,null,null,null,null,0,260,0,26864]
[null,"CHIHUAHUA","RACG650805Q12","RACG650805HSRMNM07","GAMALIEL RAMOS CONTRERAS","08DPT0003A",null,null,null,null,null,null,0,97,0,null,null,null,null,null,null,0,97,0,16057.85]
[null,"CHIHUAHUA","RACA620817IU7","RACA620817HCHSHN09","ANTONIO RASCON CHAVEZ","08DPT0003A",null,null,null,null,null,null,0,260,0,null,null,null,null,null,null,0,260,0,26864]
[null,"CHIHUAHUA","RERH8005305SA","RERH800530HCHNDC03","HECTOR RAUL RENTERIA RODRIGUEZ","08DPT0003A",null,null,null,null,null,null,0,260,0,null,null,null,null,null,null,0,260,0,29573]
[null,"CHIHUAHUA","RIPS680731I67","RIPS680731HCHCRR07","SERGIO RICO PEREZ","08DPT0003A",null,null,null,null,null,null,0,260,0,null,null,null,null,null,null,0,260,0,26864]
[null,"CHIHUAHUA","RIAJ830525SU3","RIAJ830525HCHVCM08","JAIME MICHAEL RIVERA ACOSTA","08DPT0003A",null,null,null,null,null,null,0,260,0,null,null,null,null,null,null,0,260,0,33359]
[null,"CHIHUAHUA","ROSL891018R33","ROSL891018HCHDNS03","LUIS ISIDRO RODRIGUEZ SAENZ","08DPT0003A",null,null,null,null,null,null,0,208,0,null,null,null,null,null,null,0,208,0,24658.400000000001]
[null,"CHIHUAHUA","ROSL8112066G9","ROSL811206HCHDFS05","LUIS CARLOS RODRIGUEZ SIFUENTES","08DPT0003A",null,null,null,null,null,null,0,260,0,null,null,null,null,null,null,0,260,0,33359]
[null,"CHIHUAHUA","ROMC790529SQ8","ROMC790529HCHJZR03","CARLOS GERMAN ROJAS MEZA","08DPT0003A",null,null,null,null,null,null,0,221,0,null,null,null,null,null,null,0,221,0,29105.18]
[null,"CHIHUAHUA","ROMJ820824341","ROMJ820824HCHMRN09","JUAN PABLO ROMO MARTINEZ","08DPT0003A",null,null,null,null,null,null,0,130,0,null,null,null,null,null,null,0,130,0,19179.5]
[null,"CHIHUAHUA","ROQM800726NK3","ROQM800726MCHNXR09","MARISA JUDITH RONQUILLO QUIÑONEZ","08DPT0003A",null,null,null,null,null,null,0,130,0,null,null,null,null,null,null,0,130,0,15932]
[null,"CHIHUAHUA","SARJ830528CW0","SARJ830528HCHLDR12","JORGE ARTURO SALAS RODRIGUEZ","08DPT0003A",null,null,null,null,null,null,0,260,0,null,null,null,null,null,null,0,260,0,26864]
[null,"CHIHUAHUA","SADC810906EH7","SADC810906MCHNZR07","MARIA CRISTINA SANCHEZ DIAZ","08DPT0003A",null,null,null,null,null,null,0,260,0,null,null,null,null,null,null,0,260,0,26864]
[null,"CHIHUAHUA","SASM890615QE5","SASM890615HCHNXG03","MIGUEL ANGEL SANCHEZ SEAÑEZ","08DPT0003A",null,null,null,null,null,null,0,234,0,null,null,null,null,null,null,0,234,0,19677.599999999999]
[null,"CHIHUAHUA","SERM730609876","SERM730609MCHPYY01","MYRIAM SEPULVEDA REYES","08DPT0003A",null,null,null,null,null,null,0,234,0,null,null,null,null,null,null,0,234,0,30523.1]
[null,"CHIHUAHUA","TEAR760610A38","TEAR760610HCHRGL01","RAUL FELIPE TERRAZAS AGUIRRE","08DPT0003A",null,null,null,null,null,null,0,130,0,null,null,null,null,null,null,0,130,0,19179.5]
[null,"CHIHUAHUA","TOBT8310246R6","TOBT831024MCHRRH05","THELMA GUADALUPE TORRES BARRETO","08DPT0003A",null,null,null,null,null,null,0,260,0,null,null,null,null,null,null,0,260,0,33359]
[null,"CHIHUAHUA","UUAJ8910286B1","UUAJ891028HCHRRL00","JOEL URTUZUASTEGUI ARZOLA","08DPT0003A",null,null,null,null,null,null,0,260,0,null,null,null,null,null,null,0,260,0,29573]
[null,"CHIHUAHUA","VASM721005K88","VASM721005HCHLRR06","MARIO ALBERTO VALDEZ SIERRA","08DPT0003A",null,null,null,null,null,null,0,117,0,null,null,null,null,null,null,0,117,0,17761.580000000002]
[null,"CHIHUAHUA","VATE6505053PA","VATE650505HCHLRR02","ERNESTO VALLEJO TERRAZAS","08DPT0003A",null,null,null,null,null,null,0,221,0,null,null,null,null,null,null,0,221,0,29105.18]
[null,"CHIHUAHUA","VAGS580921NS3","VAGS580921MCHZRL04","SOLEDAD VAZQUEZ GARCIA","08DPT0003A",null,null,null,null,null,null,0,208,0,null,null,null,null,null,null,0,208,0,27687.200000000001]
[null,"CHIHUAHUA","VASI870422IA8","VASI870422MCHZVS04","ISIS KRYSTAL VAZQUEZ SAENZ","08DPT0003A",null,null,null,null,null,null,0,234,0,null,null,null,null,null,null,0,234,0,30523.1]
[null,"CHIHUAHUA","VEMA770621BW5","VEMA770621MCHLRN02","ANA ISABEL VELAZQUEZ MARTINEZ","08DPT0003A",null,null,null,null,null,null,0,260,0,null,null,null,null,null,null,0,260,0,33359]
[null,"CHIHUAHUA","VEDA870119GY2","VEDA870119MDGRMD03","ADRIANA VERGARA DOMINGUEZ","08DPT0003A",null,null,null,null,null,null,0,195,0,null,null,null,null,null,null,0,195,0,23429.78]
[null,"CHIHUAHUA","VILJ810613D4A","VILJ810613HCHLRR06","JORGE ANTONIO VILLAR LOERA","08DPT0003A",null,null,null,null,null,null,0,234,0,null,null,null,null,null,null,0,234,0,24677.599999999999]
[null,"CHIHUAHUA","VIGR710609UT2","VIGR710609HCHLRF00","RAFAEL VILLEGAS GARCIA","08DPT0003A",null,null,null,null,null,null,0,260,0,null,null,null,null,null,null,0,260,0,33359]
[null,"CHIHUAHUA","AUAC800520NRA","AUAC800520HDGGNS04","CESAR ALEJANDRO AGUILAR ANTUNEZ","08DPT0007X",null,null,null,1,0,0,null,null,null,null,null,null,null,null,null,1,0,0,49802.26]
[null,"CHIHUAHUA","AARJ7003036F2","AARJ700303MCHNMS07","MARÍA DE JESÚS ANAYA RAMÍREZ","08DPT0007X",null,null,null,1,0,0,null,null,null,null,null,null,null,null,null,1,0,0,84086.67]
[null,"CHIHUAHUA","AIEL6711121J4","AIXE671112MCHRXL03","MARÍA ELIZABETTH ARRIETA","08DPT0007X",null,null,null,1,0,0,null,null,null,null,null,null,null,null,null,1,0,0,32272.25]
[null,"CHIHUAHUA","BELH630930M26","BELH630930HCHNNM06","JOSE HUMBERTO BENITEZ LONGORIA","08DPT0007X",null,null,null,1,0,0,null,null,null,null,null,null,null,null,null,1,0,0,53974.67]
[null,"CHIHUAHUA","CAEA740422SF8","CAEA740422MCHBSL02","ALMA SOFIA CABALLERO ESPARZA","08DPT0007X",null,null,null,1,0,0,null,null,null,null,null,null,null,null,null,1,0,0,18759.48]
[null,"CHIHUAHUA","CADE710915BB6","CADE710915MCHRZL02","ELVIRA CARRASCO DIAZ","08DPT0007X",null,null,null,null,null,null,null,null,null,null,null,null,1,0,0,1,0,0,100611.18]
[null,"CHIHUAHUA","CACI7205151S9","CACI720515HOCHRS01","ISIDRO MANUEL CHAVEZ CARRERA","08DPT0007X",null,null,null,1,0,0,null,null,null,null,null,null,null,null,null,1,0,0,79256.84]
[null,"CHIHUAHUA","DEML700812U65","DEML700812MDGLRR03","LAURA DIANA DELGADO MARRERO","08DPT0007X",null,null,null,1,0,0,null,null,null,null,null,null,null,null,null,1,0,0,49874.32]
[null,"CHIHUAHUA","EALJ731221FM3","EALJ731221HSLSRN06","JUAN DE DIOS ESCALANTE LAUREAN","08DPT0007X",null,null,null,1,0,0,null,null,null,null,null,null,null,null,null,1,0,0,46601.46]
[null,"CHIHUAHUA","GAEM680908Q97","GAEC680908MCLLSN03","MA. CONCEPCION GALLARDO ESPARZA","08DPT0007X",null,null,null,1,0,0,null,null,null,null,null,null,null,null,null,1,0,0,37190.71]
[null,"CHIHUAHUA","GADA760726L20","GADA760726MCHRZD02","ADRIANA GARCIA DIAZ","08DPT0007X",null,null,null,1,0,0,null,null,null,null,null,null,null,null,null,1,0,0,51024.06]
[null,"CHIHUAHUA","HEGJ620729F26","HEGJ620729HCHRNV07","JOSE JAVIER HERNANDEZ GONZALEZ","08DPT0007X",null,null,null,1,0,0,null,null,null,null,null,null,null,null,null,1,0,0,77278.259999999995]
[null,"CHIHUAHUA","HEGL611117FN5","HEGL611117MCHRNZ00","LUZ MARIA HERNANDEZ GONZALEZ","08DPT0007X",null,null,null,1,0,0,null,null,null,null,null,null,null,null,null,1,0,0,99010.85]
[null,"CHIHUAHUA","HEPH660312FI8","HEPH660312HCHRRC02","HECTOR HERNANDEZ PEREZ","08DPT0007X",null,null,null,1,0,0,null,null,null,null,null,null,null,null,null,1,0,0,56780.78]
[null,"CHIHUAHUA","LIMR6608162E8","LIMR660816HZSRNY01","RAYMUNDO LIRA MENDOZA","08DPT0007X",null,null,null,1,0,0,null,null,null,null,null,null,null,null,null,1,0,0,128753.35]
[null,"CHIHUAHUA","MASF580311IY9","MASF580311HDGGCR04","FRANCISCO MAGDALENO SAUCEDO","08DPT0007X",null,null,null,1,0,0,null,null,null,null,null,null,null,null,null,1,0,0,81496.479999999996]
[null,"CHIHUAHUA","MARL701010AR4","MARL701010MCLRBD02","LUDIVINA MARTINEZ REBOLLOSO","08DPT0007X",null,null,null,1,0,0,null,null,null,null,null,null,null,null,null,1,0,0,55097.29]
[null,"CHIHUAHUA","MECL790627CP7","MEXC790627MCHJXL02","CLAUDIA FABIOLA MEJIA","08DPT0007X",null,null,null,1,0,0,null,null,null,null,null,null,null,null,null,1,0,0,46980.22]
[null,"CHIHUAHUA","MONM720514D8A","MONM720514HCHRXR04","MARCIAL EZEQUIEL MORALES NUÑEZ","08DPT0007X",null,null,null,1,0,0,null,null,null,null,null,null,null,null,null,1,0,0,113601.31]
[null,"CHIHUAHUA","OIPL750706829","OIPL750706HNTRXS09","LUIS ALBERTO ORTIZ PEÑA","08DPT0007X",null,null,null,1,0,0,null,null,null,null,null,null,null,null,null,1,0,0,71328.179999999993]
[null,"CHIHUAHUA","PECG710113QA8","PECG710113MCHRRB06","GABRIELA PEREZ CRUZ","08DPT0007X",null,null,null,1,0,0,null,null,null,null,null,null,null,null,null,1,0,0,44944.23]
[null,"CHIHUAHUA","ROCS700130LMA","ROCS700130MDGDLL00","SILVIA ESTELA RODRIGUEZ CALVILLO","08DPT0007X",null,null,null,1,0,0,null,null,null,null,null,null,null,null,null,1,0,0,81715.759999999995]
[null,"CHIHUAHUA","ROMA711015CL1","ROMA711015MDFDLN06","ANA LUISA RODRIGUEZ MILAN","08DPT0007X",null,null,null,1,0,0,null,null,null,null,null,null,null,null,null,1,0,0,48664.06]
[null,"CHIHUAHUA","ROQM510228824","ROQR510228MCHGZF19","MARIA DEL REFUGIO ROGERO QUEZADA","08DPT0007X",null,null,null,null,null,null,null,null,null,null,null,null,1,0,0,1,0,0,66459.899999999994]
[null,"CHIHUAHUA","ROME6706013EA","ROME670601MDFJLD04","MARIA EDITH ROJAS MELENDEZ","08DPT0007X",null,null,null,1,0,0,null,null,null,null,null,null,null,null,null,1,0,0,49269.16]
[null,"CHIHUAHUA","SOGC711207N65","SOGC711207MCHTRN06","MARIA CONCEPCION SOTO GUERRERO","08DPT0007X",null,null,null,1,0,0,null,null,null,null,null,null,null,null,null,1,0,0,123667.21]
[null,"CHIHUAHUA","SOHJ7805045P4","SOHJ780504HCHTRS02","JOSE DE JESUS SOTO HERNANDEZ","08DPT0007X",null,null,null,1,0,0,null,null,null,null,null,null,null,null,null,1,0,0,45520.7]
[null,"CHIHUAHUA","ZAVE920703L47","ZAVE920703HCHVLD09","EDGAR ALEJANDRO ZAVALA VALLES","08DPT0007X",null,null,null,1,0,0,null,null,null,null,null,null,null,null,null,1,0,0,31365.78]
[null,"CHIHUAHUA","AAVJ670109VEA","AAVJ670109HVZBLL08","ABSALON VILLEGAS JULIAN MIGUEL","08DPT0007X",null,null,null,null,null,null,0,204,0,null,null,null,null,null,null,0,204,0,26382]
[null,"CHIHUAHUA","AOLJ680721RSA","AOLJ680721MCHCJL09","ACOSTA LUJAN JULIA ROSA","08DPT0007X",null,null,null,null,null,null,0,216,0,null,null,null,null,null,null,0,216,0,27444]
[null,"CHIHUAHUA","AUCI871011KK9","AUCI871011MCHGLL16","AGUIRRE CALDERON ILEANA LIZELDY","08DPT0007X",null,null,null,null,null,null,0,216,0,null,null,null,null,null,null,0,216,0,20583]
[null,"CHIHUAHUA","AEMV850720NG8","AEMV850720MCHLNR03","ALMEIDA MONTES VIRIDIANA","08DPT0007X",null,null,null,null,null,null,0,216,0,null,null,null,null,null,null,0,216,0,24013.5]
[null,"CHIHUAHUA","AAGP8807274Z4","AAGP880727MMCLLB04","ALVARADO GALICIA PABLOVA","08DPT0007X",null,null,null,null,null,null,0,240,0,null,null,null,null,null,null,0,240,0,26835.3]
[null,"CHIHUAHUA","AASJ7104236Z2","AASJ710423HCHLNR06","ALVARADO SANCHEZ JORGE ADRIAN","08DPT0007X",null,null,null,null,null,null,0,240,0,null,null,null,null,null,null,0,240,0,34305]
[null,"CHIHUAHUA","AATG900815VD7","AATG900815MCHLRL09","ALVARADO TARANGO GLORIA YARALDY","08DPT0007X",null,null,null,null,null,null,0,228,0,null,null,null,null,null,null,0,228,0,20871.900000000001]
[null,"CHIHUAHUA","AARP801213GG6","AARP801213HCHVDD14","AVALOS RODARTE PEDRO ALONSO","08DPT0007X",null,null,null,null,null,null,0,216,0,null,null,null,null,null,null,0,216,0,29817]
[null,"CHIHUAHUA","BACJ730108BV7","BACJ730108MDFYRH00","BAYARDO CARVAJAL JAHEL","08DPT0007X",null,null,null,null,null,null,0,192,0,null,null,null,null,null,null,0,192,0,29817]
[null,"CHIHUAHUA","BECI670819Q93","BECI670819HCHLRV03","BELMONTE CARRILLO IVAN","08DPT0007X",null,null,null,null,null,null,0,240,0,null,null,null,null,null,null,0,240,0,32589.780000000002]
[null,"CHIHUAHUA","BEMY780623E38","BEMY780623MCHRRS01","BERUMEN MARTINEZ YESICA","08DPT0007X",null,null,null,null,null,null,0,240,0,null,null,null,null,null,null,0,240,0,20583]
[null,"CHIHUAHUA","BIRG861118GT6","BIRG861118MCHRYR07","BRIONES REYES GEORGINA","08DPT0007X",null,null,null,null,null,null,0,108,0,null,null,null,null,null,null,0,108,0,10552.8]
[null,"CHIHUAHUA","BUEL761105V38","BUEL761105MCHSSR05","BUSTAMANTE ESCOBEDO LAURA ISELA","08DPT0007X",null,null,null,null,null,null,0,240,0,null,null,null,null,null,null,0,240,0,25728.780000000002]
[null,"CHIHUAHUA","CAVM69042817A","CAVM690428HCHBGR00","CABALLERO VEGA MARIO ALBERTO","08DPT0007X",null,null,null,null,null,null,0,120,0,null,null,null,null,null,null,0,120,0,25062.9]
[null,"CHIHUAHUA","CASC9206274E9","CASC920627HCHLNH09","CALDERA SANCHEZ CHRISTIAN ALBERTO","08DPT0007X",null,null,null,null,null,null,0,168,0,null,null,null,null,null,null,0,168,0,16641.3]
[null,"CHIHUAHUA","CAVM6006195R6","CAVM600619HCHLLN01","CALLEROS VILLALOBOS MANUEL ALBERTO ","08DPT0007X",null,null,null,null,null,null,0,240,0,null,null,null,null,null,null,0,240,0,29817]
[null,"CHIHUAHUA","CARV8802245G8","CARV880224MCHHML04","CHACON RAMOS VIOLETA","08DPT0007X",null,null,null,null,null,null,0,204,0,null,null,null,null,null,null,0,204,0,18687.25]
[null,"CHIHUAHUA","CIGJ801220RP4","CIGJ801220HCHSRL09","CISNEROS GARCIA JULIO ALBERTO","08DPT0007X",null,null,null,null,null,null,0,240,0,null,null,null,null,null,null,0,240,0,34305]
[null,"CHIHUAHUA","DIAA860226874","DIAA860226MSRZGN04","DIAZ AGUILAR ANA FABIOLA","08DPT0007X",null,null,null,null,null,null,0,228,0,null,null,null,null,null,null,0,228,0,20583]
[null,"CHIHUAHUA","DOBG610203LR2","DOBG610203HCHMRL02","DOMINGUEZ BARAY GILBERTO","08DPT0007X",null,null,null,null,null,null,0,204,0,null,null,null,null,null,null,0,204,0,34305]
[null,"CHIHUAHUA","DOGC9306184A4","DOGC930618HCHMNR04","DOMINGUEZ GONZALEZ CARLOS RODRIGO","08DPT0007X",null,null,null,null,null,null,0,144,0,null,null,null,null,null,null,0,144,0,15829.2]
[null,"CHIHUAHUA","EADJ860902I17","EADJ860902HCHSZV01","ESPARZA DIAZ JAVIER EDUARDO","08DPT0007X",null,null,null,null,null,null,0,240,0,null,null,null,null,null,null,0,240,0,25728.780000000002]
[null,"CHIHUAHUA","EACL8412183L3","EACL841218MCHSRR08","ESTRADA CARRILLO LAURA VERONICA","08DPT0007X",null,null,null,null,null,null,0,240,0,null,null,null,null,null,null,0,240,0,20583]
[null,"CHIHUAHUA","EAHJ881022RT6","EAHJ881022HCHSRQ05","ESTRADA HERNANDEZ JOAQUIN JOEL","08DPT0007X",null,null,null,null,null,null,0,120,0,null,null,null,null,null,null,0,120,0,34305]
[null,"CHIHUAHUA","CARF8005231E2","CARF800523HCHRVD08","ESTRADA SALAYANDIA JOSE ANGEL","08DPT0007X",null,null,null,null,null,null,0,192,0,null,null,null,null,null,null,0,192,0,14683.5]
[null,"CHIHUAHUA","FOCG620409LQ0","FOCG620409HDGLHN03","FLORES CHACON GONZALO","08DPT0007X",null,null,null,null,null,null,0,180,0,null,null,null,null,null,null,0,180,0,29817]
[null,"CHIHUAHUA","GAEH711103S52","GAEH711103HCHBNC07","GABALDON ENRÍQUEZ HECTOR GERARDO                  ","08DPT0007X",null,null,null,null,null,null,0,168,0,null,null,null,null,null,null,0,168,0,22298.280000000002]
[null,"CHIHUAHUA","GAJE670908MV9","GAJE670908HDGLRV06","GALVAN JUAREZ EVARISTO","08DPT0007X",null,null,null,null,null,null,0,240,0,null,null,null,null,null,null,0,240,0,29817]
[null,"CHIHUAHUA","GAMY7604228L5","GAMY760422MDGLXL00","GALVAN MUÑOZ YOLANDA ALEJANDRA","08DPT0007X",null,null,null,null,null,null,0,240,0,null,null,null,null,null,null,0,240,0,25728.780000000002]
[null,"CHIHUAHUA","GAOR861127BG3","GAOR861127MCHMNQ19","GAMBOA ONTIVEROS RAQUEL","08DPT0007X",null,null,null,null,null,null,0,240,0,null,null,null,null,null,null,0,240,0,34305]
[null,"CHIHUAHUA","GAAN631226D5A","GAAN631226MCHNNR03","GANDARA ANGUIANO NORMA","08DPT0007X",null,null,null,null,null,null,0,240,0,null,null,null,null,null,null,0,240,0,13417.680000000002]
[null,"CHIHUAHUA","GARA6105276N5","GARA610527HCHRZL00","GARAY RUIZ JOSE ALFONSO","08DPT0007X",null,null,null,null,null,null,0,228,0,null,null,null,null,null,null,0,228,0,34305]
[null,"CHIHUAHUA","GOTD6910121D1","GOTD691012MCHMVY06","GOMEZ TAVARES DEYANIRA","08DPT0007X",null,null,null,null,null,null,0,228,0,null,null,null,null,null,null,0,228,0,20583]
[null,"CHIHUAHUA","GOGG8703244X4","GOGG870324MCHNNB07","GONZALEZ GANDARA GABRIELA ALEJANDRA","08DPT0007X",null,null,null,null,null,null,0,216,0,null,null,null,null,null,null,0,216,0,17620.2]
[null,"CHIHUAHUA","GONM640214JC7","GONM640214HJCNVG03","GONZÁLEZ NAVA MIGUEL","08DPT0007X",null,null,null,null,null,null,0,216,0,null,null,null,null,null,null,0,216,0,23743.8]
[null,"CHIHUAHUA","HEPR900403KQ2","HEPR900403HCHRRC03","HERNANDEZ PEREZ RICARDO","08DPT0007X",null,null,null,null,null,null,0,228,0,null,null,null,null,null,null,0,228,0,20583]
[null,"CHIHUAHUA","HEMA6604046K4","HEMA660404HCHRXN05","HERRERA MUÑOZ JOSE ANGEL","08DPT0007X",null,null,null,null,null,null,0,240,0,null,null,null,null,null,null,0,240,0,34305]
[null,"CHIHUAHUA","HEOS840726F25","HEOS840726HCHRGR06","HERRERA OGAZ SERGIO ARTURO","08DPT0007X",null,null,null,null,null,null,0,240,0,null,null,null,null,null,null,0,240,0,29817]
[null,"CHIHUAHUA","HOAG621120KT8","HOAG621120MCHLVB08","HOLGUIN AVILA GABRIELA ALEJANDRA","08DPT0007X",null,null,null,null,null,null,0,216,0,null,null,null,null,null,null,0,216,0,26835.3]
[null,"CHIHUAHUA","LOHA840518CS8","LOHA840518HCHPRL07","LOPEZ HERNANDEZ ALBERTO","08DPT0007X",null,null,null,null,null,null,0,216,0,null,null,null,null,null,null,0,216,0,29817]
[null,"CHIHUAHUA","MAVA850717159","MAVA850717MCHCLL06","MACÍAS VELAZQUEZ ALEJANDRA","08DPT0007X",null,null,null,null,null,null,0,240,0,null,null,null,null,null,null,0,240,0,18867.780000000002]
[null,"CHIHUAHUA","MAER720708DH1","MAXE720708MCHNXR00","MANCHA ERIKA SELENE","08DPT0007X",null,null,null,null,null,null,0,180,0,null,null,null,null,null,null,0,180,0,27444]
[null,"CHIHUAHUA","MAOD8107099T0","MAOD810709HCHRLN01","MARQUEZ OLIVAS DANIEL ANTONIO","08DPT0007X",null,null,null,null,null,null,0,228,0,null,null,null,null,null,null,0,228,0,25062.9]
[null,"CHIHUAHUA","MARS830130RA7","MARS830130HCHRVR05","MARTINEZ RIVERA SERGIO ALONSO","08DPT0007X",null,null,null,null,null,null,0,204,0,null,null,null,null,null,null,0,204,0,14908.5]
[null,"CHIHUAHUA","MALA850527KR1","MALA850527HTLTCN04","MATUS LECOURTOIS ANDRES ISAAC","08DPT0007X",null,null,null,null,null,null,0,216,0,null,null,null,null,null,null,0,216,0,19786.5]
[null,"CHIHUAHUA","MESO501218RY9","MESO501218HJCNLS04","MENDOZA SALAS OSCAR  IGNAC IO","08DPT0007X",null,null,null,null,null,null,0,180,0,null,null,null,null,null,null,0,180,0,25728.780000000002]
[null,"CHIHUAHUA","MESB8507159W0","MESB850715HCHNRN00","MENDOZA SORIANO BENJAMIN ALEJANDRO","08DPT0007X",null,null,null,null,null,null,0,240,0,null,null,null,null,null,null,0,240,0,34305]
[null,"CHIHUAHUA","MOAJ681102IQ0","MOAJ681102HCHNGS07","MONTES AGUILAR JESUS GERARDO","08DPT0007X",null,null,null,null,null,null,0,204,0,null,null,null,null,null,null,0,204,0,23743.8]
[null,"CHIHUAHUA","MOMM791027B8A","MOMM791027MCHRRY08","MORALES MORENO MAYRA MARGARITA","08DPT0007X",null,null,null,null,null,null,0,228,0,null,null,null,null,null,null,0,228,0,29159.280000000002]
[null,"CHIHUAHUA","OEPH7911267A5","OEPH791126HCHRNC09","ORNELAS DEL PINO HECTOR RICARDO","08DPT0007X",null,null,null,null,null,null,0,216,0,null,null,null,null,null,null,0,216,0,29817]
[null,"CHIHUAHUA","OIGA8509273I1","OIGA850927HCHRTL04","ORTIZ GUTIERREZ JOSE ALBERTO","08DPT0007X",null,null,null,null,null,null,0,180,0,null,null,null,null,null,null,0,180,0,11926.8]
[null,"CHIHUAHUA","PEME750130UP9","PEME750130HCHRRR00","PEREZ MARTINEZ ERICK DAVID","08DPT0007X",null,null,null,null,null,null,0,216,0,null,null,null,null,null,null,0,216,0,26835.3]
[null,"CHIHUAHUA","PERL8208024K1","PERL820802MCHRMR03","PEREZ RAMOS LAURA ANGELICA","08DPT0007X",null,null,null,null,null,null,0,180,0,null,null,null,null,null,null,0,180,0,30874.5]
[null,"CHIHUAHUA","PESD840502CP3","PESD840502HCHRCG00","PEREZ SAUCEDO DIEGO ALEJANDRO","08DPT0007X",null,null,null,null,null,null,0,180,0,null,null,null,null,null,null,0,180,0,19786.5]
[null,"CHIHUAHUA","POMJ860826TB2","POMJ860826HCHRDN05","PORRAS MEDINA JUAN CARLOS","08DPT0007X",null,null,null,null,null,null,0,216,0,null,null,null,null,null,null,0,216,0,28326.179999999997]
[null,"CHIHUAHUA","RIBG810102KB8","RIBG810102MCHVRR02","RIVAS BARRAGAN GRACIELA","08DPT0007X",null,null,null,null,null,null,0,168,0,null,null,null,null,null,null,0,168,0,29817]
[null,"CHIHUAHUA","ROMP8008014S4","ROMP800801MCSBZT07","ROBLERO MAZARIEGOS PATRICIA","08DPT0007X",null,null,null,null,null,null,0,240,0,null,null,null,null,null,null,0,240,0,15437.280000000002]
[null,"CHIHUAHUA","ROCG680807P47","ROCG680807MCLLSR09","ROLDAN CASTILLO GRISELDA","08DPT0007X",null,null,null,null,null,null,0,168,0,null,null,null,null,null,null,0,168,0,19381.079999999998]
[null,"CHIHUAHUA","ROMM911224P47","ROMM911224HCHSNR07","ROSALES MENDOZA MARIO","08DPT0007X",null,null,null,null,null,null,0,180,0,null,null,null,null,null,null,0,180,0,18467.400000000001]
[null,"CHIHUAHUA","RUGA7605108F9","RUGA760510MCHVTN01","RUVALCABA GUTIERREZ MARIA ANTONIETA","08DPT0007X",null,null,null,null,null,null,0,216,0,null,null,null,null,null,null,0,216,0,11926.8]
[null,"CHIHUAHUA","SASE940502AY3","SASE940502HCHLLD03","SALAZAR SILVA EDGAR OVED","08DPT0007X",null,null,null,null,null,null,0,132,0,null,null,null,null,null,null,0,132,0,9233.7000000000007]
[null,"CHIHUAHUA","SAMD9405148N8","SAMD940514HCHLNN04","SALCEDO MONRREAL DANIEL","08DPT0007X",null,null,null,null,null,null,0,240,0,null,null,null,null,null,null,0,240,0,14683.5]
[null,"CHIHUAHUA","SAFA580219G58","SAFA580219HVZMLL08","SAMARIO FLORES ALVARO","08DPT0007X",null,null,null,null,null,null,0,216,0,null,null,null,null,null,null,0,216,0,34305]
[null,"CHIHUAHUA","SAOA880909JJ6","SAOA880909HOCMSL00","SAMARIO OSORIO ALVARO OSCAR","08DPT0007X",null,null,null,null,null,null,0,204,0,null,null,null,null,null,null,0,204,0,25062.9]
[null,"CHIHUAHUA","SAEO910403QK8","SAEO910403HNLNSS08","SANCHEZ ESTRADA OSCAR IVAN","08DPT0007X",null,null,null,null,null,null,0,240,0,null,null,null,null,null,null,0,240,0,26382]
[null,"CHIHUAHUA","SEEI760505188","SAOA880909HOCMSL00","SERRATOS ESPARZA ILSE","08DPT0007X",null,null,null,null,null,null,0,192,0,null,null,null,null,null,null,0,192,0,29817]
[null,"CHIHUAHUA","SOSF8907289K0","SOSF890728HSLLNR00","SOLIS SANCHEZ FRANK ALEXIS","08DPT0007X",null,null,null,null,null,null,0,204,0,null,null,null,null,null,null,0,204,0,22424.7]
[null,"CHIHUAHUA","TAVY911105KV5","TAVI911105MCHGNS05","TAGLE VENZOR YASSMIN","08DPT0007X",null,null,null,null,null,null,0,228,0,null,null,null,null,null,null,0,228,0,29817]
[null,"CHIHUAHUA","TENA800305KZ2","TENA800305HCHJVN00","TEJADA NEVAREZ ANGEL ADRIAN","08DPT0007X",null,null,null,null,null,null,0,228,0,null,null,null,null,null,null,0,228,0,29817]
[null,"CHIHUAHUA","TORE8012234Y9","TORE801223HNTPYD08","TOPETE REYES EDGAR","08DPT0007X",null,null,null,null,null,null,0,120,0,null,null,null,null,null,null,0,120,0,20583]
[null,"CHIHUAHUA","TOCJ650407CT0","TOCJ650407HVZRNS07","TORRES CANTERO JOSE","08DPT0007X",null,null,null,null,null,null,0,240,0,null,null,null,null,null,null,0,240,0,34305]
[null,"CHIHUAHUA","TORN791114PY6","TORN791114MCHRYD07","TORRES REY NADIA MARIA","08DPT0007X",null,null,null,null,null,null,0,192,0,null,null,null,null,null,null,0,192,0,26835.3]
[null,"CHIHUAHUA","UUAR860131EV3","UUAR860131HCHRRF06","URTUZUASTEGUI ARZOLA RAFAEL","08DPT0007X",null,null,null,null,null,null,0,240,0,null,null,null,null,null,null,0,240,0,34305]
[null,"CHIHUAHUA","VAAF840608FK3","VAAF840608HCHZCR03","VAZQUEZ ACEVEDO FERNANDO","08DPT0007X",null,null,null,null,null,null,0,228,0,null,null,null,null,null,null,0,228,0,29817]
[null,"CHIHUAHUA","VIAS640217RZ1","VIAS640217HCHLGL08","VILLALOBOS AGUIRRE SAUL","08DPT0007X",null,null,null,null,null,null,0,228,0,null,null,null,null,null,null,0,228,0,28326.179999999997]
[null,"CHIHUAHUA","VIGR720403880","VIGR720403HVZLBC14","VILLARAUZ GABINO RICARDO","08DPT0007X",null,null,null,null,null,null,0,216,0,null,null,null,null,null,null,0,216,0,29159.280000000002]
[null,"CHIHUAHUA","AUED570608MR1","AUED570608HZSGSN08","DANIEL AGUILAR ESPARZA","08DPT0008W",null,null,null,1,0,0,null,null,null,null,null,null,null,null,null,1,0,0,48493.66]
[null,"CHIHUAHUA","BESJ800501RQ3","BESJ800501HCLRLL06","JULIO CESAR BERNAL SALAS","08DPT0008W",null,null,null,1,0,0,null,null,null,null,null,null,null,null,null,1,0,0,69514.94]
[null,"CHIHUAHUA","EOCA6608284C4","EOCA660828HCHSRG02","ESCOBAR CERVANTES AGUSTIN","08DPT0008W",null,null,null,1,0,0,null,null,null,null,null,null,null,null,null,1,0,0,32880.230000000003]
[null,"CHIHUAHUA","EOHE660901TLA","EOHE660901MCHSLV04","EVA MARIA ESCOBAR HOLGUIN","08DPT0008W",null,null,null,1,0,0,null,null,null,null,null,null,null,null,null,1,0,0,44497.21]
[null,"CHIHUAHUA","HEGA690525I40","HEGA690525MCHRRL02","ALICIA HERNANDEZ GARCIA","08DPT0008W",null,null,null,1,0,0,null,null,null,null,null,null,null,null,null,1,0,0,44957.93]
[null,"CHIHUAHUA","HEGE6610076V0","HEGE661007MSIRLG06","MARIA EUGENIA HERRERA  GOLARTE","08DPT0008W",null,null,null,1,0,0,null,null,null,null,null,null,null,null,null,1,0,0,107402.38]
[null,"CHIHUAHUA","MAVM680815AT6","MAVM680815HCHRLR01","MARIO ALBERTO MARTINEZ VILLELA","08DPT0008W",null,null,null,1,0,0,null,null,null,null,null,null,null,null,null,1,0,0,106817.64]
[null,"CHIHUAHUA","ROAC671104HB5","MALM890515HCHTCR05","MARIO ALBERTO MATA LICON","08DPT0008W",null,null,null,null,null,null,null,null,null,null,null,null,1,0,0,1,0,0,85992.48]
[null,"CHIHUAHUA","MEMF660302UM0","MEMF660302HCHNLD06","FEDERICO MENDOZA MOLINAR","08DPT0008W",null,null,null,1,0,0,null,null,null,null,null,null,null,null,null,1,0,0,50829.7]
[null,"CHIHUAHUA","MOAG600916JW6","MOAG600916HCHYCL04","MOY ACOSTA GUILLERMO","08DPT0008W",null,null,null,null,null,null,null,null,null,null,null,null,1,0,0,1,0,0,66459.899999999994]
[null,"CHIHUAHUA","OOVM6504302T1","OOVM650430HCHRLS07","MOISES OROZCO VALDEZ","08DPT0008W",null,null,null,1,0,0,null,null,null,null,null,null,null,null,null,1,0,0,52313.7]
[null,"CHIHUAHUA","PANA720117JW4","PANA720117HDGLVN01","ANTONIO PALMA NEVAREZ","08DPT0008W",null,null,null,1,0,0,null,null,null,null,null,null,null,null,null,1,0,0,43819.41]
[null,"CHIHUAHUA","PAHA640330KP3","PAHA640330MCHYLR06","ARMIDA IRENE PAYAN HOLGUIN","08DPT0008W",null,null,null,1,0,0,null,null,null,null,null,null,null,null,null,1,0,0,125820.53]
[null,"CHIHUAHUA","POAJ710301PK6","POAJ710301MCHRLS06","MARIA DE JESUS PORTILLO ALARCON","08DPT0008W",null,null,null,1,0,0,null,null,null,null,null,null,null,null,null,1,0,0,33991.599999999999]
[null,"CHIHUAHUA","RIGR710129FB6","RIGR710129MCHVRQ06","RAQUEL ERENDIRA RIVERA GARCIA","08DPT0008W",null,null,null,1,0,0,null,null,null,null,null,null,null,null,null,1,0,0,47306.17]
[null,"CHIHUAHUA","SAMY750404ND1","SAML750404MCHNXZ07","SAENZ MUNOZ LUZ MARIA","08DPT0008W",null,null,null,1,0,0,null,null,null,null,null,null,null,null,null,1,0,0,28686.11]
[null,"CHIHUAHUA","SADE650818IV1","SADE650818MCHLRL09","MARIA ELENA SALAZAR DUARTE","08DPT0008W",null,null,null,1,0,0,null,null,null,null,null,null,null,null,null,1,0,0,44957.93]
[null,"CHIHUAHUA","TAHJ7109304KA","TAHJ710930HCHRLV01","JAVIER EUSEBIO TARANGO HOLGUIN","08DPT0008W",null,null,null,1,0,0,null,null,null,null,null,null,null,null,null,1,0,0,107997.64]
[null,"CHIHUAHUA","VARJ610925H36","VARJ610925HCHLSS00","JESUS ANTONIO VALDEZ ROSALES","08DPT0008W",null,null,null,1,0,0,null,null,null,null,null,null,null,null,null,1,0,0,39458.6]
[null,"CHIHUAHUA","VEGR750904UR2","VEGR750904MCHLRS06","ROSALIA MARGARITA VELARDE GARCIA","08DPT0008W",null,null,null,1,0,0,null,null,null,null,null,null,null,null,null,1,0,0,69514.94]
[null,"CHIHUAHUA","VARO691222JA8","VAXR691222MCHLXS07","ROSA MARIA VALENZUELA","08DPT0008W",null,null,null,null,null,null,0,216,0,null,null,null,null,null,null,0,216,0,25523.1]
[null,"CHIHUAHUA","AUMM780328A31","AUMM780328MCHGLN09","MINERVA AGUILAR MOLINAR","08DPT0008W",null,null,null,null,null,null,0,240,0,null,null,null,null,null,null,0,240,0,28359]
[null,"CHIHUAHUA","AEGL800105RF6","AEGL800105MCHLNZ06","LIZETTE JOHANNA ALEJANDRO GONZALEZ","08DPT0008W",null,null,null,null,null,null,0,228,0,null,null,null,null,null,null,0,228,0,26941.08]
[null,"CHIHUAHUA","AAGJ670423U8A","AAGJ670423HCHMNR05","JORGE AMPARAN GONZALEZ","08DPT0008W",null,null,null,null,null,null,0,240,0,null,null,null,null,null,null,0,240,0,28359]
[null,"CHIHUAHUA","AESS721002N67","AESS721002MCHRTS00","SUSANA ARMENDARIZ SOTO","08DPT0008W",null,null,null,null,null,null,0,240,0,null,null,null,null,null,null,0,240,0,24573]
[null,"CHIHUAHUA","BAVM821203FN0","BAVM821203MCHRLN06","MONICA LOURDES BARRAZA VILLALOBOS","08DPT0008W",null,null,null,null,null,null,0,228,0,null,null,null,null,null,null,0,228,0,26941.08]
[null,"CHIHUAHUA","CAVS820702FV1","CAVS820702MCHRRN01","SANDRA ELIZABETH CARDENAS VARGAS","08DPT0008W",null,null,null,null,null,null,0,216,0,null,null,null,null,null,null,0,216,0,22115.7]
[null,"CHIHUAHUA","ROMJ731201675","CANA840815MCHRVN00","ANA ISABEL CARREON NAVA","08DPT0008W",null,null,null,null,null,null,0,228,0,null,null,null,null,null,null,0,228,0,20770.8]
[null,"CHIHUAHUA","MUMP8911284K8","COMR940524HCHNRD00","CONTRERAS MARTINEZ RODOLFO","08DPT0008W",null,null,null,null,null,null,0,168,0,null,null,null,null,null,null,0,168,0,15304.8]
[null,"CHIHUAHUA","COFA750408JB9","COFA750408MCHRRZ08","AZUCENA CORRAL FRANCO","08DPT0008W",null,null,null,null,null,null,0,160,0,null,null,null,null,null,null,0,160,0,24573]
[null,"CHIHUAHUA","DIHL770620B93","DIHL770620MCHZRZ06","LUZ IMELDA DIAZ HERNANDEZ","08DPT0008W",null,null,null,null,null,null,0,240,0,null,null,null,null,null,null,0,240,0,28359]
[null,"CHIHUAHUA","GASJ850822GF7","GASJ850822HCHLNS04","JOSE GALVEZ SANTANA","08DPT0008W",null,null,null,null,null,null,0,228,0,null,null,null,null,null,null,0,228,0,26941.08]
[null,"CHIHUAHUA","GAFM7309188R8","GASA810331MCHRRD08","ADRIANA GARDEA SERRANO","08DPT0008W",null,null,null,null,null,null,0,240,0,null,null,null,null,null,null,0,240,0,21864]
[null,"CHIHUAHUA","GULM750313628","GULM750313HCHLNN08","MANUEL ALEJANDRO GULLEN LUNA","08DPT0008W",null,null,null,null,null,null,0,228,0,null,null,null,null,null,null,0,228,0,26941.08]
[null,"CHIHUAHUA","HEAJ8610295N1","HEAJ861029HCHRCN09","JUAN CARLOS HERNANDEZ ACOSTA ","08DPT0008W",null,null,null,null,null,null,0,240,0,null,null,null,null,null,null,0,240,0,28359]
[null,"CHIHUAHUA","HEGE760311918","HEGE760311HCHRTF05","EFRAIN ARTURO HERNANDEZ GUTIERREZ","08DPT0008W",null,null,null,null,null,null,0,204,0,null,null,null,null,null,null,0,204,0,13662.9]
[null,"CHIHUAHUA","MAML7703077T7","MALM770307MCHCRS01","LESSLEY MYRLEE MACIAS MARTINEZ","08DPT0008W",null,null,null,null,null,null,0,216,0,null,null,null,null,null,null,0,216,0,25523.1]
[null,"CHIHUAHUA","MAEJ690219AK2","MAEJ690219HCHRSS06","JESUS MARTINEZ ESPARZA","08DPT0008W",null,null,null,null,null,null,0,204,0,null,null,null,null,null,null,0,204,0,24105.18]
[null,"CHIHUAHUA","MECO5508271G3","MECO550827MSLXSL09","MEXIA CASTRO OLGA PATRICIA","08DPT0008W",null,null,null,null,null,null,0,240,0,null,null,null,null,null,null,0,240,0,28359]
[null,"CHIHUAHUA","MOGE730414EA4","MOGE730414HCHRRL09","MORENO GARCIA ELISEO","08DPT0008W",null,null,null,null,null,null,0,216,0,null,null,null,null,null,null,0,216,0,19677.599999999999]
[null,"CHIHUAHUA","MUMP8911284K8","MUMP891128HCHXXS06","PASCUAL ABRAHAM MUÑOZ MUÑOZ","08DPT0008W",null,null,null,null,null,null,0,240,0,null,null,null,null,null,null,0,240,0,21864]
[null,"CHIHUAHUA","NAHJ790815BF0","NAHJ790815HCHVRS00","JESUS MIGUEL NAVARRO HERNANDEZ","08DPT0008W",null,null,null,null,null,null,0,240,0,null,null,null,null,null,null,0,240,0,21864]
[null,"CHIHUAHUA","OIGM890424GJ4","OIGM890424MCHLRR06","MARTA ALEJANDRA OLIVAS GUERRERO","08DPT0008W",null,null,null,null,null,null,0,228,0,null,null,null,null,null,null,0,228,0,26941.08]
[null,"CHIHUAHUA","OINS5902223YA","OINS590222HMNLXL02","OLIVO NUÑEZ JOSE SALVADOR","08DPT0008W",null,null,null,null,null,null,0,240,0,null,null,null,null,null,null,0,240,0,28595.33]
[null,"CHIHUAHUA","PAVF6602076Y9","PAVF660207MCHLRL06","PALMA VARGAS FLOR","08DPT0008W",null,null,null,null,null,null,0,180,0,null,null,null,null,null,null,0,180,0,16398]
[null,"CHIHUAHUA","GORS7911246K4","PAVF661205HCHTRC01","PATENA FIERRO VICTOR MANUEL","08DPT0008W",null,null,null,null,null,null,0,216,0,null,null,null,null,null,null,0,216,0,22115.7]
[null,"CHIHUAHUA","RERP770809FK9","RERP770809HCHDDD04","PEDRO OSWALDO REDE RODRIGUEZ","08DPT0008W",null,null,null,null,null,null,0,240,0,null,null,null,null,null,null,0,240,0,28359]
[null,"CHIHUAHUA","REVY780409NT1","REVY780409MCHYLZ05","YASMIN LISSET REYES VALLES","08DPT0008W",null,null,null,null,null,null,0,216,0,null,null,null,null,null,null,0,216,0,22115.7]
[null,"CHIHUAHUA","RIGJ610311956","RIGJ610311HDFVRL08","JOEL RAUL RIVAS GARCIA","08DPT0008W",null,null,null,null,null,null,0,216,0,null,null,null,null,null,null,0,216,0,22115.7]
[null,"CHIHUAHUA","ROGR680108PWA","ROGR680108HCHDRC09","RICARDO RODRIGUEZ GARCIA","08DPT0008W",null,null,null,null,null,null,0,240,0,null,null,null,null,null,null,0,240,0,28359]
[null,"CHIHUAHUA","RORF881013FI1","RORF881013MCHDBT02","FATIMA RODRIGUEZ ROBLES","08DPT0008W",null,null,null,null,null,null,0,228,0,null,null,null,null,null,null,0,228,0,23344.38]
[null,"CHIHUAHUA","SADR840831726","SADR840831HCHNZM02","RAMON AGUSTO SANCHEZ DIAZ","08DPT0008W",null,null,null,null,null,null,0,120,0,null,null,null,null,null,null,0,120,0,14179.5]
[null,"CHIHUAHUA","SARJ650111CB4","SARJ650111HCHNVM05","JAIME SANCHEZ RIVERA","08DPT0008W",null,null,null,null,null,null,0,120,0,null,null,null,null,null,null,0,120,0,14179.5]
[null,"CHIHUAHUA","VAVS740521TK5","VAVS740521HCHLLL09","SAUL ARMANDO VALLES VALLE","08DPT0008W",null,null,null,null,null,null,0,120,0,null,null,null,null,null,null,0,120,0,14180.1]
[null,"CHIHUAHUA","VICG5002047Q6","VICG500204HCHTRL01","GILBERTO FELICIANO VITELA CARRASCO","08DPT0008W",null,null,null,null,null,null,0,216,0,null,null,null,null,null,null,0,216,0,25523.1]
[null,"CHIHUAHUA","CAMC8511068L5","CAMC851106MCHRRR00","CARMEN IVONNE CARMONA MURILLO","08DPT0012I",null,null,null,1,0,0,null,null,null,null,null,null,null,null,null,1,0,0,29102.82]
[null,"CHIHUAHUA","CATJ640415MG5","CATJ640415HCHHRN06","JUAN ANTONIO CHAVEZ TERRAZAS","08DPT0012I",null,null,null,1,0,0,null,null,null,null,null,null,null,null,null,1,0,0,122743.15]
[null,"CHIHUAHUA","COVC830703U30","COVC830703MCHRZY01","CYNTHIA ROSARIO CORONADO VAZQUEZ","08DPT0012I",null,null,null,1,0,0,null,null,null,null,null,null,null,null,null,1,0,0,89368.86]
[null,"CHIHUAHUA","EIRL670407TS6","EIRL670407MCHNDT08","LETICIA ENRIQUEZ RODRIGUEZ","08DPT0012I",null,null,null,1,0,0,null,null,null,null,null,null,null,null,null,1,0,0,125150.95]
[null,"CHIHUAHUA","GACI7107098NA","GACI710709MCHRRM01","IMELDA IVONE GARCIA CARMONA","08DPT0012I",null,null,null,1,0,0,null,null,null,null,null,null,null,null,null,1,0,0,51266.209999999992]
[null,"CHIHUAHUA","GOMB690116428","GOMB690116MCHNRL02","BELIA LORENA GONZALEZ  MORENO","08DPT0012I",null,null,null,1,0,0,null,null,null,null,null,null,null,null,null,1,0,0,42481.22]
[null,"CHIHUAHUA","IAMM880831RY4","IAMM880831MCHZRR03","MAR ELISA IZAGUIRRE MARTINEZ","08DPT0012I",null,null,null,1,0,0,null,null,null,null,null,null,null,null,null,1,0,0,36642.19]
[null,"CHIHUAHUA","LECG700827GY1","LECG700827MCHCHL00","GLORIA A LECHUGA CHAVEZ","08DPT0012I",null,null,null,1,0,0,null,null,null,null,null,null,null,null,null,1,0,0,79047.649999999994]
[null,"CHIHUAHUA","LOLJ670723J90","LOLJ670723HCHPZV05","JAVIER LOPEZ LOZANO","08DPT0012I",null,null,null,1,0,0,null,null,null,null,null,null,null,null,null,1,0,0,27922.82]
[null,"CHIHUAHUA","MAAS821018113","MAAS821018HCHRNG05","SIGIFREDO MARQUEZ ANCHONDO","08DPT0012I",null,null,null,1,0,0,null,null,null,null,null,null,null,null,null,1,0,0,40876.230000000003]
[null,"CHIHUAHUA","MAQS651014TH4","MAQS651014HCHRNL03","SAUL MARQUEZ QUINTANA","08DPT0012I",null,null,null,1,0,0,null,null,null,null,null,null,null,null,null,1,0,0,32847.839999999997]
[null,"CHIHUAHUA","PEDR620906HG6","PEDR620906HCHRMM07","RAMON JAVIER PEREZ DOMINGUEZ","08DPT0012I",null,null,null,null,null,null,null,null,null,null,null,null,1,0,0,1,0,0,85992.48]
[null,"CHIHUAHUA","ROCR700830F58","ROCR700830HCHDNC08","RICARDO ANTELMO RODRIGUEZ CANO","08DPT0012I",null,null,null,1,0,0,null,null,null,null,null,null,null,null,null,1,0,0,37613.01]
[null,"CHIHUAHUA","ROTF760823LY5","ROTF760823MCHDRL03","FLOR GUADALUPE RODRIGUEZ TREJO","08DPT0012I",null,null,null,1,0,0,null,null,null,null,null,null,null,null,null,1,0,0,40565.329999999994]
[null,"CHIHUAHUA","SOMD561124TEA","SOMD561124HCHTDV09","DAVID SOTELO MEDRANO","08DPT0012I",null,null,null,1,0,0,null,null,null,null,null,null,null,null,null,1,0,0,44840.69]
[null,"CHIHUAHUA","TERL781019J60","TERL781019HCHNDS08","LUIS CARLOS TENA RODELAS","08DPT0012I",null,null,null,1,0,0,null,null,null,null,null,null,null,null,null,1,0,0,41325.800000000003]
[null,"CHIHUAHUA","UIST6008045JA","UIST600804HDGRMM07","TOMAS URBINA SIMENTAL","08DPT0012I",null,null,null,1,0,0,null,null,null,null,null,null,null,null,null,1,0,0,48007.009999999995]
[null,"CHIHUAHUA","VAGA800112LSA","VAGA800112HCHLTL07","ALBERTO VALENZUELA GUTIERREZ","08DPT0012I",null,null,null,1,0,0,null,null,null,null,null,null,null,null,null,1,0,0,30100.23]
[null,"CHIHUAHUA","VIMD590726DU0","VIMD590726HCHLRN05","DONACIANO VILLALOBOS MORENO","08DPT0012I",null,null,null,1,0,0,null,null,null,null,null,null,null,null,null,1,0,0,121150.56]
[null,"CHIHUAHUA","AARP7710257KA","AARP771025MCHLZL02","PALMA LILIANA ALMANZA RUIZ","08DPT0012I",null,null,null,null,null,null,0,168,0,null,null,null,null,null,null,0,168,0,19851.3]
[null,"CHIHUAHUA","AAOG811026Q47","AAOG811026MCHRRB02","GABRIELA MARIA ARAGON ORTIZ","08DPT0012I",null,null,null,null,null,null,0,240,0,null,null,null,null,null,null,0,240,0,24573]
[null,"CHIHUAHUA","CARE8810091J2","CARE881009HCHRMD08","EDGAR ENRIQUE CARREON RAMOS","08DPT0012I",null,null,null,null,null,null,0,216,0,null,null,null,null,null,null,0,216,0,25523.1]
[null,"CHIHUAHUA","CACP850903KT2","CACP850903MCHHHR00","PERLA JAZMIN CHAIREZ CHACON","08DPT0012I",null,null,null,null,null,null,0,204,0,null,null,null,null,null,null,0,204,0,24105.18]
[null,"CHIHUAHUA","CAJG690110UD1","CAJG690110HCHHRN00","GONZALO CHAVEZ JUAREZ","08DPT0012I",null,null,null,null,null,null,0,240,0,null,null,null,null,null,null,0,240,0,28359]
[null,"CHIHUAHUA","CAMN760505UE4","CAMN760505MCHHNN03","NANCY LORENA CHAVEZ MONCADA","08DPT0012I",null,null,null,null,null,null,0,192,0,null,null,null,null,null,null,0,192,0,22687.200000000001]
[null,"CHIHUAHUA","PEMC8412061M5","PEMC841206HCHXRR02","CARLOS DE LA PEÑA MERAZ","08DPT0012I",null,null,null,null,null,null,0,240,0,null,null,null,null,null,null,0,240,0,24105.18]
[null,"CHIHUAHUA","DOCE610806AJ3","DOCE610806MCHMMS03","ESPERANZA DOMINGUEZ CAMUÑEZ","08DPT0012I",null,null,null,null,null,null,0,216,0,null,null,null,null,null,null,0,216,0,19677.599999999999]
[null,"CHIHUAHUA","DOCA7712105BA","DOCA771210HCHMSL05","ALVARO DOMINGUEZ CASARES","08DPT0012I",null,null,null,null,null,null,0,228,0,null,null,null,null,null,null,0,228,0,20770.8]
[null,"CHIHUAHUA","DOTW8710023S3","DOTW871002HCHMRL06","WALTER ALEJANDRO DOMINGUEZ TORRES","08DPT0012I",null,null,null,null,null,null,0,180,0,null,null,null,null,null,null,0,180,0,21269.280000000002]
[null,"CHIHUAHUA","DUIA911217JM8","DUIA911217HCHRBR05","ARMANDO ALEXIS DUARTE IBARRA","08DPT0012I",null,null,null,null,null,null,0,240,0,null,null,null,null,null,null,0,240,0,18584.399999999998]
[null,"CHIHUAHUA","EACL761108IA6","EACL761108HCHSHS08","JOSE LUIS ESTRADA CHAVEZ","08DPT0012I",null,null,null,null,null,null,0,168,0,null,null,null,null,null,null,0,168,0,11251.8]
[null,"CHIHUAHUA","FITM7609208P9","FITM760920MCHGVR05","MARISOL FIGUEROA TOVAR","08DPT0012I",null,null,null,null,null,null,0,216,0,null,null,null,null,null,null,0,216,0,25523.1]
[null,"CHIHUAHUA","FORM921019289","FORM921019HCHLDR09","MARCO ANTONIO FLORES RODRIGUEZ","08DPT0012I",null,null,null,null,null,null,0,216,0,null,null,null,null,null,null,0,216,0,19677.599999999999]
[null,"CHIHUAHUA","GAMC820716BJ4","GAMC820716MCHLRR08","MARIA DEL CARMEN GALLEGOS MARTINEZ","08DPT0012I",null,null,null,null,null,null,0,240,0,null,null,null,null,null,null,0,240,0,28359]
[null,"CHIHUAHUA","GOCS820528T91","GOCS820528MCHNLN05","SANDRA BERENICE GONZALEZ COLMENERO","08DPT0012I",null,null,null,null,null,null,0,240,0,null,null,null,null,null,null,0,240,0,28359]
[null,"CHIHUAHUA","GOGG631226J88","GOGG631226MCHNLL06","GLORIA MARINA GONZALEZ GALLEGOS","08DPT0012I",null,null,null,null,null,null,0,216,0,null,null,null,null,null,null,0,216,0,25523.1]
[null,"CHIHUAHUA","GOQM960413969","GOQM960413HCHNXR03","MARCO ANTONIO GONZALEZ QUIÑONEZ","08DPT0012I",null,null,null,null,null,null,0,120,0,null,null,null,null,null,null,0,120,0,8037]
[null,"CHIHUAHUA","GAMO630830H94","GAMO630830MCHRRL07","OLGA CECILIA GRAJEDA  MIRAMONTES","08DPT0012I",null,null,null,null,null,null,0,240,0,null,null,null,null,null,null,0,240,0,28359]
[null,"CHIHUAHUA","HEGP741201TCA","HEGP741201MCHRRT03","PATRICIA OLAYA HERRERA GARCIA","08DPT0012I",null,null,null,null,null,null,0,228,0,null,null,null,null,null,null,0,228,0,26941.08]
[null,"CHIHUAHUA","IIOF8012093M1","IIOF801209HCHRLR08","FRANCISCO IRIGOYEN OLIVAS","08DPT0012I",null,null,null,null,null,null,0,240,0,null,null,null,null,null,null,0,240,0,23632.5]
[null,"CHIHUAHUA","IAFR620519979","IAFR620519HSLZRM07","RAMON  IZAGUIRRE FIERRO","08DPT0012I",null,null,null,null,null,null,0,240,0,null,null,null,null,null,null,0,240,0,24573]
[null,"CHIHUAHUA","JAAG74101784A","JAAG741017MCHQRL01","GLORIA LINDA JAQUEZ ARBALLO","08DPT0012I",null,null,null,null,null,null,0,240,0,null,null,null,null,null,null,0,240,0,28359]
[null,"CHIHUAHUA","LAGL890709J41","LAGL890709MCHZNL07","LLUVIA CRISTINA LAZO GONZALEZ","08DPT0012I",null,null,null,null,null,null,0,228,0,null,null,null,null,null,null,0,228,0,23344.38]
[null,"CHIHUAHUA","MALS840210DM2","MALS840210MCHCYL02","SILVIA ISELA MACIAS LOYA","08DPT0012I",null,null,null,null,null,null,0,120,0,null,null,null,null,null,null,0,120,0,14179.5]
[null,"CHIHUAHUA","MAGZ860917JB4","MAGZ860917MCHLLL02","ZULEYKA MARIELA MALDONADO GIL","08DPT0012I",null,null,null,null,null,null,0,240,0,null,null,null,null,null,null,0,240,0,28359]
[null,"CHIHUAHUA","MATM841124GU1","MATM841124MCHRLY00","MAYTEE ABRIL MARQUEZ TELLO","08DPT0012I",null,null,null,null,null,null,0,168,0,null,null,null,null,null,null,0,168,0,19851.3]
[null,"CHIHUAHUA","MAGM880802UR1","MAGM880802MCHRRR08","MARINA ANGELICA MARTINEZ GARCIA","08DPT0012I",null,null,null,null,null,null,0,228,0,null,null,null,null,null,null,0,228,0,26941.08]
[null,"CHIHUAHUA","MEOE6606187C0","MEOE660618HCHLRF02","EFREN MELENDEZ ORTIZ","08DPT0012I",null,null,null,null,null,null,0,180,0,null,null,null,null,null,null,0,180,0,21269.280000000002]
[null,"CHIHUAHUA","MERA900126FD2","MERA900126MCHNMN03","ANA ISABEL MENDOZA RAMOS","08DPT0012I",null,null,null,null,null,null,0,240,0,null,null,null,null,null,null,0,240,0,21864]
[null,"CHIHUAHUA","MOEJ8410204P7","MOEJ841020HCHRSS09","JESUS MORENO ESTRADA","08DPT0012I",null,null,null,null,null,null,0,120,0,null,null,null,null,null,null,0,120,0,14179.5]
[null,"CHIHUAHUA","NUMR860506DV4","NUMR860506MCHXRQ03","RAQUEL NUÑEZ MARTINEZ","08DPT0012I",null,null,null,null,null,null,0,240,0,null,null,null,null,null,null,0,240,0,28359]
[null,"CHIHUAHUA","OIPC830620AE8","OIPC830620HCHRRR03","CARLOS ALEJANDRO ORTIZ PAREDES","08DPT0012I",null,null,null,null,null,null,0,228,0,null,null,null,null,null,null,0,228,0,26941.08]
[null,"CHIHUAHUA","PAVC680810379","PAVC680810MCHLLR09","CARMEN LORENA PALMA VALVERDE","08DPT0012I",null,null,null,null,null,null,0,192,0,null,null,null,null,null,null,0,192,0,22687.200000000001]
[null,"CHIHUAHUA","PAVK8303143F4","PAVK830314MCHYLR05","KARLA DENISSE PAYAN VALVERDE","08DPT0012I",null,null,null,null,null,null,0,240,0,null,null,null,null,null,null,0,240,0,28359]
[null,"CHIHUAHUA","POED8604086S3","POED860408MCHRCN03","DIANA ELIZABETH PORTILLO ECHAVARRIA","08DPT0012I",null,null,null,null,null,null,0,240,0,null,null,null,null,null,null,0,240,0,28359]
[null,"CHIHUAHUA","RORH430507A24","RORH430507HDGBMC03","HECTOR ANTONIO ROBALI ROMERO","08DPT0012I",null,null,null,null,null,null,0,240,0,null,null,null,null,null,null,0,240,0,14179.5]
[null,"CHIHUAHUA","ROAN6811104YA","ROAN681110HVZDGX08","JOSE NOE RODRIGUEZ AGUILERA","08DPT0012I",null,null,null,null,null,null,0,156,0,null,null,null,null,null,null,0,156,0,18433.38]
[null,"CHIHUAHUA","ROVC830522ILA","ROVC830522MCHDLR00","CRISTINA RODRIGUEZ VALVERDE","08DPT0012I",null,null,null,null,null,null,0,216,0,null,null,null,null,null,null,0,216,0,19677.599999999999]
[null,"CHIHUAHUA","SAME780216645","SAME780216MCHCLS05","ESMERALDA SAUCEDO MOLINA","08DPT0012I",null,null,null,null,null,null,0,240,0,null,null,null,null,null,null,0,240,0,28359]
[null,"CHIHUAHUA","UUGA831111DY9","UUGA831111MCHRND03","ADRIANA ARMINE URQUIZA GONZALEZ","08DPT0012I",null,null,null,null,null,null,0,216,0,null,null,null,null,null,null,0,216,0,25523.1]
[null,"CHIHUAHUA","VATL8403292K8","VATL840329HCHLRS05","LUIS OCTAVIO VALVERDE TORRES","08DPT0012I",null,null,null,null,null,null,0,240,0,null,null,null,null,null,null,0,240,0,24573]
[null,"CHIHUAHUA","VACA8309027BA","VXCA830902HCHZHN07","ANDRES VAZQUEZ  CHAVEZ","08DPT0012I",null,null,null,null,null,null,0,216,0,null,null,null,null,null,null,0,216,0,25523.1]
[null,"CHIHUAHUA","VIMG940827G9A","VIMG940827MCHLNL05","GUILLE LIZBETH VILLALOBOS MONAÑO","08DPT0012I",null,null,null,null,null,null,0,120,0,null,null,null,null,null,null,0,120,0,6559.2000000000007]
[null,"CHIHUAHUA","VIVR8208282I1","VIVR820828HDGLLB03","ROBERTO RENE VILLALPALDO VILLALPANDO","08DPT0012I",null,null,null,null,null,null,0,204,0,null,null,null,null,null,null,0,204,0,13662.9]
[null,"CHIHUAHUA","AAEJ730109C94","AAEJ730109HCHLSL06","ALVAREZ ESCARCEGA JULIAN ","08DPT0011J",null,null,null,1,0,0,null,null,null,null,null,null,null,null,null,1,0,0,28590.7]
[null,"CHIHUAHUA","AOJS831129TE8","AOJS831129MCHNRL09","ANCHONDO JUAREZ SILVIA GRACIELA","08DPT0011J",null,null,null,1,0,0,null,null,null,null,null,null,null,null,null,1,0,0,36658.03]
[null,"CHIHUAHUA","AOLY671118ELA","AOLY671118MDGRCZ05","ARROYO LECHUGA YAZMIN","08DPT0011J",null,null,null,1,0,0,null,null,null,null,null,null,null,null,null,1,0,0,113080.12999999999]
[null,"CHIHUAHUA","AIAA780609P70","AIAA780609HCHVGG01","AVITIA AGUILAR AGUSTIN ","08DPT0011J",null,null,null,null,null,null,null,null,null,null,null,null,1,0,0,1,0,0,33229.949999999997]
[null,"CHIHUAHUA","BARM6606271QA","BARM660627HCHRBR03","MARIO ALBERTO BARBA RUBIO","08DPT0011J",null,null,null,1,0,0,null,null,null,null,null,null,null,null,null,1,0,0,27544.82]
[null,"CHIHUAHUA","CAMF661018JC7","CAMF661018HCHHDR08","FRANCISCO JAVIER CABRERA MEDINA","08DPT0011J",null,null,null,1,0,0,null,null,null,null,null,null,null,null,null,1,0,0,80769.080000000016]
[null,"CHIHUAHUA","CAVJ9010233Z3","CAVJ901023MCHXZH05","CAÑAS VAZQUEZ JAHAIRA ARANI ","08DPT0011J",null,null,null,1,0,0,null,null,null,null,null,null,null,null,null,1,0,0,43946.960000000006]
[null,"CHIHUAHUA","AESG7103187K4","AESG710318MCLNGL04","DE LOS ANGELES SEGURA GLORIA MARIA ","08DPT0011J",null,null,null,1,0,0,null,null,null,null,null,null,null,null,null,1,0,0,60190.439999999995]
[null,"CHIHUAHUA","EUGM7504107E2","EUGM750410HCHSRR05","ESQUIVEL GUERRERO MAURO EZEQUIEL ","08DPT0011J",null,null,null,1,0,0,null,null,null,null,null,null,null,null,null,1,0,0,29192.959999999995]
[null,"CHIHUAHUA","FACG681029MZ8","FACG681029MCHDRR04","GEORGINA FAUDOA CRUZ","08DPT0011J",null,null,null,1,0,0,null,null,null,null,null,null,null,null,null,1,0,0,50382.65]
[null,"CHIHUAHUA","FEPD840911LH2","FEPD840911MCHRZN04","DENISSE JANETT FERNANDEZ PAEZ","08DPT0011J",null,null,null,1,0,0,null,null,null,null,null,null,null,null,null,1,0,0,68716.37]
[null,"CHIHUAHUA","FOTL710111D65","FOTL710111MDFLNL02","LILLIAN KARINA FLOTTE TINOCO ","08DPT0011J",null,null,null,1,0,0,null,null,null,null,null,null,null,null,null,1,0,0,76849.7]
[null,"CHIHUAHUA","GAGJ740328P75","GAGJ740328HCHLNR03","JORGE ARTURO GALLEGOS GONZALEZ","08DPT0011J",null,null,null,1,0,0,null,null,null,null,null,null,null,null,null,1,0,0,46053.259999999995]
[null,"CHIHUAHUA","GOML880120US2","GOML880120MCHMNZ01","LUZ IVONNE GOMEZ MENDOZA ","08DPT0011J",null,null,null,1,0,0,null,null,null,null,null,null,null,null,null,1,0,0,9373.39]
[null,"CHIHUAHUA","GOQG650428BVA","GOQG650428MCHNNR07","GEORGINA GONZALEZ QUINTANA","08DPT0011J",null,null,null,1,0,0,null,null,null,null,null,null,null,null,null,1,0,0,37454.890000000007]
[null,"CHIHUAHUA","GURJ541104T10","GURJ541104HCHRMS04","JESUS LUIS GUERRA RAMIREZ","08DPT0011J",null,null,null,1,0,0,null,null,null,null,null,null,null,null,null,1,0,0,45088.539999999994]
[null,"CHIHUAHUA","HENE680323MJ1","HENE680323MCHRRL03","ELIDA HERNANDEZ NORES","08DPT0011J",null,null,null,1,0,0,null,null,null,null,null,null,null,null,null,1,0,0,47503.659999999996]
[null,"CHIHUAHUA","LIGG8206272AA","LIGG820627HCLRRZ15","GIEZI LIRA GARCIA","08DPT0011J",null,null,null,1,0,0,null,null,null,null,null,null,null,null,null,1,0,0,44791.41]
[null,"CHIHUAHUA","LOCJ4605101D2","LOCJ460510HCHPSS06","JESUS LOPEZ CASTRO","08DPT0011J",null,null,null,1,0,0,null,null,null,null,null,null,null,null,null,1,0,0,47351.86]
[null,"CHIHUAHUA","LOPO671113I30","LOPO671113HCHPRS00","OSCAR BENJAMIN LOPEZ PEREZ","08DPT0011J",null,null,null,1,0,0,null,null,null,null,null,null,null,null,null,1,0,0,114780.42]
[null,"CHIHUAHUA","MACE880915VB1","MACE880915HCHRNR04","ERICK MARTELL CONTRERAS ","08DPT0011J",null,null,null,1,0,0,null,null,null,null,null,null,null,null,null,1,0,0,51286.680000000008]
[null,"CHIHUAHUA","MAGI710826BY5","MAGI710826HCHRNV05","IVONNE ARACELI MARTINEZ GONZALEZ","08DPT0011J",null,null,null,1,0,0,null,null,null,null,null,null,null,null,null,1,0,0,76567.78]
[null,"CHIHUAHUA","MAVE810424SY3","MAVE810424MCHRLL08","ELIA ZURASY MARTINEZ VELO","08DPT0011J",null,null,null,1,0,0,null,null,null,null,null,null,null,null,null,1,0,0,29791.889999999996]
[null,"CHIHUAHUA","MEGM480906839","MEGM480906HCHNNG00","MIGUEL ANGEL MENDOZA GONZALEZ","08DPT0011J",null,null,null,1,0,0,null,null,null,null,null,null,null,null,null,1,0,0,36757.590000000004]
[null,"CHIHUAHUA","MOCY820701FR6","MOCY820701MCHRHS01","YESSENIA IVONNE MORENO CHAVEZ ","08DPT0011J",null,null,null,1,0,0,null,null,null,null,null,null,null,null,null,1,0,0,103078.61999999998]
[null,"CHIHUAHUA","OIFL620226IA5","OIFL620226MCHLLD03","LIDIA GUADALUPE OLIVAS FLORES","08DPT0011J",null,null,null,1,0,0,null,null,null,null,null,null,null,null,null,1,0,0,65685.84]
[null,"CHIHUAHUA","OESN6905137N5","OESN690513MCHRCR06","NORMA ORTEGA SCOTT","08DPT0011J",null,null,null,1,0,0,null,null,null,null,null,null,null,null,null,1,0,0,78633.52]
[null,"CHIHUAHUA","OIAA580304QJA","OIAA580304HCHRRB04","ABRAHAM ORTIZ ARMENDARIZ","08DPT0011J",null,null,null,1,0,0,null,null,null,null,null,null,null,null,null,1,0,0,40694.340000000004]
[null,"CHIHUAHUA","PICM810405PX1","PICM810405MCHRRR02","MARIANA PRIETO CARRASCO ","08DPT0011J",null,null,null,1,0,0,null,null,null,null,null,null,null,null,null,1,0,0,12045.43]
[null,"CHIHUAHUA","RUAJ680828NZ1","RUAJ680828HCHZGN01","JUAN CARLOS RUIZ AGUIRRE","08DPT0011J",null,null,null,1,0,0,null,null,null,null,null,null,null,null,null,1,0,0,28705.040000000001]
[null,"CHIHUAHUA","SADC620717A78","SADC620717MCHLMR01","CARMEN ESTELA SALAS DOMINGUEZ","08DPT0011J",null,null,null,1,0,0,null,null,null,null,null,null,null,null,null,1,0,0,65610.52]
[null,"CHIHUAHUA","SACG701206260","SACG701206MCHLND02","MARIA GUADALUPE SALAZAR CONTRERAS","08DPT0011J",null,null,null,1,0,0,null,null,null,null,null,null,null,null,null,1,0,0,85935.66]
[null,"CHIHUAHUA","VAAG6312036W2","VAAG631203HTSLVR03","GERARDO VALDEZ AVILA","08DPT0011J",null,null,null,null,null,null,null,null,null,null,null,null,1,0,0,1,0,0,85992.48]
[null,"CHIHUAHUA","VILA590828MZ1","VILA590828HCHLZG06","AGUSTIN VILLAGRAN LOZOYA","08DPT0011J",null,null,null,1,0,0,null,null,null,null,null,null,null,null,null,1,0,0,36881.629999999997]
[null,"CHIHUAHUA","VIDV791004RJ0","VIDV791004MCHLRR04","VIRGINIA VILLALBA DURAN","08DPT0011J",null,null,null,1,0,0,null,null,null,null,null,null,null,null,null,1,0,0,48413.299999999996]
[null,"CHIHUAHUA","VIMS620916I47","VIMS620916MCHLRN00","SANDRA HORTENSIA VILLALOBOS MARIN","08DPT0011J",null,null,null,1,0,0,null,null,null,null,null,null,null,null,null,1,0,0,81657.100000000006]
[null,"CHIHUAHUA","VIYD6702201Q6","VIYD670220MCHLXR09","DORA EMMA VILLALOBOS YAÑEZ","08DPT0011J",null,null,null,1,0,0,null,null,null,null,null,null,null,null,null,1,0,0,45485.11]
[null,"CHIHUAHUA","AOAJ720609R46","AOAJ720609MCHCLS06","MARÍA DE JESÚS ACOSTA ÁLVAREZ","08DPT0011J",null,null,null,null,null,null,0,240,0,null,null,null,null,null,null,0,240,0,21864]
[null,"CHIHUAHUA","AORC6607129B3","AORC660712HCHCMS03","CÉSAR RENÉ ACOSTA ROMO","08DPT0011J",null,null,null,null,null,null,0,168,0,null,null,null,null,null,null,0,168,0,17201.099999999999]
[null,"CHIHUAHUA","AUVX671108950","AUVX671108MCHGLC09","XOCHITL MARGARITA AGUILAR VILLALOBOS","08DPT0011J",null,null,null,null,null,null,0,240,0,null,null,null,null,null,null,0,240,0,22687.200000000001]
[null,"CHIHUAHUA","AADF760822JB4","AADF760822MCHLML07","FLOR ANEL ALMANZA DOMÍNGUEZ","08DPT0011J",null,null,null,null,null,null,0,216,0,null,null,null,null,null,null,0,216,0,25523.1]
[null,"CHIHUAHUA","AADF541004UL3","AADF541004HDGLMR07","FRANCISCO ALVARADO DOMÍNGUEZ","08DPT0011J",null,null,null,null,null,null,0,240,0,null,null,null,null,null,null,0,240,0,28359]
[null,"CHIHUAHUA","AAGD820816HU2","AAGD820816MCHLTL09","DALYLA ALVARADO GUTIÉRREZ","08DPT0011J",null,null,null,null,null,null,0,240,0,null,null,null,null,null,null,0,240,0,28359]
[null,"CHIHUAHUA","AASE930324BT6","AASE930324MCHLLD02","EDITH ALVAREZ SALAZAR","08DPT0011J",null,null,null,null,null,null,0,216,0,null,null,null,null,null,null,0,216,0,16074]
[null,"CHIHUAHUA","AAOG691105623","AAOG691105HCHLCS09","GASTÓN ÁLVAREZ OCHOA","08DPT0011J",null,null,null,null,null,null,0,216,0,null,null,null,null,null,null,0,216,0,25523.1]
[null,"CHIHUAHUA","AIRL900105A19","AIRL900105HCHLSS09","JOSÉ LUIS ALVÍDREZ RÍOS","08DPT0011J",null,null,null,null,null,null,0,216,0,null,null,null,null,null,null,0,216,0,24573]
[null,"CHIHUAHUA","AALU670310HX2","AAXL670310HCHMXS16","LUIS CARLOS AMAYA X","08DPT0011J",null,null,null,null,null,null,0,240,0,null,null,null,null,null,null,0,240,0,26941.08]
[null,"CHIHUAHUA","AAAM8805014VA","AAAM880501MCHNCL02","MILDRET ARLETTE ANDRADE ACOSTA","08DPT0011J",null,null,null,null,null,null,0,216,0,null,null,null,null,null,null,0,216,0,21864]
[null,"CHIHUAHUA","AIDJ6101296Q4","AIDJ610129HCHVLS09","JESÚS HUMBERTO ÁVILA DELGADO","08DPT0011J",null,null,null,null,null,null,0,240,0,null,null,null,null,null,null,0,240,0,24105.18]
[null,"CHIHUAHUA","AIQC690227LQ0","AIQC690227HCHVNS05","CESAR ROGACIANO ÁVILA QUINTANA","08DPT0011J",null,null,null,null,null,null,0,180,0,null,null,null,null,null,null,0,180,0,14179.5]
[null,"CHIHUAHUA","BABR540126HB4","BABR540126HCHZDL02","RAÚL GABRIEL BAEZA BEDOY","08DPT0011J",null,null,null,null,null,null,0,240,0,null,null,null,null,null,null,0,240,0,17015.400000000001]
[null,"CHIHUAHUA","BAGA570401CF3","BAGA570401HCHRNN09","ANDRÉS BARBA GÁNDARA","08DPT0011J",null,null,null,null,null,null,0,240,0,null,null,null,null,null,null,0,240,0,28359]
[null,"CHIHUAHUA","BASZ650208NL8","BASZ650208MMCRTH02","ZHENIA PATRICIA BARRAZA STOELTING","08DPT0011J",null,null,null,null,null,null,0,180,0,null,null,null,null,null,null,0,180,0,21269.279999999999]
[null,"CHIHUAHUA","BEAG740617SI1","BEAG740617MSLJRB00","MARÍA GABIELA BEJARANO ARREDONDO","08DPT0011J",null,null,null,null,null,null,0,240,0,null,null,null,null,null,null,0,240,0,28359]
[null,"CHIHUAHUA","BEML730902B28","BEML730902HCHLRS07","JOSÉ LUIS BELTRÁN MÁRQUEZ","08DPT0011J",null,null,null,null,null,null,0,240,0,null,null,null,null,null,null,0,240,0,21269.279999999999]
[null,"CHIHUAHUA","BACJ820811R51","BACJ820811HCHLRN02","JUAN JOSÉ BLANCO CRUZ","08DPT0011J",null,null,null,null,null,null,0,120,0,null,null,null,null,null,null,0,120,0,14179.5]
[null,"CHIHUAHUA","BASH700602N82","BASH700602HCHLNR08","HERNÁN BLANCO SÁENZ","08DPT0011J",null,null,null,null,null,null,0,216,0,null,null,null,null,null,null,0,216,0,22687.200000000001]
[null,"CHIHUAHUA","CAHJ821204323","CAHJ821204HCHBRL07","JOEL ANTONIO CABALLERO HERNÁNDEZ","08DPT0011J",null,null,null,null,null,null,0,216,0,null,null,null,null,null,null,0,216,0,25523.1]
[null,"CHIHUAHUA","CADL780717DQ0","CADL780717HCHMLS06","LUIS MANUEL CAMACHO DELGADO","08DPT0011J",null,null,null,null,null,null,0,240,0,null,null,null,null,null,null,0,240,0,24573]
[null,"CHIHUAHUA","CAML770621S57","CAML770621HCHRRS02","LUIS CARMONA MORA","08DPT0011J",null,null,null,null,null,null,0,120,0,null,null,null,null,null,null,0,120,0,14179.5]
[null,"CHIHUAHUA","CAEI831214746","CAEI831214MCHRSV05","IVETH SELENE CARO ESCUDERO","08DPT0011J",null,null,null,null,null,null,0,240,0,null,null,null,null,null,null,0,240,0,18429.78]
[null,"CHIHUAHUA","CAGS5611036P5","CAGS561103MCHRLL06","SILVIA CARRASCO GALVÁN","08DPT0011J",null,null,null,null,null,null,0,240,0,null,null,null,null,null,null,0,240,0,25523.1]
[null,"CHIHUAHUA","CAVJ780821N37","CAVJ780821HCHZLS05","JESÚS MANUEL CAZARES VILLARREAL","08DPT0011J",null,null,null,null,null,null,0,240,0,null,null,null,null,null,null,0,240,0,24573]
[null,"CHIHUAHUA","CEPJ5209176A4","CEPJ520917MCLDXS03","MARÍA DE JESÚS CEDILLO PEÑA","08DPT0011J",null,null,null,null,null,null,0,180,0,null,null,null,null,null,null,0,180,0,18433.38]
[null,"CHIHUAHUA","CACL6504048EA","CACL650404HCHHHS06","JOSÉ LUIS CHAVARRÍA CHÁVEZ","08DPT0011J",null,null,null,null,null,null,0,228,0,null,null,null,null,null,null,0,228,0,26941.08]
[null,"CHIHUAHUA","CALM790104KB2","CALM790104HCHHPN06","MANUEL ALBERTO CHAVIRA LÓPEZ","08DPT0011J",null,null,null,null,null,null,0,240,0,null,null,null,null,null,null,0,240,0,22687.200000000001]
[null,"CHIHUAHUA","CORI861010967","CORI861010HCHNVS07","ISAÚL CONTRERAS RIVERA","08DPT0011J",null,null,null,null,null,null,0,240,0,null,null,null,null,null,null,0,240,0,24573]
[null,"CHIHUAHUA","COVM710719995","COVM710719HCHRLR08","MARCO ANTONIO CORONADO VILLARREAL","08DPT0011J",null,null,null,null,null,null,0,240,0,null,null,null,null,null,null,0,240,0,26941.08]
[null,"CHIHUAHUA","DIVM670828475","DIVM670828HCHZQN04","MANUEL DÍAZ VAQUERA","08DPT0011J",null,null,null,null,null,null,0,180,0,null,null,null,null,null,null,0,180,0,21269.279999999999]
[null,"CHIHUAHUA","EICP660518T31","EICP660518MCHSRT02","PATRICIA EISSA CARRILLO","08DPT0011J",null,null,null,null,null,null,0,180,0,null,null,null,null,null,null,0,180,0,21269.279999999999]
[null,"CHIHUAHUA","EIAL6904095Y1","EIAL690409MCHSLR06","LORENA MARGARITA ESPINOZA ALCALÁ","08DPT0011J",null,null,null,null,null,null,0,240,0,null,null,null,null,null,null,0,240,0,28359]
[null,"CHIHUAHUA","FOSJ7411047Y2","FOSJ741104HCHLLV00","JAVIER ARTURO FLORES SALAS","08DPT0011J",null,null,null,null,null,null,0,180,0,null,null,null,null,null,null,0,180,0,25523.1]
[null,"CHIHUAHUA","GAGJ7110079I6","GAGJ711007HCHBRL03","JULIÁN GABIRA DE LA GARZA","08DPT0011J",null,null,null,null,null,null,0,228,0,null,null,null,null,null,null,0,228,0,22687.200000000001]
[null,"CHIHUAHUA","GALP8605195S6","GALP860519MCHRCR06","PERLA LILIANA GARCÍA LUCERO","08DPT0011J",null,null,null,null,null,null,0,240,0,null,null,null,null,null,null,0,240,0,24573]
[null,"CHIHUAHUA","GAMJ7901211A8","GAMJ790121HCHRDS09","JESÚS ANTONIO GARCÍA MEDINA","08DPT0011J",null,null,null,null,null,null,0,108,0,null,null,null,null,null,null,0,108,0,11057.88]
[null,"CHIHUAHUA","GOCC7107156X6","GOCC710715MCHNHR03","CARMEN GUADALUPE GONZÁLEZ CHACÓN","08DPT0011J",null,null,null,null,null,null,0,216,0,null,null,null,null,null,null,0,216,0,15597.48]
[null,"CHIHUAHUA","GOGJ721103UI4","GOGJ721103HCHNRL03","JULIO CESAR GONZÁLEZ GRANADOS","08DPT0011J",null,null,null,null,null,null,0,240,0,null,null,null,null,null,null,0,240,0,28359]
[null,"CHIHUAHUA","GOPS631119234","GOPS631119HCHNZX06","SIXTO HUMBERTO GONZÁLEZ PÁEZ","08DPT0011J",null,null,null,null,null,null,0,240,0,null,null,null,null,null,null,0,240,0,28359]
[null,"CHIHUAHUA","GUTM700125HI4","GUTM700125MCHRRR03","MARGARITA GUARDADO TORRES","08DPT0011J",null,null,null,null,null,null,0,240,0,null,null,null,null,null,null,0,240,0,28359]
[null,"CHIHUAHUA","GUGL640702V28","GUGL640702HCHTRS02","LUIS ROGELIO GUTIÉRREZ GARCÍA","08DPT0011J",null,null,null,null,null,null,0,240,0,null,null,null,null,null,null,0,240,0,28359]
[null,"CHIHUAHUA","HECM730118LI9","HECM730118HCHRDR06","MAURICIO HERNÁNDEZ CAUDILLO","08DPT0011J",null,null,null,null,null,null,0,48,0,null,null,null,null,null,null,0,48,0,7089.78]
[null,"CHIHUAHUA","HEOD870714897","HEOD870714MCLRLN06","DIANA HERNÁNDEZ OLIVARES","08DPT0011J",null,null,null,null,null,null,0,240,0,null,null,null,null,null,null,0,240,0,22687.200000000001]
[null,"CHIHUAHUA","HETC830217EB1","HETC830217MCHRRN07","CINTHIA LIZETH HERNÁNDEZ TREVIÑO","08DPT0011J",null,null,null,null,null,null,0,240,0,null,null,null,null,null,null,0,240,0,21269.279999999999]
[null,"CHIHUAHUA","HEDM761211T33","HEDM761211MCHRZY08","MAYRA GUADALUPE HERRERA DÍAZ","08DPT0011J",null,null,null,null,null,null,0,180,0,null,null,null,null,null,null,0,180,0,25523.1]
[null,"CHIHUAHUA","JASX660321NQ4","JASX660321HZSYTM15","XAMIR JAYDAR SOTO","08DPT0011J",null,null,null,null,null,null,0,240,0,null,null,null,null,null,null,0,240,0,21269.279999999999]
[null,"CHIHUAHUA","JILS7804098R3","JILS780409HCHMZR04","SERGIO ARMANDO JIMÉNEZ LOZANO","08DPT0011J",null,null,null,null,null,null,0,192,0,null,null,null,null,null,null,0,192,0,24573]
[null,"CHIHUAHUA","JISR460111595","JISR460111HBCMLY00","REYNALDO JIMÉNEZ SOLÍS","08DPT0011J",null,null,null,null,null,null,0,240,0,null,null,null,null,null,null,0,240,0,11343.6]
[null,"CHIHUAHUA","LEGI810812S76","LEGI810812HCHYNR04","IRVING LEYVA GONZÁLEZ","08DPT0011J",null,null,null,null,null,null,0,240,0,null,null,null,null,null,null,0,240,0,28359]
[null,"CHIHUAHUA","LOGE770513DS3","LOGE770513MCHPLL01","ELENA DEL ROSARIO LÓPEZ GALAVIZ","08DPT0011J",null,null,null,null,null,null,0,240,0,null,null,null,null,null,null,0,240,0,25523.1]
[null,"CHIHUAHUA","LUCL830421CC7","LUCL830421HCHVNS03","LUIS FERNANDO LUÉVANO CONTRERAS","08DPT0011J",null,null,null,null,null,null,0,240,0,null,null,null,null,null,null,0,240,0,22115.7]
[null,"CHIHUAHUA","LURI7603163W9","LURI760316MCHJDR01","IRMA EMILLIA LUJAN RODRÍGUEZ","08DPT0011J",null,null,null,null,null,null,0,228,0,null,null,null,null,null,null,0,228,0,20770.8]
[null,"CHIHUAHUA","MEFJ6010186V1","MEFJ601018HCHNNS07","JESÚS ALBERTO MENCHACA FUENTES","08DPT0011J",null,null,null,null,null,null,0,216,0,null,null,null,null,null,null,0,216,0,28359]
[null,"CHIHUAHUA","MEEJ750705D34","MEEJ750705HCHNSS02","JESÚS MENDOZA ESTEVANÉ","08DPT0011J",null,null,null,null,null,null,0,240,0,null,null,null,null,null,null,0,240,0,25523.1]
[null,"CHIHUAHUA","MOVI660317J46","MOXV660317HCHLXC08","VÍCTOR MANUEL MOLINAR X","08DPT0011J",null,null,null,null,null,null,0,240,0,null,null,null,null,null,null,0,240,0,20887.080000000002]
[null,"CHIHUAHUA","MORR640403339","MORR640403MCHNDS08","ROSARIO FLORENTINA MONTOYA RODRÍGUEZ","08DPT0011J",null,null,null,null,null,null,0,240,0,null,null,null,null,null,null,0,240,0,28359]
[null,"CHIHUAHUA","MOEC8307215B7","MOEC830721HCHRSR06","CARLOS DANIEL MORALES ESPINOZA","08DPT0011J",null,null,null,null,null,null,0,240,0,null,null,null,null,null,null,0,240,0,28359]
[null,"CHIHUAHUA","MOSV610329FQ2","MOSV610329HCHRTC06","VÍCTOR MORENO SOTO","08DPT0011J",null,null,null,null,null,null,0,240,0,null,null,null,null,null,null,0,240,0,28359]
[null,"CHIHUAHUA","MOOL690713831","MOOL690713MCHRSR07","LAURA MAGDALENA MORONES OSUNA","08DPT0011J",null,null,null,null,null,null,0,240,0,null,null,null,null,null,null,0,240,0,28359]
[null,"CHIHUAHUA","MORC720201UY4","MORC720201MCHRDL09","CLAUDIA MORONES RODRÍGUEZ","08DPT0011J",null,null,null,null,null,null,0,240,0,null,null,null,null,null,null,0,240,0,21269.279999999999]
[null,"CHIHUAHUA","MUNL690829H48","MUNL690829MCHXTZ04","LUZ EMILIA MUÑOZ NATIVIDAD","08DPT0011J",null,null,null,null,null,null,0,180,0,null,null,null,null,null,null,0,180,0,17015.400000000001]
[null,"CHIHUAHUA","NADJ630505N67","NADJ630505HCHVLN05","JUAN NAVA DELGADO","08DPT0011J",null,null,null,null,null,null,0,240,0,null,null,null,null,null,null,0,240,0,26941.08]
[null,"CHIHUAHUA","NAML740428B29","NAML740428MCHVRR05","LORENA IVONNE NAVA MORALES","08DPT0011J",null,null,null,null,null,null,0,240,0,null,null,null,null,null,null,0,240,0,28359]
[null,"CHIHUAHUA","NUGA831209HF9","NUGA831209HSLVZR04","ARTURO GUADALUPE NUEVO GUZMAN","08DPT0011J",null,null,null,null,null,null,0,228,0,null,null,null,null,null,null,0,228,0,16398]
[null,"CHIHUAHUA","OOMJ6108305IA","OOMJ610830MCHCDN00","JUANA ROSA OCHOA MADRID","08DPT0011J",null,null,null,null,null,null,0,240,0,null,null,null,null,null,null,0,240,0,28359]
[null,"CHIHUAHUA","OOGI7603109Y9","OOGI760310HDGRNS08","ISIDRO OROZCO GONZÁLEZ","08DPT0011J",null,null,null,null,null,null,0,240,0,null,null,null,null,null,null,0,240,0,28359]
[null,"CHIHUAHUA","OORA820321MG3","OORA820321MCHRNY08","AYDE OROZCO RENOVA","08DPT0011J",null,null,null,null,null,null,0,240,0,null,null,null,null,null,null,0,240,0,24105.18]
[null,"CHIHUAHUA","PAMC840828GP8","PAMC840828MCHCRR08","CRISTINA PACHECO MÁRQUEZ","08DPT0011J",null,null,null,null,null,null,0,192,0,null,null,null,null,null,null,0,192,0,28359]
[null,"CHIHUAHUA","PAPA610623V58","PAPA610623HCHLXN04","ANTONIO PALACIO PIÑA","08DPT0011J",null,null,null,null,null,null,0,240,0,null,null,null,null,null,null,0,240,0,26941.08]
[null,"CHIHUAHUA","PEHJ6802298H5","PEHJ680229HCHRRN03","JUAN JOSÉ PÉREZ HERNÁNDEZ","08DPT0011J",null,null,null,null,null,null,0,120,0,null,null,null,null,null,null,0,120,0,22687.200000000001]
[null,"CHIHUAHUA","PERM720917SD7","PERM720917MCHRMR06","MARGARITA PÉREZ RAMÍREZ","08DPT0011J",null,null,null,null,null,null,0,120,0,null,null,null,null,null,null,0,120,0,12761.58]
[null,"CHIHUAHUA","PADM510809SZ5","PADM510809HNTLZG08","MIGUEL ÁNGEL PLASCENCIA DÍAZ","08DPT0011J",null,null,null,null,null,null,0,240,0,null,null,null,null,null,null,0,240,0,25523.1]
[null,"CHIHUAHUA","POSR7405169R0","POSR740516HCHRNB07","JOSÉ ROBERTO PORTILLO SÁENZ","08DPT0011J",null,null,null,null,null,null,0,216,0,null,null,null,null,null,null,0,216,0,21269.279999999999]
[null,"CHIHUAHUA","QUCC800518RJ7","QUCC800518MCHZML03","CLAUDIA ROCÍO QUEZADA CAMPOYA","08DPT0011J",null,null,null,null,null,null,0,180,0,null,null,null,null,null,null,0,180,0,17015.400000000001]
[null,"CHIHUAHUA","QUME830808SH6","QUME830808HCHXRR06","ERIC QUIÑONES MARIÑELARENA","08DPT0011J",null,null,null,null,null,null,0,228,0,null,null,null,null,null,null,0,228,0,21269.279999999999]
[null,"CHIHUAHUA","RARR491119L95","RARR491119HPLMVB06","ROBERTO PONCIANO RAMÍREZ RIVERA","08DPT0011J",null,null,null,null,null,null,0,228,0,null,null,null,null,null,null,0,228,0,28359]
[null,"CHIHUAHUA","RAHA780618377","RAHA780618HCHMRD01","ADARIK QUILEO RAMOS HERRERA","08DPT0011J",null,null,null,null,null,null,0,216,0,null,null,null,null,null,null,0,216,0,25523.1]
[null,"CHIHUAHUA","RARL740713SN9","RARL740713MCHSYR08","LOURDES GABRIELA RASCÓN REYES","08DPT0011J",null,null,null,null,null,null,0,240,0,null,null,null,null,null,null,0,240,0,21269.279999999999]
[null,"CHIHUAHUA","REGJ630501KR7","REGJ630501HDFNRN07","JUAN CARLOS RENDÓN GARCÍA","08DPT0011J",null,null,null,null,null,null,0,216,0,null,null,null,null,null,null,0,216,0,21269.279999999999]
[null,"CHIHUAHUA","RILA820506DD4","RILA820506HCHVCN08","ÁNGEL ARMANDO RIVERA LECHUGA","08DPT0011J",null,null,null,null,null,null,0,216,0,null,null,null,null,null,null,0,216,0,19658.400000000001]
[null,"CHIHUAHUA","ROVW790131VE9","ROVW790131HCHJLL05","WILFREDO ROJO VELÁZQUEZ","08DPT0011J",null,null,null,null,null,null,0,240,0,null,null,null,null,null,null,0,240,0,28359]
[null,"CHIHUAHUA","ROHE830406P40","ROHE830406MCHMRL03","ELSA SAMANTHA ROMERO HERRERA","08DPT0011J",null,null,null,null,null,null,0,156,0,null,null,null,null,null,null,0,156,0,22115.7]
[null,"CHIHUAHUA","RUHJ7401277YA","RUHJ740127HCHZRR00","JORGE ARTURO RUIZ HEIRAS","08DPT0011J",null,null,null,null,null,null,0,240,0,null,null,null,null,null,null,0,240,0,25523.1]
[null,"CHIHUAHUA","RUBJ910211L87","RUBJ910211HCHZCS01","RUIZ ESPARZA BACASEHUA JOSÉ","08DPT0011J",null,null,null,null,null,null,0,204,0,null,null,null,null,null,null,0,204,0,16074]
[null,"CHIHUAHUA","RUCJ590315LP9","RUCJ590315HZSZMS00","JOSÉ RUIZ ESPARZA CAMARENA","08DPT0011J",null,null,null,null,null,null,0,120,0,null,null,null,null,null,null,0,120,0,18429.78]
[null,"CHIHUAHUA","SARC670203156","SARC670203MDGLZR00","MARIA DEL CARMEN SALAS RUIZ","08DPT0011J",null,null,null,null,null,null,0,156,0,null,null,null,null,null,null,0,156,0,17015.400000000001]
[null,"CHIHUAHUA","SACD640228KY5","SACD640228HCHLNN03","DANIEL JAVIER SALAZAR CONTRERAS","08DPT0011J",null,null,null,null,null,null,0,180,0,null,null,null,null,null,null,0,180,0,21269.279999999999]
[null,"CHIHUAHUA","SASL611115CC2","SASL611115HCHMPP00","LEOPOLDO SAMANIEGO SEPÚLVEDA","08DPT0011J",null,null,null,null,null,null,0,240,0,null,null,null,null,null,null,0,240,0,28359]
[null,"CHIHUAHUA","SAPJ770502I20","SAPJ770502HCHNRV00","JAVIER SÁNCHEZ PÉREZ","08DPT0011J",null,null,null,null,null,null,0,168,0,null,null,null,null,null,null,0,168,0,11343.6]
[null,"CHIHUAHUA","SEVK920127JG4","SEVK920127MCHGLR02","KAREN JEMIMA SEGOVIA VILLALOBOS","08DPT0011J",null,null,null,null,null,null,0,240,0,null,null,null,null,null,null,0,240,0,24573]
[null,"CHIHUAHUA","TORR510819H11","TORR510819HDFLSL04","RAÚL ALBERTO TOLEDO ROSILLO","08DPT0011J",null,null,null,null,null,null,0,240,0,null,null,null,null,null,null,0,240,0,21269.279999999999]
[null,"CHIHUAHUA","TOMG6805124B0","TOMG680512MCHRRB05","GABRIELA TORRES MORENO","08DPT0011J",null,null,null,null,null,null,0,168,0,null,null,null,null,null,null,0,168,0,11343.6]
[null,"CHIHUAHUA","TOPD7211138C2","TOPD721113MCHRRL03","DELIA ARMIDA TORRES PORTILLO","08DPT0011J",null,null,null,null,null,null,0,240,0,null,null,null,null,null,null,0,240,0,17015.400000000001]
[null,"CHIHUAHUA","TORJ640811CX6","TORJ640811HCHVVS02","JOSÉ TOVAR RIVERO","08DPT0011J",null,null,null,null,null,null,0,228,0,null,null,null,null,null,null,0,228,0,28359]
[null,"CHIHUAHUA","UUIL8212152F2","UUIL821215HCHRBS02","LUIS ALBERTO URQUIDI IBARBOL","08DPT0011J",null,null,null,null,null,null,0,240,0,null,null,null,null,null,null,0,240,0,26941.08]
[null,"CHIHUAHUA","VAPD660401U61","VAPD660401HCHLRN00","DANIEL VALADEZ PORTILLO","08DPT0011J",null,null,null,null,null,null,0,240,0,null,null,null,null,null,null,0,240,0,26941.08]
[null,"CHIHUAHUA","VAGB5901245Z9","VAGB590124MCHLNL07","VALDERRABANO GONZÁLEZ BLANCA ESTELA ","08DPT0011J",null,null,null,null,null,null,0,216,0,null,null,null,null,null,null,0,216,0,25523.1]
[null,"CHIHUAHUA","VAHJ690910EY0","VAHJ690910HCHLRM02","JAIME VALENZUELA HERNÁNDEZ","08DPT0011J",null,null,null,null,null,null,0,240,0,null,null,null,null,null,null,0,240,0,28359]
[null,"CHIHUAHUA","VAGJ670203PVA","VAGJ670203HCLLVS03","JOSÉ VALLEJO GUEVARA","08DPT0011J",null,null,null,null,null,null,0,228,0,null,null,null,null,null,null,0,228,0,26941.08]
[null,"CHIHUAHUA","VEDL620727PL3","VEDL620727MCHGRR05","LORETO VEGA DURAN","08DPT0011J",null,null,null,null,null,null,0,240,0,null,null,null,null,null,null,0,240,0,28359]
[null,"CHIHUAHUA","VEMA551027JGA","VEMA551027HCHGRR06","ARIEL VEGA MIRANDA","08DPT0011J",null,null,null,null,null,null,0,204,0,null,null,null,null,null,null,0,204,0,14179.5]
[null,"CHIHUAHUA","VIPT690222SN0","VIPT690222MCHLXR04","MARIA TERESA VILLARREAL PIÑÓN","08DPT0011J",null,null,null,null,null,null,0,240,0,null,null,null,null,null,null,0,240,0,25523.1]
[null,"CHIHUAHUA","AOLA8503074R3","AOLA830507HCHLNL04","ALBERTO ISRAEL ALCOCER LONGORIA","08DPT0013H",null,null,null,null,null,null,0,240,0,null,null,null,null,null,null,0,240,0,34305]
[null,"CHIHUAHUA","AOVP680821N74","AOVP680821MCHLLT07","PATRICIA GUADALUPE ALONSO VALENZUELA","08DPT0013H",null,null,null,null,null,null,0,240,0,null,null,null,null,null,null,0,240,0,19578]
[null,"CHIHUAHUA","AAOC930925J35","AAOC930925MCHLLL07","CLAUDIA LIZETH ALVARADO OLIVAS","08DPT0013H",null,null,null,null,null,null,0,240,0,null,null,null,null,null,null,0,240,0,26382]
[null,"CHIHUAHUA","AAOP870805580","AAOP870805HCHLLD04","PEDRO TOMAS ALVARADO OLIVAS","08DPT0013H",null,null,null,null,null,null,0,204,0,null,null,null,null,null,null,0,204,0,22424.7]
[null,"CHIHUAHUA","AAGL910215RT7","AAGL910215HCHNTW07","LEONARDO SEBASTIAN ANDRADE GUTIERREZ","08DPT0013H",null,null,null,null,null,null,0,240,0,null,null,null,null,null,null,0,240,0,34305]
[null,"CHIHUAHUA","AIBS821008VBA","AIBS821008HVZRRR09","SERGIO ARIAS BRAVO","08DPT0013H",null,null,null,null,null,null,0,240,0,null,null,null,null,null,null,0,240,0,34305]
[null,"CHIHUAHUA","AACJ8907149C6","AACJ890714HCHTHS04","JESUS ADRIAN ATAYDE CHACON","08DPT0013H",null,null,null,null,null,null,0,240,0,null,null,null,null,null,null,0,240,0,26382]
[null,"CHIHUAHUA","BAMG8304085L6","BAMG830408MCHRRR05","GEORGINA IVETH BARRAZA MARQUEZ","08DPT0013H",null,null,null,null,null,null,0,240,0,null,null,null,null,null,null,0,240,0,34305]
[null,"CHIHUAHUA","BAMM890408B93","BAMM890408HCHSLR00","MARTIN YAHIR BASURTO MELENDEZ","08DPT0013H",null,null,null,null,null,null,0,240,0,null,null,null,null,null,null,0,240,0,34305]
[null,"CHIHUAHUA","BEGN750326UYA","BEGN750326MCHLRN05","NANCY NOHEMI BELTRAN GARCIA","08DPT0013H",null,null,null,null,null,null,0,68,0,null,null,null,null,null,null,0,68,0,8448.15]
[null,"CHIHUAHUA","BUMA741111CX0","BUMA741111MCHSNN11","ANGELICA BUSTILLOS MINJAREZ","08DPT0013H",null,null,null,null,null,null,0,240,0,null,null,null,null,null,null,0,240,0,34305]
[null,"CHIHUAHUA","BURK950212RQ2","BURK950212MCHSNR03","KARLA ESTRELLA BUSTILLOS RENDON","08DPT0013H",null,null,null,null,null,null,0,192,0,null,null,null,null,null,null,0,192,0,21105.599999999999]
[null,"CHIHUAHUA","CACR890101JE8","CACR890101HCHLRN05","RENE CALDERON CARNERO","08DPT0013H",null,null,null,null,null,null,0,240,0,null,null,null,null,null,null,0,240,0,34305]
[null,"CHIHUAHUA","CAMM870530IJ9","CAMM870530HCHMRG02","MIGUEL ABRAHAM CAMPOYA MORALES","08DPT0013H",null,null,null,null,null,null,0,228,0,null,null,null,null,null,null,0,228,0,28326.179999999997]
[null,"CHIHUAHUA","CAMY820713FS4","CAMY820713MCHRTR09","YURIDIA ITZEL CARDONA MATA","08DPT0013H",null,null,null,null,null,null,0,240,0,null,null,null,null,null,null,0,240,0,34305]
[null,"CHIHUAHUA","CAVE870113T2A","CAVE870113HCHRLD06","EDUARDO CARDONA VILLAGRANA","08DPT0013H",null,null,null,null,null,null,0,240,0,null,null,null,null,null,null,0,240,0,34305]
[null,"CHIHUAHUA","CECD871010N16","CECD871010HCHRSG08","DIEGO ADOLFO CERVANTES CASTILLO","08DPT0013H",null,null,null,null,null,null,0,204,0,null,null,null,null,null,null,0,204,0,22424.7]
[null,"CHIHUAHUA","COTD9112155M3","COTD911215MCHRRN03","DENISSE ALEJANDRA CORELLA TRUJILLO","08DPT0013H",null,null,null,null,null,null,0,240,0,null,null,null,null,null,null,0,240,0,29817]
[null,"CHIHUAHUA","CUAL871105HE1","CUAL871105HCHRLS08","LUIS ALEJANDRO CRUZ ALVARADO","08DPT0013H",null,null,null,null,null,null,0,240,0,null,null,null,null,null,null,0,240,0,29817]
[null,"CHIHUAHUA","ROCJ811214HD5","ROCJ811214HCLSMV04","JAVIER ROLANDO DE LA ROSA CAMPOS","08DPT0013H",null,null,null,null,null,null,0,240,0,null,null,null,null,null,null,0,240,0,34305]
[null,"CHIHUAHUA","LEVD880414UB2","LEVD880414MCLNLN07","DIANA GABRIELA DE LEON VELAZQUEZ","08DPT0013H",null,null,null,null,null,null,0,144,0,null,null,null,null,null,null,0,144,0,20583]
[null,"CHIHUAHUA","DODK891025237","DODK891025MCHMMR03","KARLA KARINA DOMINGUEZ DOMINGUEZ","08DPT0013H",null,null,null,null,null,null,0,240,0,null,null,null,null,null,null,0,240,0,34305]
[null,"CHIHUAHUA","EECA8503081Q2","EECA850308HSLCRB06","ABRAHAM JACOBO ECHEVARRIA CORRALES","08DPT0013H",null,null,null,null,null,null,0,240,0,null,null,null,null,null,null,0,240,0,29817]
[null,"CHIHUAHUA","EILC8907199K2","EILC890719HDGSPS00","CESAR ESPINO LOPEZ","08DPT0013H",null,null,null,null,null,null,0,138,0,null,null,null,null,null,null,0,138,0,15169.65]
[null,"CHIHUAHUA","EISC871230RT1","EISC871230MCHSNR08","CAROLINA ESPINOZA DE SANTIAGO","08DPT0013H",null,null,null,null,null,null,0,240,0,null,null,null,null,null,null,0,240,0,26382]
[null,"CHIHUAHUA","FOLM7810127Q9","FOLM781012HCHLYG02","MIGUEL ANGEL FLORES LEYVA","08DPT0013H",null,null,null,null,null,null,0,180,0,null,null,null,null,null,null,0,180,0,22362.780000000002]
[null,"CHIHUAHUA","GAOR680723LM5","GAOR680723HCHLRC05","RICARDO RAUL GALARZA ORTEGA","08DPT0013H",null,null,null,null,null,null,0,240,0,null,null,null,null,null,null,0,240,0,26382]
[null,"CHIHUAHUA","GAFM850702EM7","GAFM850702HCHRLR00","MARIO ALBERTO GARCIA FLORES","08DPT0013H",null,null,null,null,null,null,0,216,0,null,null,null,null,null,null,0,216,0,17620.2]
[null,"CHIHUAHUA","GONJ870317J36","GONJ870317MVZMCN02","JENNY PATRICIA GOMEZ NICIDA","08DPT0013H",null,null,null,null,null,null,0,240,0,null,null,null,null,null,null,0,240,0,26382]
[null,"CHIHUAHUA","GOHD860913N63","GOHD860913MCLNRL08","DALIA LIBERTAD GONZALEZ HERNANDEZ","08DPT0013H",null,null,null,null,null,null,0,240,0,null,null,null,null,null,null,0,240,0,19578]
[null,"CHIHUAHUA","GOMA820909QV4","GOMA820909MCHNRD09","ADRIANA GONZALEZ MARQUEZ","08DPT0013H",null,null,null,null,null,null,0,240,0,null,null,null,null,null,null,0,240,0,34305]
[null,"CHIHUAHUA","GORR890405IP7","GORR890405HCHNMY01","RAYMUNDO RAMIREZ GONZALEZ","08DPT0013H",null,null,null,null,null,null,0,240,0,null,null,null,null,null,null,0,240,0,29817]
[null,"CHIHUAHUA","GUCD860131S71","GUCD860131HCHRLV06","JOSE DAVID GUERRERO CALLEROS","08DPT0013H",null,null,null,null,null,null,0,192,0,null,null,null,null,null,null,0,192,0,23853.599999999999]
[null,"CHIHUAHUA","GUMG891202IP6","GUMG891202MCHTRR04","GRECIA REYNA GUTIERREZ MARRUFO","08DPT0013H",null,null,null,null,null,null,0,228,0,null,null,null,null,null,null,0,228,0,28326.179999999997]
[null,"CHIHUAHUA","HEAN911008UH6","HEAN911008MCHRLN03","NANCY ELIZABETH HEREDIA ALVARADO","08DPT0013H",null,null,null,null,null,null,0,228,0,null,null,null,null,null,null,0,228,0,25062.9]
[null,"CHIHUAHUA","HEAL6501012W6","HEAL650101HCHRRR04","LORENZO HERNANDEZ ARMENTA","08DPT0013H",null,null,null,null,null,null,0,240,0,null,null,null,null,null,null,0,240,0,34305]
[null,"CHIHUAHUA","HEPM870418QNA","HEPM870418MDFRRR08","MARY CARMEN HERNANDEZ PERALES","08DPT0013H",null,null,null,null,null,null,0,240,0,null,null,null,null,null,null,0,240,0,34305]
[null,"CHIHUAHUA","IAVJ901113B56","IAVJ901113HVZXRL02","JULIO CESAR IXBA VARGAS","08DPT0013H",null,null,null,null,null,null,0,240,0,null,null,null,null,null,null,0,240,0,34305]
[null,"CHIHUAHUA","JUAS860801FD3","JUAS860801MCHRLL00","SILVIA ANGELICA JUAREZ ALVARADO","08DPT0013H",null,null,null,null,null,null,0,240,0,null,null,null,null,null,null,0,240,0,34305]
[null,"CHIHUAHUA","LERK931113PQ5","LERK931113MCHCNR03","KARLA PAOLA LECHUGA RONQUILLO","08DPT0013H",null,null,null,null,null,null,0,108,0,null,null,null,null,null,null,0,108,0,13417.680000000002]
[null,"CHIHUAHUA","LINM5608318QA","LINM560731HDFVTG06","MIGUEL ARTURO LIEVANO NORMAN","08DPT0013H",null,null,null,null,null,null,0,150,0,null,null,null,null,null,null,0,150,0,16488.75]
[null,"CHIHUAHUA","LOMR7805084Z7","LOMR780508HCHRNL09","RAUL ERNESTO LOERA MONARREZ","08DPT0013H",null,null,null,null,null,null,0,240,0,null,null,null,null,null,null,0,240,0,34305]
[null,"CHIHUAHUA","LOAA850515Q46","LOAA850515HCHPRL03","ALEJANDRO LOPEZ ARMENDARIZ","08DPT0013H",null,null,null,null,null,null,0,240,0,null,null,null,null,null,null,0,240,0,29817]
[null,"CHIHUAHUA","LOCS771008517","LOCS771008HCHPRR09","SERGIO LOPEZ DE LA CRUZ","08DPT0013H",null,null,null,null,null,null,0,240,0,null,null,null,null,null,null,0,240,0,34305]
[null,"CHIHUAHUA","MAGT901211DE9","MAGT901211MCHLNH09","THANIA GUADALUPE MALDONADO GONZALEZ","08DPT0013H",null,null,null,null,null,null,0,240,0,null,null,null,null,null,null,0,240,0,34305]
[null,"CHIHUAHUA","MAGC661008FYA","MAGC661008HCHRNN09","CANDELARIO MARTINEZ GONZALEZ","08DPT0013H",null,null,null,null,null,null,0,240,0,null,null,null,null,null,null,0,240,0,25728.75]
[null,"CHIHUAHUA","MEMO900505E38","MEMO900505HCHDJM04","OMAR ALONSO MEDINA MUJICA","08DPT0013H",null,null,null,null,null,null,0,240,0,null,null,null,null,null,null,0,240,0,26382]
[null,"CHIHUAHUA","METJ941115RJ7","METJ941115MCHDNN07","JENIFFER MEDINA TUNCHEZ","08DPT0013H",null,null,null,null,null,null,0,112,0,null,null,null,null,null,null,0,112,0,12311.6]
[null,"CHIHUAHUA","MUSF8807088K7","MUSF880708HCHRLR03","FRANCISCO JAVIER MURILLO SALAZAR","08DPT0013H",null,null,null,null,null,null,0,240,0,null,null,null,null,null,null,0,240,0,26382]
[null,"CHIHUAHUA","NUEG910323HJ7","NUEG910323HCHXSL05","GUILLERMO ALEJANDRO NUÑEZ ESTRADA","08DPT0013H",null,null,null,null,null,null,0,80,0,null,null,null,null,null,null,0,80,0,11435]
[null,"CHIHUAHUA","OESG9309215R5","OESG930921HCHJLB01","GABRIEL ARMANDO OJEDA SALAS","08DPT0013H",null,null,null,null,null,null,0,240,0,null,null,null,null,null,null,0,240,0,26382]
[null,"CHIHUAHUA","OISE771121RD9","OISE771121HCHLNL07","ELIAS HERIBERTO OLIVAS SAENZ","08DPT0013H",null,null,null,null,null,null,0,240,0,null,null,null,null,null,null,0,240,0,29817]
[null,"CHIHUAHUA","POGD861005KA6","POGD861005MCHRMN00","DANIELA PORRAS GOMEZ","08DPT0013H",null,null,null,null,null,null,0,240,0,null,null,null,null,null,null,0,240,0,34305]
[null,"CHIHUAHUA","PUZM810413GK5","PUZM810413HDGNPN02","MANUEL ANTONIO PUENTE ZAPATA","08DPT0013H",null,null,null,null,null,null,0,240,0,null,null,null,null,null,null,0,240,0,34305]
[null,"CHIHUAHUA","PUYR780420I72","PUYR780420MMCLXC00","ROCIO PULIDO YAÑEZ","08DPT0013H",null,null,null,null,null,null,0,240,0,null,null,null,null,null,null,0,240,0,34305]
[null,"CHIHUAHUA","QUPK7804119NA","QUPK780411MSRVRR11","KARLA LIZETTE  QUEVEDO PRECIADO","08DPT0013H",null,null,null,null,null,null,0,240,0,null,null,null,null,null,null,0,240,0,34305]
[null,"CHIHUAHUA","RACL961009QBA","RACL961009HCHMSS07","LUIS ARMANDO RAMIREZ CASTRO","08DPT0013H",null,null,null,null,null,null,0,168,0,null,null,null,null,null,null,0,168,0,13704.6]
[null,"CHIHUAHUA","RESJ851201GQ9","RESJ851201HCHVPV07","JAVIER EDUARDO  REVELES SAPIEN","08DPT0013H",null,null,null,null,null,null,0,240,0,null,null,null,null,null,null,0,240,0,34305]
[null,"CHIHUAHUA","ROGM9209304F8","ROGM920930HMCDLG05","MIGUEL ANGEL RODRIGUEZ GALVAN","08DPT0013H",null,null,null,null,null,null,0,240,0,null,null,null,null,null,null,0,240,0,26382]
[null,"CHIHUAHUA","RORE881219EW3","RORE881219HVZJYR07","ERNESTO IVAN ROJAS REYES","08DPT0013H",null,null,null,null,null,null,0,240,0,null,null,null,null,null,null,0,240,0,26382]
[null,"CHIHUAHUA","SASG860316EQ4","SASG860316HCHNNN09","GENARO ALONSO SAENZ SAENZ","08DPT0013H",null,null,null,null,null,null,0,228,0,null,null,null,null,null,null,0,228,0,18599.099999999999]
[null,"CHIHUAHUA","SACR870225HZ8","SACR870225HCHLLB02","ROBERTO ISMAEL SALAZAR CALDERA","08DPT0013H",null,null,null,null,null,null,0,240,0,null,null,null,null,null,null,0,240,0,34305]
[null,"CHIHUAHUA","SACE740906S3A","SACE740906HCLLMN05","ENRIQUE  SALAZAR CAMPOS","08DPT0013H",null,null,null,null,null,null,0,240,0,null,null,null,null,null,null,0,240,0,34305]
[null,"CHIHUAHUA","SARC911030SC8","SARC911030HCHLMR00","CARLOS SALGADO ROMO","08DPT0013H",null,null,null,null,null,null,0,240,0,null,null,null,null,null,null,0,240,0,29817]
[null,"CHIHUAHUA","SESU611116K12","SESU611116HDFGRL05","ULISES SEGURA SIERRA","08DPT0013H",null,null,null,null,null,null,0,240,0,null,null,null,null,null,null,0,240,0,19578]
[null,"CHIHUAHUA","SIER8905149W5","SIER890514MCHGSS03","ROSA SELENE SIGALA ESQUIVEL","08DPT0013H",null,null,null,null,null,null,0,240,0,null,null,null,null,null,null,0,240,0,34305]
[null,"CHIHUAHUA","SORR740817E88","SORR740817HCHSDC09","RICARDO SOSA RODRIGUEZ","08DPT0013H",null,null,null,null,null,null,0,240,0,null,null,null,null,null,null,0,240,0,34305]
[null,"CHIHUAHUA","TECI630106UW7","TECI630106MDFLBS09","MARIA ISABEL TELLEZ GIRON COBOS","08DPT0013H",null,null,null,null,null,null,0,240,0,null,null,null,null,null,null,0,240,0,29817]
[null,"CHIHUAHUA","TOEJ9207179L1","TOEJ920717HCHRSS09","JESUS TORRES ESTRADA","08DPT0013H",null,null,null,null,null,null,0,228,0,null,null,null,null,null,null,0,228,0,25062.9]
[null,"CHIHUAHUA","TORR840104UJ5","TORR840104MCHRMQ05","RAQUEL IVETTE TORRES RAMIREZ","08DPT0013H",null,null,null,null,null,null,0,240,0,null,null,null,null,null,null,0,240,0,29817]
[null,"CHIHUAHUA","UUMM850610TB5","UUMM850610HCHNNN02","MANUEL EDUARDO UNZUETA MONTES","08DPT0013H",null,null,null,null,null,null,0,240,0,null,null,null,null,null,null,0,240,0,29817]
[null,"CHIHUAHUA","VATB930812JK4","VATB930812MCHLRR05","BRENDA SUJEY VALADEZ TRUJILLO","08DPT0013H",null,null,null,null,null,null,0,216,0,null,null,null,null,null,null,0,216,0,26835.3]
[null,"CHIHUAHUA","VEPS7608116K0","VEPS760811MCHLBS04","SUSANA ADRIANA VELAZQUEZ POBLANO","08DPT0013H",null,null,null,null,null,null,0,240,0,null,null,null,null,null,null,0,240,0,34305]
[null,"CHIHUAHUA","VIPL700512EU4","VIPL700512HCHDRS00","JOSE LUIS VIDAÑA PEREZ","08DPT0013H",null,null,null,null,null,null,0,228,0,null,null,null,null,null,null,0,228,0,32589.780000000002]
[null,"CHIHUAHUA","LIAL810304JK3","LIAL810304MCHCRL00","LILIANA LICON ARAGONEZ","00XXX0000X",null,null,null,null,null,null,null,null,null,null,null,null,1,0,0,1,0,0,100611.2]
[null,"CHIHUAHUA","CATC7205274V8","CATC720527HCHNRR09","CARLOS CANO TORRES","00XXX0000X",null,null,null,1,0,0,null,null,null,null,null,null,null,null,null,1,0,0,88055.44]
[null,"CHIHUAHUA","EATH590728P67","EATH590728HCHSRG00","HUGO ESNAYRA TRISTAN","00XXX0000X",null,null,null,null,null,null,null,null,null,null,null,null,1,0,0,1,0,0,54383.88]
[null,"CHIHUAHUA","GOMD671113QD6","GOMD671113HCHMRG03","DIEGO RAUL GOMEZ MARTINEZ","00XXX0000X",null,null,null,1,0,0,null,null,null,null,null,null,null,null,null,1,0,0,88055.44]
[null,"CHIHUAHUA","MONL710121CT7","MONL710121MSLGVR08","LORENA INES MOGUEL NOVELO","00XXX0000X",null,null,null,null,null,null,null,null,null,null,null,null,1,0,0,1,0,0,66459.899999999994]
[null,"CHIHUAHUA","MOHB751008LK5","MOHB751008MMNNRL03","BLANCA ESTELA MONTAÑEZ HERNANDEZ","00XXX0000X",null,null,null,1,0,0,null,null,null,null,null,null,null,null,null,1,0,0,72348.23]
[null,"CHIHUAHUA","PALU750621U84","PAXL750621HCHLXS05","LUIS ENRIQUE PALACIOS","00XXX0000X",null,null,null,1,0,0,null,null,null,null,null,null,null,null,null,1,0,0,80536.600000000006]
[null,"CHIHUAHUA","QUEG630216GA8","QUEG630216MCHXSR02","GRACIELA QUIÑONEZ ESTRADA","00XXX0000X",null,null,null,null,null,null,null,null,null,null,null,null,1,0,0,1,0,0,66459.899999999994]
[null,"CHIHUAHUA","SAWV80120227A","SAWV801202MCLNLV05","VIVIANA SANCHEZ WILLIAMS","00XXX0000X",null,null,null,null,null,null,null,null,null,null,null,null,1,0,0,1,0,0,66459.899999999994]
[null,"CHIHUAHUA","VARM7910137D6","VARM791013MCHLMR03","MARISOL VALLES RAMOS","00XXX0000X",null,null,null,1,0,0,null,null,null,null,null,null,null,null,null,1,0,0,77147.509999999995]
[null,"CHIHUAHUA","AOCF590913PU5","AOCF590913HCHCNL08","FLAVIO FILOMENO ACOSTA CANO DE LOS RIOS","00XXX0000X",null,null,null,null,null,null,null,null,null,null,null,null,1,0,0,1,0,0,236416.25999999998]
[null,"CHIHUAHUA","AAGE900717365","AAGE900717MCHZZL09","ELIZABETH AZAETA GUZMAN","00XXX0000X",null,null,null,1,0,0,null,null,null,null,null,null,null,null,null,1,0,0,33032.43]
[null,"CHIHUAHUA","CAMH8103197WA","CAMH810319HCHRRG06","HUGO ALBERTO CARMONA MORA","00XXX0000X",null,null,null,null,null,null,null,null,null,null,null,null,1,0,0,1,0,0,75764.28]
[null,"CHIHUAHUA","DEMS680803PI5","DEMS680803MCHLXN06","SANDRA DELGADO MUÑOZ","00XXX0000X",null,null,null,1,0,0,null,null,null,null,null,null,null,null,null,1,0,0,76849.7]
[null,"CHIHUAHUA","DUCD810810J24","DUCD810810MCHRRN06","DANISSA DURAN CARO","00XXX0000X",null,null,null,1,0,0,null,null,null,null,null,null,null,null,null,1,0,0,85778.209999999992]
[null,"CHIHUAHUA","GACS670112I53","GACS670112MCHRHN02","SANDRA MARGARITA GARCIA CHAVEZ","00XXX0000X",null,null,null,1,0,0,null,null,null,null,null,null,null,null,null,1,0,0,106396.63999999998]
[null,"CHIHUAHUA","GARG760607HY8","GARG760607HCHSMS07","GUSTAVO ALONSO GASCA RAMIREZ ","00XXX0000X",null,null,null,null,null,null,null,null,null,null,null,null,1,0,0,1,0,0,75764.28]
[null,"CHIHUAHUA","LAAC860420JE7","LAAC860420MCHBPL04","CLAUDIA PATRICIA LABRADO APARICIO","00XXX0000X",null,null,null,1,0,0,null,null,null,null,null,null,null,null,null,1,0,0,63302]
[null,"CHIHUAHUA","MOSF7009259L5","MOSF700925HCHRTR02","FERNANDO ALBERTO MORA SOTO","00XXX0000X",null,null,null,1,0,0,null,null,null,null,null,null,null,null,null,1,0,0,113837.00000000001]
[null,"CHIHUAHUA","PAMA800623I22","PAMA800623MDGDRL02","PADILLA MARQUEZ ALICIA","00XXX0000X",null,null,null,1,0,0,null,null,null,null,null,null,null,null,null,1,0,0,64428.789999999994]
[null,"CHIHUAHUA","PEGC781114HZ3","PEGC781114HCHRRS06","CESAR VALENTE PEREA GARCIA ","00XXX0000X",null,null,null,1,0,0,null,null,null,null,null,null,null,null,null,1,0,0,20192.57]
[null,"CHIHUAHUA","RAMJ770419E96","RAMJ770419HSPMRS01","JESUS ALFONSO RAMIREZ MARRUFO","00XXX0000X",null,null,null,1,0,0,null,null,null,null,null,null,null,null,null,1,0,0,73677.08]
[null,"CHIHUAHUA","RAPE620309J41","RAPE620309HCHYRN08","ENRIQUE RAY PORTILLO","00XXX0000X",null,null,null,1,0,0,null,null,null,null,null,null,null,null,null,1,0,0,74102]
[null,"CHIHUAHUA","ROMF8411116Z4","ROMF841111MCHJXR01","FARINA ROJAS MUÑOZ","00XXX0000X",null,null,null,1,0,0,null,null,null,null,null,null,null,null,null,"1",0,0,36453.07]
[null,"CHIHUAHUA","SACP740829IP4","SACP740829MCHLNL05","PILAR ALICIA SALAZAR CONTRERAS","00XXX0000X",null,null,null,1,0,0,null,null,null,null,null,null,null,null,null,1,0,0,47806.39]
[null,"CHIHUAHUA","SIRS640927FF8","SIRS640927MCHLDL09","SILVIA SILVA RODRIGUEZ ","00XXX0000X",null,null,null,1,0,0,null,null,null,null,null,null,null,null,null,1,0,0,122635.43000000001]
[null,"CHIHUAHUA","VARS761230AZ5","VARS761230MCHLML03","VALENZUELA RAMIREZ SILVIA CAROLINA","00XXX0000X",null,null,null,1,0,0,null,null,null,null,null,null,null,null,null,1,0,0,44459.020000000004]
[null,"CHIHUAHUA","VAGP6007013D4","VAGP600701MCHLNT09","PATRICIA RAQUEL VALVERDE GONZALEZ","00XXX0000X",null,null,null,1,0,0,null,null,null,null,null,null,null,null,null,1,0,0,107402.38000000002]
[null,"Total Personas : ",827,null,null,null,null,null,null,null,null,null,null,null,null,null,null,null,null,null,null,"Total Recursos Ejercidos:",null,null,{"$f":"SUBTOTAL(109,Tabla11[Columna24])","v":28928029.880000018}]
[]
[null,"Fuente : Información proporcionada por las Entidades Federativas."]

{"sheet":"II C y 1_","index":6,"n_rows":848,"n_cols":22,"rows_kept":848,"cut":false,"hidden":false,"merged":[[8,1,8,8],[842,18,842,19],[11,21,12,21],[11,8,12,8],[11,9,11,15],[11,16,12,16],[11,17,12,17],[11,20,12,20],[11,18,11,19],[11,2,12,2],[11,1,12,1],[11,7,12,7],[11,6,12,6],[11,5,12,5],[11,4,12,4],[11,3,12,3]]}
[]
[]
[]
[]
[]
[]
[]
[null,"Formato: Personal Federalizado por Registro Federal de Contribuyentes"]
[null,{"$f":"IF('1'!D22=\"Elige el Periodo…\",\"\",'1'!D22)","v":"Fondo de Aportaciones para la Educación Tecnológica y de Adultos/Colegio Nacional de Educación Profesional Técnica (FAETA/CONALEP)"},null,null,null,null,null,null,null,null,null,null,null,null,null,null,null,null,null,null,"2do. Trimestre 2018"]
[]
[]
[null,"Entidad Federativa","Clave CT","Turno","RFC","CURP","Nombre","Funcion Real","Horas que labora en el Centro de Trabajo","Clave Presupuestal",null,null,null,null,null,null,"Tipo de Categoría","Identificador de Contrato de Honorarios","Periodo de efecto de pago en el trimestre",null,"Percepciones pagadas en el Periodo de Comisión con Presupuesto Federal*","Percepciones pagadas en el Periodo de Comisión con Presupuesto de otra fuente*"]
[null,null,null,null,null,null,null,null,null,"Partida Presupuestal","Código de Pago","Clave de Unidad","Clave de Sub Unidad","Clave de Categoría","Horas Semana Mes ","Número de Plaza",null,null,"Inicial","Termino"]
[]
[null,"Columna1","Columna2","Columna3","Columna4","Columna5","Columna6","Columna7","Columna8","Columna9","Columna10","Columna11","Columna12","Columna13","Columna14","Columna15","Columna16","Columna17","Columna18","Columna19","Columna20","Columna21"]
[null,"CHIHUAHUA","08DPT0001C",120,"AOML571117QI9","AOML571117MCHCRZ09","LUZ DEL CARMEN ACOSTA MARTINEZ","20212",480,83101,1003,"00",25,"CF33202",0,2367,2,null,20180401,20180630,49500.85,0]
[null,"CHIHUAHUA","08DPT0001C",120,"AEEF700614J96","AEEF700614HCHLNR00","JOSE FRANCISCO ALDERETE ENRIQUEZ","20108",480,83101,1003,"00",25,"CF33206",0,13641,2,null,20180401,20180630,113187.84,0]
[null,"CHIHUAHUA","08DPT0001C",120,"BAPF541102CN1","BAPF541102HCHCRR00","FRANCISCO ALBERTO BACA PEREZ",20212,320,83101,1003,"00",25,"CF21202",0,2376,2,null,20180401,20180531,30507.94,0]
[null,"CHIHUAHUA","08DPT0001C",120,"CACM660522B70","CACM660522HCHNHR08","MARIO RUBEN CANO CHEW","20108",480,83101,1003,"00",25,"CF33206",0,13185,2,null,20180401,20180630,65685.84,0]
[null,"CHIHUAHUA","08DPT0001C",120,"DIAM641007CI5","DIAM641007HCHZCN00","MANUEL DIAZ ACOSTA","20402",480,83101,1003,"00",25,"CF18201",0,2389,2,null,20180401,20180630,34026.720000000001,0]
[null,"CHIHUAHUA","08DPT0001C",120,"FEPH590719P2A","FEPH590719MCHRRR08","HORTENSIA FERNANDEZ PARGA","20401",480,83101,1003,"00",25,"S01202",0,2401,2,null,20180401,20180630,34391.39,0]
[null,"CHIHUAHUA","08DPT0001C",120,"GADE730513AY2","GADE730513HCHRZL06","ELIAS GARCIA DIAZ","20401",480,83101,1003,"00",25,"S01201",0,10161,2,null,20180401,20180630,41013.360000000001,0]
[null,"CHIHUAHUA","08DPT0001C",120,"GAVL610223PN1","GAVL610223MGTRLN08","LEONOR GARZON VALDEZ","50401",480,83101,1003,"00",25,"CF02103",0,12557,5,null,20180401,20180630,85992.48,0]
[null,"CHIHUAHUA","08DPT0001C",120,"GOBS630720GU7","GOBS630720MCHNLL02","SILVIA CECILIA GONZALEZ BALDERRAMA","20401",480,83101,1003,"00",25,"S01201",0,2378,2,null,20180401,20180630,30260.959999999999,0]
[null,"CHIHUAHUA","08DPT0001C",120,"GUSL800307M72","GUSL800307MCHTNL01","LILIANA GUTIERREZ SANDOVAL","20401",480,83101,1003,"00",25,"S01201",0,2391,2,null,20180401,20180630,29336.080000000002,0]
[null,"CHIHUAHUA","08DPT0001C",120,"HEFA581028JT6","HEFA581028HSRRLR03","ARISTEO HERNANDEZ FLORES",20401,64,83101,1003,"00",25,"A03202",0,2398,2,null,20180401,20180414,4531.12,0]
[null,"CHIHUAHUA","08DPT0001C",120,"HEMM670602FX4","HEMM670602HCHRRL08","MELCHOR HERNANDEZ MORALES",20108,480,83101,1003,"00",25,"CF33206",0,13189,2,null,20180401,20180630,117965.47,0]
[null,"CHIHUAHUA","08DPT0001C",120,"IAAM650713G14","IAAM650713HCLBRR06","MARTIN GENARO IBARRA ARREDONDO","20401",480,83101,1003,"00",25,"S01201",0,2374,2,null,20180401,20180630,21414.66,0]
[null,"CHIHUAHUA","08DPT0001C",200,"JUVD951202BR4","JUVD951202HCHRLN06","DANIEL FRANCISCO JUAREZ VILLALOBOS","20402",480,83101,1003,"00",25,"CF18201",0,11868,2,null,20180401,20180630,27457.09,0]
[null,"CHIHUAHUA","08DPT0001C",120,"LOCS740722BY1","LOCS740722MCHYSN03","SANDRA LOYA CASTAÑEDA","20215",480,83101,1003,"00",25,"CF04201",0,5255,2,null,20180401,20180630,46199,0]
[null,"CHIHUAHUA","08DPT0001C",120,"LOLG6105041C1","LOLG610504HCHZPR03","GERARDO LOZANO LOPEZ","20216",480,83101,1003,"00",25,"CF34202",0,2415,2,null,20180401,20180630,42313.84,0]
[null,"CHIHUAHUA","08DPT0001C",120,"MASS920625T67","MASS920625MCHNTT05","STEPHANIE MANCHA SOTO",20401,480,83101,1003,"00",25,"S01201",0,7502,2,null,20180401,20180630,30832.38,0]
[null,"CHIHUAHUA","08DPT0001C",120,"MACN5607036J8","MACN560703MCHRHR01","NORMA MARGARITA MARRUFO CHAPARRO","20105",480,83101,1003,"00",25,"CF33206",0,13187,2,null,20180401,20180630,100585.93,0]
[null,"CHIHUAHUA","08DPT0001C",120,"MERA640505HY3","MERA640505HCHNYR01","ARMANDO MENDEZ REYES",20401,480,83101,1003,"00",25,"CF34202",0,2389,2,null,20180401,20180630,27544.81,0]
[null,"CHIHUAHUA","08DPT0001C",120,"MOAP870129UT9","MOAP870129MCHLCT09","PATRICIA ARALI MOLINA ACOSTA","20401",480,83101,1003,"00",25,"CF33204",0,2392,2,null,20180401,20180630,58930.53,0]
[null,"CHIHUAHUA","08DPT0001C",120,"MOTJ521007RU5","MOTJ521007HCHRRS02","JESUS ALBERTO MORENO TORRES","20215",480,83101,1003,"00",25,"A03202",0,2373,2,null,20180401,20180630,46227.81,0]
[null,"CHIHUAHUA","08DPT0001C",200,"NAOG680625QA5","NAOG680625HCHRRL00","GUILLERMO NICOLAS NARVAEZ ORDAZ","20212",480,83101,1003,"00",25,"T08201",0,10784,2,null,20180401,20180630,45670.97,0]
[null,"CHIHUAHUA","08DPT0001C",120,"NAWA860622JI6","NAWA860622HCHVGL05","ALEJANDRO MAURICIO NAVARRO WAGNER","20105",480,83101,1003,"00",25,"CF02105",0,12821,5,null,20180401,20180630,66459.899999999994,0]
[null,"CHIHUAHUA","08DPT0001C",120,"OOSJ921202I59","OOSJ921202HCHCTR06","JORGE ROBERTO OCHOA SOTELO",20401,400,83101,1003,"00",25,"A03202",0,10169,2,null,20180430,20180630,19463.55,0]
[null,"CHIHUAHUA","08DPT0001C",120,"PEZR580319EY1","PEZR580319MCLRVS09","ROSA MARIA PEREZ ZUBIA","20401",480,83101,1003,"00",25,"S01201",0,2410,2,null,20180401,20180630,36023.629999999997,0]
[null,"CHIHUAHUA","08DPT0001C",200,"PIRE860510KC2","PIRE860510HCHZBS00","PIZANO RUBIO ESTALI",20401,480,83101,1003,"00",25,"S01201",0,7502,2,null,20180401,20180630,30301.61,0]
[null,"CHIHUAHUA","08DPT0001C",200,"PODM630929V60","PODM630929HCHRZG02","MIGUEL PORTILLO DIAZ","20104",480,83101,1003,"00",25,"CF33204",0,2405,2,null,20180401,20180630,37124.120000000003,0]
[null,"CHIHUAHUA","08DPT0001C",120,"QUHM750313QX2","QUHM750313HZSNZN02","MANUEL QUINTERO HUIZAR",20401,72,83101,1003,"01",25,"CF18201",0,11868,2,null,20180616,20180630,2361.17,0]
[null,"CHIHUAHUA","08DPT0001C",120,"RAGN6608306N3","RAGN660830MCHMMR01","NORMA RAMIREZ GOMEZ","20206",480,83101,1003,"00",25,"CF19201",0,2416,2,null,20180401,20180630,46220.73,0]
[null,"CHIHUAHUA","08DPT0001C",120,"REVB701115KRA","REVB701115MCHGTH02","BERDINA REGALADO VITELA","20216",480,83101,1003,"00",25,"CF33204",0,9333,2,null,20180401,20180630,81140.679999999993,0]
[null,"CHIHUAHUA","08DPT0001C",120,"REMV840531384","REMV840531HCHYRC03","VICTOR MANUEL REYES MURILLO","20104",480,83101,1003,"00",25,"CF33204",0,2384,2,null,20180401,20180630,61189.7,0]
[null,"CHIHUAHUA","08DPT0001C",120,"REOS610731NK2","REOS610731MCHZLL01","SILVIA PATRICIA REZA OLIVAS","20102",480,83101,1003,"00",25,"CF33206",0,13184,2,null,20180401,20180630,121308.29,0]
[null,"CHIHUAHUA","08DPT0001C",120,"ROCG710423BI2","ROCG710423MCHDNL05","GILDA ALEJANDRINA RODRIGUEZ CANO","20215",480,83101,1003,"00",25,"A03202",0,2375,2,null,20180401,20180630,41386.06,0]
[null,"CHIHUAHUA","08DPT0001C",200,"ROVB9202105WA","ROVB920210HCHDLR05","BRYAN ARMANDO RODRIGUEZ VALVERDE","20401",480,83101,1003,"00",25,"S01201",0,2394,2,null,20180401,20180630,27922.81,0]
[null,"CHIHUAHUA","08DPT0001C",120,"RUDA711227IH4","RUDA711227HCHLLR08","ARTURO RUELAS DELGADO",20108,480,83101,1003,"00",25,"CF33206",0,14134,2,null,20180401,20180630,75692.649999999994,0]
[null,"CHIHUAHUA","08DPT0001C",120,"SOPF600927M49","SOPF600927MCHTRR08","FERNANDA SOTELO PEREZ","20402",480,83101,1003,"00",25,"CF18201",0,2370,2,null,20180401,20180630,30726.5,0]
[null,"CHIHUAHUA","08DPT0001C",120,"TOEB620314DK2","TOEB620314HCHRNR09","BERNARDO TORRES ENRIQUEZ","20401",480,83101,1003,"00",25,"S01202",0,2374,2,null,20180401,20180630,37612.29,0]
[null,"CHIHUAHUA","08DPT0001C",200,"VAAH770519CJ9","VAAH770519HCHZRC04","HECTOR MANUEL VAZQUEZ ARMENDARIZ","20401",480,83101,1003,"00",25,"S01201",0,2374,2,null,20180401,20180630,32264.81,0]
[null,"CHIHUAHUA","08DPT0001C",120,"VIRC720302LS1","VIRC720302MCHLVR06","MARIA CRISTINA VILLAGRAN RIVERA","20215",480,83101,1003,"00",25,"A03202",0,10169,5,null,20180401,20180630,44828.72,0]
[null,"CHIHUAHUA","08DPT0001C",120,"VIJD921113BZ7","VIJD921113HCHLRG00","DIEGO EMMANUEL VILLALBA JUAREZ","20105",480,83101,1003,"00",25,"CF33204",0,2385,2,null,20180401,20180630,57879.54,0]
[null,"CHIHUAHUA","08DPT0001C",100,"AOZL821127LL7","AOZL821127HCHCVS03","LUIS ALBERTO ACOSTA ZAVALA",30102,120,83101,1001,"00",25,"L5XC","10.0",0,3,null,20180401,20180630,14179.5,0]
[null,"CHIHUAHUA","08DPT0001C",200,"AUAJ750122A5A","AUAJ750122HCHGGS03","JESUS AGUILAR AGUILAR",30102,120,83101,1001,"00",25,"L5XC",10,0,3,null,20180401,20180630,14179.5,0]
[null,"CHIHUAHUA","08DPT0001C",100,"AULE8612293K4","AULE861229MCHGRL05","AGUIRRE LOERA ELDA EUNICE",30102,180,83101,1001,"00",25,"L5XATEC",15,0,3,null,20180401,20180630,16398,0]
[null,"CHIHUAHUA","08DPT0001C",200,"AAMF560125R89","AAMF560125HCHLNL07","FLAVIO RAUL  ALVAREZ MONTOYA",30102,180,83101,1001,"00",25,"L5XC",15,0,3,null,20180401,20180630,21269.279999999999,0]
[null,"CHIHUAHUA","08DPT0001C",100,"AATL801210PB4","AATL801210MCHLNR06","LOURDES ADRIANA ALVAREZ TINTTORI",30102,180,83101,1001,"00",25,"L5XC","15.0",0,3,null,20180401,20180630,21269.279999999999,0]
[null,"CHIHUAHUA","08DPT0001C",100,"AIOM820517TC5","AIOM820517MCHVLR08","MARIANA AVILA  OLIVAS",30102,240,83101,1001,"00",25,"L5XC",20,0,3,null,20180401,20180630,28359,0]
[null,"CHIHUAHUA","08DPT0001C",100,"AAGJ821023VC5","AAGJ821023MCHZZS17","JESSICA CORAL AZAETA GUZMAN",30102,180,83101,1001,"00",25,"L5XATEC",15,0,3,null,20180401,20180630,16398,0]
[null,"CHIHUAHUA","08DPT0001C",120,"BAFR630210M78","BAFR630210HCHQRC02","RICARDO BAQUERA  FRESCAS",30102,228,83101,1001,"00",25,"L5XCBI",19,0,3,null,20180401,20180630,23344.38,0]
[null,"CHIHUAHUA","08DPT0001C",100,"BAAA801202930","BAAA801202HCHRLL09","ALBERTO GUERRERO BARRAZA ALVAREZ",30102,240,83101,1001,"00",25,"L5XC","20.0",0,3,null,20180401,20180630,28359,0]
[null,"CHIHUAHUA","08DPT0001C",100,"BURS661015RT6","BURS661015HCHSSL07","SALVADOR  BUSTILLOS RASCON",30102,108,83101,1001,"00",25,"L5XC","9.0",0,3,null,20180401,20180630,12761.58,0]
[null,"CHIHUAHUA","08DPT0001C",100,"CAAM640422S63","CAAM640422MCHMRR08","MARTHA LETICIA CAMPOS ARISMENDI",30102,216,83101,1001,"00",25,"L5XC","18.0",0,3,null,20180401,20180630,25523.1,0]
[null,"CHIHUAHUA","08DPT0001C",200,"CARG7105218G9","CARG710521HCHMMR07","GERARDO CAMPOS RAMIREZ",30102,228,83101,1001,"00",25,"L5XC","19.0",0,3,null,20180401,20180630,26941.08,0]
[null,"CHIHUAHUA","08DPT0001C",100,"CASR730827BZ2","CASR730827HCHNTM09","RAMON ARMANDO CANO SOTO",30102,240,83101,1001,"00",25,"L5XCBI",20,0,3,null,20180401,20180630,24573,0]
[null,"CHIHUAHUA","08DPT0001C",100,"CABA600225IW2","CABA600225MCHRRR09","ARACELI CARRASCO BARRAZA",30102,180,83101,1001,"00",25,"L5XC","15.0",0,3,null,20180401,20180630,21269.279999999999,0]
[null,"CHIHUAHUA","08DPT0001C",100,"CAON860317HL0","CAON860317MCHRCL00","NALLELY  YESENIA CARRASCO OCHOA",30102,108,83101,1001,"00",25,"L5XCBI","9.0",0,3,null,20180401,20180630,12761.58,0]
[null,"CHIHUAHUA","08DPT0001C",120,"CAJM671130A58","CAJM671130HCHRRR04","MAURO GERARDO CARRILLO JUAREZ",30102,228,83101,1001,"00",25,"L5XATEC","19.0",0,3,null,20180401,20180630,23344.38,0]
[null,"CHIHUAHUA","08DPT0001C",120,"CAAI5611206JA","CAAI561120MCHSRD05","IDELIA CASTRO ARMENDARIZ",30102,228,83101,1001,"00",25,"L5XC","19.0",0,3,null,20180401,20180630,26941.08,0]
[null,"CHIHUAHUA","08DPT0001C",200,"CAFL660707EI1","CAFL660707MCHZLY06","LYDIA CAZARES  FLORES",30102,180,83101,1001,"00",25,"L5XCBI","15.0",0,3,null,20180401,20180630,18429.78,0]
[null,"CHIHUAHUA","08DPT0001C",200,"CEBE680921RL5","CEBE680921HCHNCL06","ELEAZAR  MATEO CENICEROS  BECERRA",30102,168,83101,1001,"00",25,"L5XC",14,0,3,null,20180401,20180630,19851.3,0]
[null,"CHIHUAHUA","08DPT0001C",200,"CEMC581222Q78","CEMC581222MCHRLL09","CLARA CERVANTES  MELENDEZ",30102,240,83101,1001,"00",25,"L5XC","20.0",0,3,null,20180401,20180630,28359,0]
[null,"CHIHUAHUA","08DPT0001C",200,"CAJF670208887","CAJF670208HCHHRR03","FERNANDO CHACON JURADO",30102,228,83101,1001,"00",25,"L5XC",19,0,3,null,20180401,20180630,26941.08,0]
[null,"CHIHUAHUA","08DPT0001C",100,"CAGL640918UT9","CAGL640918MCHHMR07","MARIA DE LOURDES CHAVIRA GOMEZ",30102,180,83101,1001,"00",25,"L5XC","15.0",0,3,null,20180401,20180630,21269.279999999999,0]
[null,"CHIHUAHUA","08DPT0001C",100,"DIAF6905309M4","DIAF690530HDGZLR08","FRANCISCO ROBERTO DIAZ  ALVARADO",30102,144,83101,1001,"00",25,"L5XATEC","12.0",0,3,null,20180401,20180630,12286.5,0]
[null,"CHIHUAHUA","08DPT0001C",100,"DOTM5605051B1","DOTM560505MCHMRR05","MARGARITA DOMINGUEZ  TREVIZO",30102,180,83101,1001,"00",25,"L5XC","15.0",0,3,null,20180401,20180630,21269.279999999999,0]
[null,"CHIHUAHUA","08DPT0001C",200,"EARE580710MW7","EARE580710MMCRQL06","ELSA AMALIA ERRASQUIN  ROQUE",30102,144,83101,1001,"00",25,"L5XC","12.0",0,3,null,20180401,20180630,17015.400000000001,0]
[null,"CHIHUAHUA","08DPT0001C",100,"EOOC700117F69","EOOC700117HCHSRR08","CARLOS ESCOBEDO ORTEGA",30102,180,83101,1001,"00",25,"L5XC","15.0",0,3,null,20180401,20180630,21269.279999999999,0]
[null,"CHIHUAHUA","08DPT0001C",100,"EACM621211KN0","EACM621211HCHSHR04","MARTIN ESPARZA  CHAVEZ",30102,204,83101,1001,"00",25,"L5XATEC","17.0",0,3,null,20180401,20180630,24105.18,0]
[null,"CHIHUAHUA","08DPT0001C",100,"EADR661019BU9","EADR661019HCHSZM08","ESPARZA DIAZ RAMON",30102,120,83101,1001,"00",25,"L5XC","10.0",0,3,null,20180401,20180630,10932,0]
[null,"CHIHUAHUA","08DPT0001C",200,"EILJ680419MG0","EILJ680419HCHSNR05","JORGE ALBERTO  ESPINOZA  LUNA",30102,204,83101,1001,"00",25,"L5XC","17.0",0,3,null,20180401,20180630,24105.18,0]
[null,"CHIHUAHUA","08DPT0001C",200,"FECA6103137A4","FECA610313HDFRLB09","ABELARDO FERNANDEZ  CALDERON",30102,216,83101,1001,"00",25,"L5XCBI",18,0,3,null,20180401,20180630,22115.7,0]
[null,"CHIHUAHUA","08DPT0001C",200,"FOFL641113DP1","FOFL641113HCHLLS06","LUIS ALBERTO FLORES  FLORES",30102,180,83101,1001,"00",25,"L5XC","15.0",0,3,null,20180401,20180630,21269.279999999999,0]
[null,"CHIHUAHUA","08DPT0001C",100,"GAMR760920E78","GAMR760920MCHLNT06","RUTH GALLEGOS  MONARCA",30102,192,83101,1001,"00",25,"L5XC","16.0",0,3,null,20180401,20180630,22687.200000000001,0]
[null,"CHIHUAHUA","08DPT0001C",200,"GAVF750826318","GAVF750826HCHLLR05","FRANCISCO AGUSTIN GALLEGOS  VILLASEÑOR",30102,144,83101,1001,"00",25,"L5XC","12.0",0,3,null,20180401,20180630,17015.400000000001,0]
[null,"CHIHUAHUA","08DPT0001C",100,"GALR830327972","GALR830327MCHRYS00","ROSA HERLINADA GARCIA LOYA",30102,80,83101,1001,"00",25,"L5XCBI","10.0",0,3,null,20180401,20180630,14179.5,0]
[null,"CHIHUAHUA","08DPT0001C",120,"GALJ810323DN3","GALJ810323HCHRZS03","JESUS SAUL GARCIA  LOZANO",30102,216,83101,1001,"00",25,"L5XCBI","18.0",0,3,null,20180401,20180630,25523.1,0]
[null,"CHIHUAHUA","08DPT0001C",200,"GAMG821026JM8","GAMG821026HDGRRB08","GABINO GARCIA  MARRUFO",30102,240,83101,1001,"00",25,"L5XATEC","20.0",0,3,null,20180401,20180630,28359,0]
[null,"CHIHUAHUA","08DPT0001C",120,"GAOM870316CN9","GAOM870316HCHRRG00","JOSE MIGUEL GARCIA ORTIZ",30102,216,83101,1001,"00",25,"L5XATEC","18.0",0,3,null,20180401,20180630,25523.1,0]
[null,"CHIHUAHUA","08DPT0001C",100,"GAGJ811020H48","GAGJ811020HCHRNN01","JUAN EDUARDO GARDEA GINER",30102,152,83101,1001,"00",25,"L5XC","19.0",0,3,null,20180401,20180630,23344.38,0]
[null,"CHIHUAHUA","08DPT0001C",100,"GAVV7810103W7","GAVV781010MCHRZR06","VERONICA GARDEA  VAZQUEZ",30102,180,83101,1001,"00",25,"L5XCBl",15,0,3,null,20180401,20180630,21269.279999999999,0]
[null,"CHIHUAHUA","08DPT0001C",200,"GOAC860518J59","GOAC860518HCHMVR06","CARLOS JOEL GOMEZ AVILA",30102,228,83101,1001,"00",25,"L5XCBI",19,0,3,null,20180401,20180630,23344.38,0]
[null,"CHIHUAHUA","08DPT0001C",120,"GOHS731228LU7","GOHS731228HCHNLM00","GONZALEZ HOLGUIN SIMON",30102,180,83101,1001,"00",25,"L5XATEC",15,0,3,null,20180401,20180630,18429.78,0]
[null,"CHIHUAHUA","08DPT0001C",120,"HEAM7409112X6","HEAM740911MCHRRR00","MARCELA HERNANDEZ ARMENDARIZ",30102,240,83101,1001,"00",25,"L5XC",20,0,3,null,20180401,20180630,28359,0]
[null,"CHIHUAHUA","08DPT0001C",100,"HERA781214D5A","HERA781214HCHRMR02","AARON TERCERO HERNANDEZ ROMO",30102,216,83101,1001,"00",25,"L5XC","18.0",0,3,null,20180401,20180630,25523.1,0]
[null,"CHIHUAHUA","08DPT0001C",120,"HESM4812063X7","HESM481206HDFRGR09","MARIO HERNANDEZ SEGURA",30102,180,83101,1001,"00",25,"L5XC",15,0,3,null,20180401,20180630,21269.279999999999,0]
[null,"CHIHUAHUA","08DPT0001C",120,"HEMB811018BN2","HEMB811018MCHRNT06","BEATRIZ ELENA HERRERA  MENDOZA",30102,216,83101,1001,"00",25,"L5XC",18,0,3,null,20180401,20180630,25523.1,0]
[null,"CHIHUAHUA","08DPT0001C",100,"JIVG670122BN0","JIVG670122HCHMLD01","GAUDENCIO JIMENEZ VALENTIN",30102,180,83101,1001,"00",25,"L5XCBI",15,0,3,null,20180401,20180630,21269.279999999999,0]
[null,"CHIHUAHUA","08DPT0001C",120,"LESO760401T71","LESO760401HCHLXM07","OMAR LEAL SEAÑEZ",30102,108,83101,1001,"00",25,"L5XCBI","9.0",0,3,null,20180401,20180630,12761.58,0]
[null,"CHIHUAHUA","08DPT0001C",120,"LOGM811218IW7","LOGM811218MCHRNY01","MYRNA GUADALUPE LOERA GONZALEZ",30102,60,83101,1001,"00",25,"L5XC",15,0,3,null,20180401,20180430,6143.26,0]
[null,"CHIHUAHUA","08DPT0001C",200,"LOMM630709QH3","LOMM630709MCHPRR06","MIRIAM LOPEZ  MARQUEZ",30102,144,83101,1001,"00",25,"L5XC","12.0",0,3,null,20180401,20180630,17015.400000000001,0]
[null,"CHIHUAHUA","08DPT0001C",200,"LOCJ610711AFA","LOCJ610711HCHYHV06","JAVIER BENJAMIN LOYA CHAVIRA",30102,240,83101,1001,"00",25,"L5XC","20.0",0,3,null,20180401,20180630,28359,0]
[null,"CHIHUAHUA","08DPT0001C",200,"LOHL711219AQ3","LOHL711219MCHYRL02","LILIANA IVONNE LOYA  HERNANDEZ",30102,180,83101,1001,"00",25,"L5XATEC","15.0",0,3,null,20180401,20180630,21269.279999999999,0]
[null,"CHIHUAHUA","08DPT0001C",100,"LORJ800906MC9","LORJ800906HCHYDS03","JESUS ARTURO LOYA RODRIGUEZ",30102,180,83101,1001,"00",25,"L5XCBI","15.0",0,3,null,20180401,20180630,18429.78,0]
[null,"CHIHUAHUA","08DPT0001C",100,"MAGP631129C83","MAGP631129HCHRNR03","PERFECTO MARQUEZ GONZALEZ",30102,192,83101,1001,"00",25,"L5XCBI",16,0,3,null,20180401,20180630,19658.400000000001,0]
[null,"CHIHUAHUA","08DPT0001C",200,"MACC861013NB9","MACC861013HCHRLR03","CARLOS ISAAC MARRUFO CALDERON",30102,180,83101,1001,"00",25,"L5XCBI","15.0",0,3,null,20180401,20180630,21269.279999999999,0]
[null,"CHIHUAHUA","08DPT0001C",100,"MELE840906AR7","MELE840906HCHDYD07","EDGAR IVAN MEDINA LOYA",30102,144,83101,1001,"00",25,"L5XCBI","18.0",0,3,null,20180401,20180630,22115.7,0]
[null,"CHIHUAHUA","08DPT0001C",200,"MEMM770410518","MEMM770410HCHRNN08","MANUEL MERAZ MENDEZ",30102,192,83101,1001,"00",25,"L5XATEC",16,0,3,null,20180401,20180630,22687.200000000001,0]
[null,"CHIHUAHUA","08DPT0001C",100,"MURE810806BI4","MURE810806HCHXJM09","MUÑOZ ROJAS EMMANUEL",30102,240,83101,1001,"00",25,"L5XC",20,0,3,null,20180401,20180630,24573,0]
[null,"CHIHUAHUA","08DPT0001C",100,"NAME521010PW5","NAME521010HCHVNN03","ENRIQUE NAVARRO MENDOZA",30102,192,83101,1001,"00",25,"L5XC","16.0",0,3,null,20180401,20180630,22687.200000000001,0]
[null,"CHIHUAHUA","08DPT0001C",200,"OIAO791026IM2","OIAO791026HCHLPS00","OSCAR ERNESTO OLIVAS APONTE",30102,120,83101,1001,"00",25,"L5XC","10.0",0,3,null,20180401,20180630,14179.5,0]
[null,"CHIHUAHUA","08DPT0001C",100,"OILR550330775","OILR550330HCHLPG01","ROGELIO OLIVAS LOPEZ",30102,204,83101,1001,"00",25,"L5XC","17.0",0,3,null,20180401,20180630,24105.18,0]
[null,"CHIHUAHUA","08DPT0001C",120,"OEZH720627D54","OEZH720627HCHRBG04","HUGO ORTEGA ZUBIATE",30102,192,83101,1001,"00",25,"L5XATEC","16.0",0,3,null,20180401,20180630,22687.200000000001,0]
[null,"CHIHUAHUA","08DPT0001C",200,"PARM520707MY1","PARM520707HPLLCG03","MIGUEL ANGEL PALMA ROCHA",30102,96,83101,1001,"00",25,"L5XCBI",8,0,3,null,20180401,20180630,8745.6,0]
[null,"CHIHUAHUA","08DPT0001C",100,"PAGM7008098P1","PAGM700809HCHRRR01","MAURO RUBEN PARADA GRANADOS",30102,96,83101,1001,"00",25,"L5XCBI",8,0,3,null,20180401,20180630,11343.6,0]
[null,"CHIHUAHUA","08DPT0001C",120,"PARF590815ED3","PARF590815MVZVSL20","FELICITAS  PAVON ROSAS",30102,216,83101,1001,"00",25,"L5XATEC","18.0",0,3,null,20180401,20180630,20477.5,0]
[null,"CHIHUAHUA","08DPT0001C",100,"PAVE830228SH0","PAVE830228HCHZLN00","ENRIQUE PAZOS VALLES",30102,228,83101,1001,"00",25,"L5XC","19.0",0,3,null,20180401,20180630,23344.38,0]
[null,"CHIHUAHUA","08DPT0001C",200,"PEFR790621C3A","PEFR790621HCHRGB13","ROBERTO AARON PEREA FIGUEROA",30102,144,83101,1001,"00",25,"L5XC","12.0",0,3,null,20180401,20180630,13118.4,0]
[null,"CHIHUAHUA","08DPT0001C",200,"PECA750727I8A","PECA750727HJCRRL03","ALEJANDRO PEREZ CORTES",30102,144,83101,1001,"00",25,"L5XC","12.0",0,3,null,20180401,20180630,17015.400000000001,0]
[null,"CHIHUAHUA","08DPT0001C",200,"PICN620328PA0","PICN620328HVZNRR07","JOSE NORBERTO PINEDA CRUZ",30102,144,83101,1001,"00",25,"L5XC",12,0,3,null,20180401,20180630,17015.400000000001,0]
[null,"CHIHUAHUA","08DPT0001C",100,"PIRL7804262E7","PIRL780426MCHXZZ09","MARIA LIZETH PIÑON RUIZ",30102,240,83101,1001,"00",25,"L5XC",20,0,3,null,20180401,20180630,28359,0]
[null,"CHIHUAHUA","08DPT0001C",200,"QURM640822CE7","QURM640822MCHNZR02","MARTINA LILIA QUINTANA  RUIZ",30102,204,83101,1001,"00",25,"L5XC","17.0",0,3,null,20180401,20180630,24105.18,0]
[null,"CHIHUAHUA","08DPT0001C",200,"RAGG600206G85","RAGG600206MCHMTR04","GRACIELA RAMIREZ  GUTIERREZ",30102,144,83101,1001,"00",25,"L5XC",12,0,3,null,20180401,20180630,17015.400000000001,0]
[null,"CHIHUAHUA","08DPT0001C",120,"RAMA741011N9A","RAMA741011MCHMRN00","ANABEL RAMOS  MORALES",30102,240,83101,1001,"00",25,"L5XC","20.0",0,3,null,20180401,20180630,28359,0]
[null,"CHIHUAHUA","08DPT0001C",200,"RARN711008BK5","RARN711008MCHSMR09","NORMA PATRICIA RASCON RAMIREZ",30102,240,83101,1001,"00",25,"L5XC","20.0",0,3,null,20180401,20180630,28359,0]
[null,"CHIHUAHUA","08DPT0001C",100,"RECN560808KM6","RECN560808MCHYRR00","MARIA NORMA REYES CARREON",30102,168,83101,1001,"00",25,"L5XC","14.0",0,3,null,20180401,20180630,19851.3,0]
[null,"CHIHUAHUA","08DPT0001C",100,"REOL730620M72","REOL730620MCHYRC05","LUCIA REYES ORTIZ",30102,240,83101,1001,"00",25,"L5XATEC","20.0",0,3,null,20180401,20180630,28359,0]
[null,"CHIHUAHUA","08DPT0001C",200,"RIMI820220GQ7","RIMI820220HCHVCV02","RIVERA MACIAS IVAN JOEL",30102,96,83101,1001,"00",25,"L5XC","8.0",0,3,null,20180401,20180630,9829.2000000000007,0]
[null,"CHIHUAHUA","08DPT0001C",100,"ROSL660422DP2","ROSL660422HCHDLZ09","MARIA DE LA LUZ  RODARTE  SOLIS",30102,204,83101,1001,"00",25,"L5XATEC","17.0",0,3,null,20180401,20180630,24105.18,0]
[null,"CHIHUAHUA","08DPT0001C",100,"ROAA871025FU9","ROAA871025HCHDGL07","ALBERTO RODRIGUEZ AGUIRRE",30102,216,83101,1001,"00",25,"L5XC",18,0,3,null,20180401,20180630,22115.7,0]
[null,"CHIHUAHUA","08DPT0001C",120,"ROGJ6301201E0","ROGJ630120MCHDZS08","MARIA DE JESUS RODRIGUEZ GUZMAN",30102,192,83101,1001,"00",25,"L5XC","16.0",0,3,null,20180401,20180630,22687.200000000001,0]
[null,"CHIHUAHUA","08DPT0001C",100,"ROAL730412EQ6","ROAL730412HCHJRS01","LUIS JAVIER ROJAS ARAGONEZ",30102,228,83101,1001,"00",25,"L5XCBI","19.0",0,3,null,20180401,20180630,26941.08,0]
[null,"CHIHUAHUA","08DPT0001C",200,"ROPV750812QL5","ROPV750812HCHMCC00","VICTOR MANUEL ROMERO PACHECO",30102,120,83101,1001,"00",25,"L5XATEC ","10.0",0,3,null,20180401,20180630,12286.5,0]
[null,"CHIHUAHUA","08DPT0001C",200,"ROTO850629550","ROTO850629HCHNRS06","OSCAR ARMANDO RONQUILLO TERAN ",30102,120,83101,1001,"00",25,"L5XATEC ","10.0",0,3,null,20180401,20180630,10932,0]
[null,"CHIHUAHUA","08DPT0001C",120,"ROVI820310797","ROVI820310MCLNLV07","IVAN RAMON RONQUILLO VILLALBA",30102,216,83101,1001,"00",25,"L5XC",18,0,3,null,20180401,20180630,25523.1,0]
[null,"CHIHUAHUA","08DPT0001C",100,"RUNH860818SE6","RUNH860818HCHBJM07","HUMERTO ALONSO RUBIO NAJERA",30102,180,83101,1001,"00",25,"L5XC",15,0,3,null,20180515,20180630,13118.4,0]
[null,"CHIHUAHUA","08DPT0001C",100,"RUMS740226UR4","RUMS740226MCHZRL09","MARIA SOLEDAD RUIZ MARQUEZ",30102,216,83101,1001,"00",25,"L5XC","18.0",0,3,null,20180401,20180630,25523.1,0]
[null,"CHIHUAHUA","08DPT0001C",100,"SAQG720512BW2","SAQG720512MCHNXD07","GUADALUPE   SAENZ  QUIÑONEZ",30102,204,83101,1001,"00",25,"L5XC","17.0",0,3,null,20180401,20180630,24105.18,0]
[null,"CHIHUAHUA","08DPT0001C",200,"SEAI880810AV4","SEAI880810MCHRMR02","IRIS ROSALI SERNA AMPARAN",30102,192,83101,1001,"00",25,"L5XCBI","16.0",0,3,null,20180401,20180630,19658.400000000001,0]
[null,"CHIHUAHUA","08DPT0001C",120,"SIML5803182A8","SIML580318HCHLJS14","JOSE LUIS CARLOS SILVEYRA MEJIA",30102,240,83101,1001,"00",25,"L5XC",20,0,3,null,20180401,20180630,28359,0]
[null,"CHIHUAHUA","08DPT0001C",200,"TAAD800122GU1","TAAD800122HCHRRL07","DELFINO TARIN ARMENDARIZ",30102,216,83101,1001,"00",25,"L5XCBI",18,0,3,null,20180401,20180630,25523.1,0]
[null,"CHIHUAHUA","08DPT0001C",100,"UIOM910617AH6","UIOM910617MCHRRR00","URIZA ORTIZ MARIBEL",30102,168,83101,1001,"00",25,"L5XCBI","14.0",0,3,null,20180401,20180630,17201.099999999999,0]
[null,"CHIHUAHUA","08DPT0001C",200,"VACA610212RT2","VACA610212HCHLHD01","ADOLFO VALLES  CHAVEZ",30102,240,83101,1001,"00",25,"L5XC","20.0",0,3,null,20180401,20180630,28359,0]
[null,"CHIHUAHUA","08DPT0001C",100,"VADS631230CN3","VADS631230MCHLVL06","SILVIA LETICIA VALVERDE DAVILA",30102,240,83101,1001,"00",25,"L5XC",20,0,3,null,20180401,20180630,28359,0]
[null,"CHIHUAHUA","08DPT0001C",100,"VIRR710926945","VIRR710926HCHLDB12","RUBEN   VILLALOBOS RODRIGUEZ",30102,240,83101,1001,"00",25,"L5XC","20.0",0,3,null,20180401,20180630,28359,0]
[null,"CHIHUAHUA","08DPT0001C",200,"VIPR570927K44","VIPR570927HCHLYF07","RAFAEL JESUS VILLEGAS PAYAN",30102,240,83101,1001,"00",25,"L5XCBI",20,0,3,null,20180401,20180630,28359,0]
[null,"CHIHUAHUA","08DPT0002B",200,"AARL701222GC6","AARL701222MCHRVB04","LIBIA GABRIELA ARAGON RIVERA",30102,240,83101,1001,"00",26,"L5XC",20,0,3,null,20180401,20180630,34305,0]
[null,"CHIHUAHUA","08DPT0002B",200,"BAGR640911VB4","BAGR640911HCHRND09","RODOLFO ELI BARONA GONZALEZ",30102,120,83101,1001,"00",26,"L5XCBII",10,0,3,null,20180401,20180630,14908.5,0]
[null,"CHIHUAHUA","08DPT0002B",100,"BOAI840527A86","BOAI840527MCHRGN00","MARIA INES BORUNDA AGUILAR",30102,240,83101,1001,"00",26,"L5XC","20.0",0,3,null,20180401,20180630,34305,0]
[null,"CHIHUAHUA","08DPT0002B",200,"CACS480226NE5","CACS480226HGTMPL06","SALVADOR CAMPOS CAPETILLO",30102,180,83101,1001,"00",26,"L5XC",15,0,3,null,20180401,20180630,25728.780000000002,0]
[null,"CHIHUAHUA","08DPT0002B",100,"CAPH630209KZ0","CAPH630209MCHRSL06","HILDA MARGARITA CARRASCO POSADA",30102,120,83101,1001,"00",26,"L5XC","10.0",0,3,null,20180401,20180630,17152.5,0]
[null,"CHIHUAHUA","08DPT0002B",100,"COCD901004DB8","COCD901004MCHRHN09","DAINA ROCIO CORTES CHAVEZ",30102,216,83101,1001,"00",26,"L5XCBII","18.0",0,3,null,20180401,20180630,26835.3,0]
[null,"CHIHUAHUA","08DPT0002B",120,"EABM680229EQ9","EABM680229MCHSDR08","MARTHA GUADALUPE ESCALANTE BADILLO",30102,240,83101,1001,"00",26,"L5XCBII","20.0",0,3,null,20180401,20180630,29817,0]
[null,"CHIHUAHUA","08DPT0002B",200,"EOHA790831RH0","EOHA790831MZSSRN01","MARIA DE LOS ANGELES ESCOBAR DE HARO",30102,240,83101,1001,"00",26,"L5XC","20.0",0,3,null,20180401,20180630,34305,0]
[null,"CHIHUAHUA","08DPT0002B",100,"FAMA641105R5A","FAMA641105MCHVRL07","ALMA ISABEL FAVELA MARTINEZ",30102,120,83101,1001,"00",26,"L5XC","10.0",0,3,null,20180401,20180630,15437.280000000002,0]
[null,"CHIHUAHUA","08DPT0002B",100,"FOLS800726I38","FOLS800726MCHLCN07","SANDYANA FLORES LUCERO",30102,228,83101,1001,"00",26,"L5XC","19.0",0,3,null,20180401,20180630,32589.780000000002,0]
[null,"CHIHUAHUA","08DPT0002B",100,"FONE671109ME3","FONE671109MCHLVS06","ESPERANZA FLORES NAVARRO",30102,216,83101,1001,"00",26,"L5XC","18.0",0,3,null,20180401,20180630,30874.5,0]
[null,"CHIHUAHUA","08DPT0002B",200,"GAGC810607AX3","GAGC810607MCHRRH23","CHRISTIAN BELEN GARCIA GARCIA",30102,240,83101,1001,"00",26,"L5XC","20.0",0,3,null,20180401,20180630,34305,0]
[null,"CHIHUAHUA","08DPT0002B",200,"GALJ860302G54","GALJ860302HGTRNV04","JAVIER GARCIA LUNA",30102,120,83101,1001,"00",26,"L5XC",10,0,3,null,20180401,20180630,17152.5,0]
[null,"CHIHUAHUA","08DPT0002B",200,"GOLC890608AQ0","GOLC890608MCHMRY05","CYNTHIA LILIANA GOMEZ LARA",30102,216,83101,1001,"00",26,"L5XATEC",18,0,3,null,20180401,20180630,23743.8,0]
[null,"CHIHUAHUA","08DPT0002B",200,"GOAJ891103DFA","GOAJ891103HCHNLR08","JORGE OMAR GONZALEZ ALVIDREZ",30102,144,83101,1001,"00",26,"L5XATEC",12,0,3,null,20180401,20180630,15829.2,0]
[null,"CHIHUAHUA","08DPT0002B",200,"GOCY840110NQ4","GOCY840110MCHNLS07","YSELA GONZALEZ CALDERA",30102,216,83101,1001,"00",26,"L5XC","18.0",0,3,null,20180401,20180630,30874.5,0]
[null,"CHIHUAHUA","08DPT0002B",200,"GOMA851115JC8","GOMA851115HCHNRR07","AARON ROBERTO GONZALEZ MORAN",30102,204,83101,1001,"00",26,"L5XC","17.0",0,3,null,20180401,20180630,29159.280000000002,0]
[null,"CHIHUAHUA","08DPT0002B",100,"GOPS780818LH4","GOPS780818HCHNRR01","SERGIO GONZALEZ PEREZ",30102,240,83101,1001,"00",26,"L5XC","20.0",0,3,null,20180401,20180630,34305,0]
[null,"CHIHUAHUA","08DPT0002B",100,"GOCE790701I32","GOXC790701MCHNLX06","CELIA BRISA GONZALEZ ",30102,192,83101,1001,"00",26,"L5XC","16.0",0,3,null,20180401,20180630,27444,0]
[null,"CHIHUAHUA","08DPT0002B",100,"GUFD63111111A","GUFD631111MSLVRN17","DINA YESENIA GUEVARA FIERRO",30102,240,83101,1001,"00",26,"L5XC","20.0",0,3,null,20180401,20180630,34305,0]
[null,"CHIHUAHUA","08DPT0002B",100,"HEDC640302NR2","HEDC640302HZSRZR01","CARLOS HERNANDEZ DIAZ",30102,240,83101,1001,"00",26,"L5XC","20.0",0,3,null,20180401,20180630,34305,0]
[null,"CHIHUAHUA","08DPT0002B",200,"IARL8304031L7","IARL830403HZSBMS09","LUIS ROMAN IBARRA  RAMOS",30102,192,83101,1001,"00",26,"L5XCBII","16.0",0,3,null,20180401,20180630,23853.599999999999,0]
[null,"CHIHUAHUA","08DPT0002B",200,"JAAZ890626IJ1","JAAZ890626MCHSVM08","ZIMRI DANIEL JASSO AVILA",30102,228,83101,1001,"00",26,"L5XCBII","19.0",0,3,null,20180401,20180630,28326.179999999997,0]
[null,"CHIHUAHUA","08DPT0002B",120,"LARR970308D62","LARR970308HCHRSY09","RAYMUNDO LARA RIOS",30102,240,83101,1001,"00",26,"L5XCBI",20,0,3,null,20180401,20180630,19578,0]
[null,"CHIHUAHUA","08DPT0002B",120,"LAOE880302RW2","LAOE880302MCHZRL08","ELIZA ARELY LAZALDE ORTIZ",30102,228,83101,1001,"00",26,"L5XCBII","19.0",0,3,null,20180401,20180630,28326.179999999997,0]
[null,"CHIHUAHUA","08DPT0002B",200,"LEGF590530LW9","LEGF590530HCHNTR00","FERNANDO LEON GUTIERREZ",30102,240,83101,1001,"00",26,"L5XC","20.0",0,3,null,20180401,20180630,34305,0]
[null,"CHIHUAHUA","08DPT0002B",120,"LOCA790201FP3","LXCA790201HCHRSD09","ADRIAN FRANCISCO LOERA  CASTRO",30102,240,83101,1001,"00",26,"L5XC","20.0",0,3,null,20180401,20180630,34305,0]
[null,"CHIHUAHUA","08DPT0002B",200,"LORF830406762","LORF830406HCHPML02","FELIPE LOPEZ RAMIREZ",30102,180,83101,1001,"00",26,"L5XCBII","15.0",0,3,null,20180401,20180630,22362.780000000002,0]
[null,"CHIHUAHUA","08DPT0002B",100,"LURG880415UKA","LURG880415MCHNVB04","GABRIELA ALEJANDRA LUNA  RIVAS",30102,216,83101,1001,"00",26,"L5XC","18.0",0,3,null,20180401,20180630,30874.5,0]
[null,"CHIHUAHUA","08DPT0002B",200,"MARJ6706253G1","MARJ670625HCHRSN08","JUAN FRANCISCO MARQUEZ DE LA ROSA",30102,240,83101,1001,"00",26,"L5XCBII","20.0",0,3,null,20180401,20180630,29817,0]
[null,"CHIHUAHUA","08DPT0002B",200,"MAHR7303052U1","MAHR730305HCHRRG05","RIGOBERTO MARTINEZ HERNANDEZ",30102,240,83101,1001,"00",26,"L5XCBII","20.0",0,3,null,20180401,20180630,29817,0]
[null,"CHIHUAHUA","08DPT0002B",200,"MARE920423KX8","MARE920423MCHRNR05","ERIKA ELIZABETH MARTINEZ RANGEL",30102,180,83101,1001,"00",26,"L5XCBII","15.0",0,3,null,20180401,20180630,22362.780000000002,0]
[null,"CHIHUAHUA","08DPT0002B",100,"MAER7001128F3","MAER700112MCHTSQ04","RAQUEL  MATA ESPARZA",30102,240,83101,1001,"00",26,"L5XC","20.0",0,3,null,20180401,20180630,34305,0]
[null,"CHIHUAHUA","08DPT0002B",120,"MEMA740518TM8","MEMA740518HCHLLL03","ALFONSO NATANAEL MELENDEZ MELENDEZ",30102,228,83101,1001,"00",26,"L5XCBII","19.0",0,3,null,20180401,20180630,28326.179999999997,0]
[null,"CHIHUAHUA","08DPT0002B",200,"MEPF691219UT3","MEPF691219HCHLRR06","FRANCISCO JAVIER MELENDEZ PEREYRA",30102,216,83101,1001,"00",26,"L5XC","18.0",0,3,null,20180401,20180630,30874.5,0]
[null,"CHIHUAHUA","08DPT0002B",200,"MERE811126DU3","MERE811126MCHLMD02","EDNA MELINA MELERO RAMIREZ",30102,216,83101,1001,"00",26,"L5XC","18.0",0,3,null,20180401,20180630,30874.5,0]
[null,"CHIHUAHUA","08DPT0002B",100,"MEMN800616CH0","MEMN800616MZSNRR04","NORA DE LOURDES MENDEZ MARRUFO",30102,216,83101,1001,"00",26,"L5XC","18.0",0,3,null,20180401,20180630,30874.5,0]
[null,"CHIHUAHUA","08DPT0002B",100,"MEPM521007BW0","MEPM521007MSPNTR05","MARINA MENDOZA PATIÑO",30102,240,83101,1001,"00",26,"L5XC","20.0",0,3,null,20180401,20180630,34305,0]
[null,"CHIHUAHUA","08DPT0002B",100,"MEHE771226AK0","MEHE771226MCHZRM07","EMMA MARINA MEZA HERNANDEZ",30102,228,83101,1001,"00",26,"L5XC","19.0",0,3,null,20180401,20180630,32589.780000000002,0]
[null,"CHIHUAHUA","08DPT0002B",100,"MONJ730522LH4","MONJ730522HCHLXN04","JUAN BENJAMIN MOLINA NUÑEZ",30102,216,83101,1001,"00",26,"L5XATEC","18.0",0,3,null,20180401,20180630,23743.8,0]
[null,"CHIHUAHUA","08DPT0002B",200,"MOAI970902SU8","MOAI970902HCHNRS09","ISAAC MONREAL ARVIZU",30102,240,83101,1001,"00",26,"L5XCBI",20,0,3,null,20180401,20180630,19578,0]
[null,"CHIHUAHUA","08DPT0002B",200,"MOMC840319BC9","MOMC840319MCHRRR09","CARMINA SARA MORENO MORALES",30102,240,83101,1001,"00",26,"L5XCBII","20.0",0,3,null,20180401,20180630,29817,0]
[null,"CHIHUAHUA","08DPT0002B",200,"NARE6212101N2","NARE621210HCHVDL15","ELISEO MANUEL NAVA RODRIGUEZ",30102,192,83101,1001,"00",26,"L5XC","16.0",0,3,null,20180401,20180630,27444,0]
[null,"CHIHUAHUA","08DPT0002B",100,"NAMR911217QR2","NAMR911217MCHVRY09","REYNA GUADALUPE NAVARRETE MARROQUIN",30102,240,83101,1001,"00",26,"L5XATEC","20.0",0,3,null,20180401,20180630,26382,0]
[null,"CHIHUAHUA","08DPT0002B",100,"OICT750827I13","OICT750827MCHLRR05","MARIA TERESA OLIVAS  CORONADO",30102,168,83101,1001,"00",26,"L5XC",14,0,3,null,20180401,20180630,24013.5,0]
[null,"CHIHUAHUA","08DPT0002B",200,"OEZA770117EH9","OEZA770117HCHRPL04","ALFREDO LORENZO ORTEGA ZEPEDA",30102,240,83101,1001,"00",26,"L5XC",20,0,3,null,20180401,20180630,34305,0]
[null,"CHIHUAHUA","08DPT0002B",200,"PAVM750409GD9","PAVM750409HCLLRR05","JOSE MARIA PALACIOS VARELA",30102,96,83101,1001,"00",26,"L5XCBI",8,0,3,null,20180401,20180630,10552.8,0]
[null,"CHIHUAHUA","08DPT0002B",100,"PEGC920119FE4","PEGC920119MCHXRL07","CLAUDIA SELENE PEÑA GUARDADO",30102,192,83101,1001,"00",26,"L5XCBI",16,0,3,null,20180401,20180630,21105.599999999999,0]
[null,"CHIHUAHUA","08DPT0002B",120,"PEGF4912049U3","PEGF491204HCHRRR02","FRANCISCO PEREZ GUERRERO",30102,228,83101,1001,"00",26,"L5XC","19.0",0,3,null,20180401,20180630,32589.780000000002,0]
[null,"CHIHUAHUA","08DPT0002B",200,"PELI800928FR2","PELI800928HCHRPG01","JOSE IGNACIO PEREZ LOPEZ",30102,156,83101,1001,"00",26,"LX5ATEC","13.0",0,3,null,20180401,20180630,17148.3,0]
[null,"CHIHUAHUA","08DPT0002B",100,"PIMR770113LW6","PIMR770113MCLNXC04","ROCIO PINTO MUÑOZ",30102,228,83101,1001,"00",26,"L5XC","19.0",0,3,null,20180401,20180630,32589.780000000002,0]
[null,"CHIHUAHUA","08DPT0002B",200,"POGH680928E46","POGH680928HCHRTC09","HECTOR MIGUEL PORRAS GUTIERREZ",30102,228,83101,1001,"00",26,"L5XC","19.0",0,3,null,20180401,20180630,32589.780000000002,0]
[null,"CHIHUAHUA","08DPT0002B",100,"QUMJ930605SD1","QUMJ930605HCHZRV04","JAVIER ARTURO QUEZADA MORA",30102,216,83101,1001,"00",26,"L5XATEC",18,0,3,null,20180401,20180630,23743.8,0]
[null,"CHIHUAHUA","08DPT0002B",100,"RABM8107186R9","RAVM810718MCHMRR16","MIRIAM SUSANA RAMIREZ BARRERA",30102,240,83101,1001,"00",26,"L5XC","20.0",0,3,null,20180401,20180630,34305,0]
[null,"CHIHUAHUA","08DPT0002B",200,"RACJ670625F74","RACJ670625HCHMRN00","JUAN RAMON RAMIREZ CORRAL",30102,180,83101,1001,"00",26,"L5XC","15.0",0,3,null,20180401,20180630,25728.780000000002,0]
[null,"CHIHUAHUA","08DPT0002B",200,"RALK790326386","RALK790326MCHMPR08","KARINA CECILIA RAMIREZ LOPEZ",30102,240,83101,1001,"00",26,"L5XC","20.0",0,3,null,20180401,20180630,28587.5,0]
[null,"CHIHUAHUA","08DPT0002B",100,"RAVJ750924S61","RAVJ750924HCHMLN06","JUAN GABRIEL RAMIREZ VELA",30102,228,83101,1001,"00",26,"L5XCBII","19.0",0,3,null,20180401,20180630,28326.179999999997,0]
[null,"CHIHUAHUA","08DPT0002B",100,"REFG8206303T2","REFG820630MCLYLR05","GRISELDA REYES FLORES",30102,180,83101,1001,"00",26,"L5XATEC",15,0,3,null,20180401,20180630,19786.5,0]
[null,"CHIHUAHUA","08DPT0002B",100,"RIOH600504T14","RIOH600504HCHVLC08","HECTOR RAMON RIVERA OLIVAS",30102,204,83101,1001,"00",26,"L5XC","17.0",0,3,null,20180401,20180630,29159.280000000002,0]
[null,"CHIHUAHUA","08DPT0002B",100,"ROAL7201241P5","ROAL720124MCHDVD01","LIDIA ANGELICA RODRIGUEZ AVILA",30102,228,83101,1001,"00",26,"L5XC","19.0",0,3,null,20180401,20180630,32589.780000000002,0]
[null,"CHIHUAHUA","08DPT0002B",120,"ROMM8706134U5","ROMM870613HCHDNN05","MANUEL ANTONIO RODRIGUEZ MONREAL",30102,144,83101,1001,"00",26,"L5XATEC",12,0,3,null,20180401,20180630,15829.2,0]
[null,"CHIHUAHUA","08DPT0002B",100,"ROPE5908038V9","ROPE590803HCHDRL01","ELIGIO RODRIGUEZ PRIETO",30102,240,83101,1001,"00",26,"L5XCBII","20.0",0,3,null,20180401,20180630,29817,0]
[null,"CHIHUAHUA","08DPT0002B",200,"SAVY820923BCA","SAVY820923MCHLLM00","YAMET VERENICE SALAZAR VELAZQUEZ",30102,240,83101,1001,"00",26,"L5XC","20.0",0,3,null,20180401,20180630,34305,0]
[null,"CHIHUAHUA","08DPT0002B",200,"SELV800114DJ4","SELV800114HCHGZC03","VICTOR ANDRES SEGOVIA LOZOYA",30102,228,83101,1001,"00",26,"L5XC","19.0",0,3,null,20180401,20180630,32589.780000000002,0]
[null,"CHIHUAHUA","08DPT0002B",100,"SOOA7210299X8","SOOA721029MCHLLN06","ANA LUISA SOLIS OLIVAS",30102,180,83101,1001,"00",26,"L5XC",15,0,3,null,20180401,20180630,25728.780000000002,0]
[null,"CHIHUAHUA","08DPT0002B",200,"TERG520428J43","TERG520428HDFLVL09","GUILLERMO TELLEZ REVILLA",30102,240,83101,1001,"00",26,"L5XC",20,0,3,null,20180401,20180630,34305,0]
[null,"CHIHUAHUA","08DPT0002B",100,"VAOA630813IE8","VAOA630813MDGLRN07","ANGELA MARIA VALTIERRA  ORTEGA",30102,240,83101,1001,"00",26,"L5XC",20,0,3,null,20180401,20180630,34305,0]
[null,"CHIHUAHUA","08DPT0002B",200,"YAGC851128SX6","YAGC851128MCHXNY03","CYNTHIA AURORA YAÑEZ GONZALEZ",30102,180,83101,1001,"00",26,"L5XC",15,0,3,null,20180401,20180630,25728.780000000002,0]
[null,"CHIHUAHUA","08DPT0002B",200,"AUPC720823662","AUPC720823MZSGLL09","CLARA AGÜERO PALACIOS",20214,"480.0","83101","1003","00","26","S01201",0,"2440","2",null,20180401,20180630,44284.91,0]
[null,"CHIHUAHUA","08DPT0002B",120,"AUSL630319SG0","AUSL630319HZSGFC09","JOSE LUCIANO AGUILERA SIFUENTES","20101",480,83101,1003,"00",26,"CF33206",0,13754,2,null,20180401,20180630,125302.86999999998,0]
[null,"CHIHUAHUA","08DPT0002B",100,"AAAJ9101208M3","AAAJ910120HCHLCS03","JESUS FABIAN ALVARADO  ACOSTA","20401",480,83101,1003,"00",26,"S01201",0,2431,2,null,20180401,20180630,37046.269999999997,0]
[null,"CHIHUAHUA","08DPT0002B",100,"AAAN671110TZ0","AAAN671110MCHLCC06","NICOLASA ALVARADO  ACOSTA","20201",480,83101,1003,"00",26,"CF33204",0,9182,2,null,20180401,20180630,113781.95,0]
[null,"CHIHUAHUA","08DPT0002B",100,"AAEM620508I55","AAEM620508HCLLSG04","MIGUEL ANGEL ALVARADO  ESPARZA","20401",480,83101,1003,"00",26,"CF19201",0,2447,2,null,20180401,20180630,42358.09,0]
[null,"CHIHUAHUA","08DPT0002B",120,"AISJ790419494","AISJ790419HCHRTN04","JUAN MANUEL ARIAS  SOTELO","20206",480,83101,1003,"00",26,"CF33204",0,2435,2,null,20180401,20180630,83636.36,0]
[null,"CHIHUAHUA","08DPT0002B",100,"AIBC800120C20","AIBC800120HCHVLS02","CESAR NOE AVILA BOLIVAR",20401,480,83101,1003,"00",26,"S01201",0,2440,2,null,20180401,20180630,20530.050000000003]
[null,"CHIHUAHUA","08DPT0002B",100,"BAML650601B92","BAML650601HDFRLS03","JOSE LUIS  BARRIENTOS MILAN","20401",480,83101,1003,"00",26,"S01201",0,2444,2,null,20180401,20180630,33984.14,0]
[null,"CHIHUAHUA","08DPT0002B",200,"BOMA6710214E1","BOMA671021HDFLXR07","ARMANDO BOLAÑOS MUÑOZ","20205",480,83101,1003,"00",26,"CF33204",0,2432,2,null,20180401,20180630,100343.75,0]
[null,"CHIHUAHUA","08DPT0002B",100,"CAPL820818LQ5","CAPL820818HCHMRS04","LUIS ROBERTO CAMPOS PORTILLO","20206",480,83101,1003,"00",26,"S01202",0,10590,2,null,20180401,20180630,40701.46,0]
[null,"CHIHUAHUA","08DPT0002B",100,"CACL731031A17","CACL731031MCHRNR01","LORENA CARRILLO CANO","20215",480,83101,1003,"00",26,"S01202",0,2426,2,null,20180401,20180630,33829.14,0]
[null,"CHIHUAHUA","08DPT0002B",100,"CARJ6012178GA","CARJ601217HCHRLS07","JOSE DE JESUS CARRILLO RUELAS","20401",480,83101,1003,"00",26,"S01202",0,2434,2,null,20180401,20180630,47045.380000000005,0]
[null,"CHIHUAHUA","08DPT0002B",100,"CARP8408274S7","CARP840827MCHHCR02","PERLA CHAVEZ ROCHA",20215,480,83101,1003,"00",26,"CF33204",0,2441,2,null,20180401,20180630,83716.670000000013,0]
[null,"CHIHUAHUA","08DPT0002B",120,"CIBA710920FVA","CIBA710920MDGTRL04","ALMA ROSA CITAL BERTAHUD","20101",480,83101,1003,"00",26,"CF33206",0,14304,2,null,20180401,20180630,118401.97,0]
[null,"CHIHUAHUA","08DPT0002B",200,"COMA6908143J5","COXM690814HCHNXR11","MARIO CONTRERAS N/A","20206",480,83101,1003,"00",26,"CF18203",0,2420,2,null,20180401,20180630,57249.820000000014,0]
[null,"CHIHUAHUA","08DPT0002B",200,"CURL721031RX6","CURL721031HCHVVS02","JOSE LUIS CUEVAS RIVERA",20401,480,83101,1003,"00",26,"CF18201",0,2422,2,null,20180401,20180630,16172.04]
[null,"CHIHUAHUA","08DPT0002B",100,"DEMA661118M56","DEMA661118HCHLRB07","JOSE ABELARDO DELGADO  MORALES","20205",480,83101,1003,"00",26,"CF33204",0,2429,2,null,20180401,20180630,95414.380000000019,0]
[null,"CHIHUAHUA","08DPT0002B",100,"EAGK7806257R9","EAGK780625MCHSBR04","KARLA ESPARZA GABALDON",20109,400,83101,1003,"00",26,"CF33206",0,13756,2,null,20180401,20180630,98474.37]
[null,"CHIHUAHUA","08DPT0002B",200,"FACF8611101I7","FACF861110HCHVNR02","FERNANDO FAVELA  CONTRERAS","20401",480,83101,1003,"00",26,"CF19201",0,2451,2,null,20180401,20180630,38680.76,0]
[null,"CHIHUAHUA","08DPT0002B",100,"FIGS610608SA8","FIGS610608MJCGNL02","SILVIA FIGUEROA GONZALEZ","20206",480,83101,1003,"00",26,"CF33204",0,2433,2,null,20180401,20180630,92214.83,0]
[null,"CHIHUAHUA","08DPT0002B",200,"GAMA6609167M4","GAXM660916MCHLXR06","MARIBEL GALLARDO N/A","20216",480,83101,1003,"00",26,"CF34201",0,11119,2,null,20180401,20180630,47104.44,0]
[null,"CHIHUAHUA","08DPT0002B",100,"GAAD780823AVA","GAAD780823MCHRLL01","DULCE AURORA DEL CONSUELO GARCIA ALEMAN",20214,480,83101,1003,"00",26,"CF33204",0,10007,2,null,20180401,20180630,57032.53,0]
[null,"CHIHUAHUA","08DPT0002B",100,"GALE580105G5A","GALE580105HCHRNN03","ENRIQUE GARCIA DE LUNA","20302",480,83101,1003,"00",26,"S01202",0,2421,2,null,20180401,20180630,42941.8,0]
[null,"CHIHUAHUA","08DPT0002B",100,"LAGP591112155","LAGP591112HCHRYD07","PEDRO LARES GAYTAN","20302",480,83101,1003,"00",26,"S01202",0,2455,2,null,20180401,20180630,42632.03,0]
[null,"CHIHUAHUA","08DPT0002B",100,"LIHJ9107073M0","LIHJ910707HCHRRS09","JASSON RAYMUNDO LIRA HERRERA","20211",480,83101,1003,"00",26,"S01201",0,2428,2,null,20180401,20180630,35891.589999999997,0]
[null,"CHIHUAHUA","08DPT0002B",100,"LOCJ6307091T8","LOCJ630709HCHPRS08","JESUS MARTIN LOPEZ CARO","20102",480,83101,1003,"00",26,"CF33206",0,13757,2,null,20180401,20180630,117769.37,0]
[null,"CHIHUAHUA","08DPT0002B",100,"LORE9304089K5","LORE930408HCHYSR01","EARVIN MANUEL LOYA  RIOS","20205",480,83101,1003,"00",26,"CF18201",0,2453,2,null,20180401,20180630,32450.11,0]
[null,"CHIHUAHUA","08DPT0002B",200,"LOCJ681030V96","LOCJ681030HCHZLS07","JESUS EDUARDO LOZOYA  CALDERON","20302",480,83101,1003,"00",26,"A03202",0,2419,2,null,20180401,20180630,48549.899999999994,0]
[null,"CHIHUAHUA","08DPT0002B",100,"MODC711228F67","MODC711228HCLNRR07","CARLOS EDUARDO MONTANO DURAN","20211",480,83101,1003,"00",26,"S01202",0,2434,5,null,20180401,20180630,100611.18,0]
[null,"CHIHUAHUA","08DPT0002B",100,"MOSG761016858","MOSG761016HCLNNR06","GERARDO MONTOYA SANCHEZ","20401",480,83101,1003,"00",26,"S01201",0,2440,2,null,20180401,20180630,40022.89,0]
[null,"CHIHUAHUA","08DPT0002B",100,"OOGL660522NA4","OOGL660522HCHCRS08","LUIS FELIX OCHOA GARCIA","20305",480,83101,1003,"00",26,"CF18203",0,2442,2,null,20180401,20180630,37519.53,0]
[null,"CHIHUAHUA","08DPT0002B",100,"OORE7405071DA","OORE740507MCHRYS00","MARIA ESTHER OROZCO REYES","20211",480,83101,1003,"00",26,"ED01201",0,2424,2,null,20180401,20180630,47440.04,0]
[null,"CHIHUAHUA","08DPT0002B",100,"RARF8407015TA","RARF840701MCHMML00","FLOR MINERVA RAMIREZ RAMIREZ",20214,480,83101,1003,"00",26,"CF04201",0,2418,2,null,20180401,20180630,47671.87,0]
[null,"CHIHUAHUA","08DPT0002B",200,"ROGJ6511161S5","ROGJ651116HDGCRN00","JUAN JESUS ROCHA GARCIA","20301",480,83101,1003,"00",26,"CF18203",0,2436,2,null,20180401,20180630,48921.11,0]
[null,"CHIHUAHUA","08DPT0002B",100,"ROGM631230AD4","ROGM631230MCHMRR18","MARCIA IMELDA ROMERO GARCIA","20406",480,83101,1003,"00",26,"S01202",0,131,2,null,20180401,20180630,44496.149999999994,0]
[null,"CHIHUAHUA","08DPT0002B",120,"SAPP7109042V0","SAPP710904HCHLLD06","PEDRO SALAS PALOMINO","20214",480,83101,1003,"00",26,"CF33204",0,2459,2,null,20180401,20180630,95414.38,0]
[null,"CHIHUAHUA","08DPT0002B",100,"TULO5510064A6","TULO551006MCHDYL01","OLGA ESPERANZA TUDA LEYVA",20109,480,83101,1003,"00",26,"CF33206",0,9278,2,null,20180401,20180630,84978.680000000008]
[null,"CHIHUAHUA","08DPT0002B",200,"VASF7408232D8","VASF740823HCHLLR05","FRANCISCO JAVIER VALVERDE SALAZAR","20401",400,83101,1003,"00",26,"CF18201",0,2422,2,null,20180401,20180630,47197.31]
[null,"CHIHUAHUA","08DPT0002B",100,"VASC8109266G6","VASC810926MCHLLL08","CLAUDIA VALVERDE SALAZAR","20211",480,83101,1003,"00",26,"ED01201",0,2445,2,null,20180401,20180630,6273.09,0]
[null,"CHIHUAHUA","08DPT0002B",100,"VAFM681203S84","VAFM681203MCHZGR05","MARICRUZ VAZQUEZ FIGUEROA","20203",480,83101,1003,"00",26,"CF19201",0,2451,2,null,20180401,20180630,84086.670000000013,0]
[null,"CHIHUAHUA","08DPT0003A",120,"AUVJ9103083J2","AUVJ910308HCHGLN07","AGUIRRE VILLARREAL JUAN DE DIOS",20401,400,83101,1003,"01",56,"S01201",0,7494,2,null,20180401,20180615,17845.55,0]
[null,"CHIHUAHUA","08DPT0003A",120,"AOOC791125GF8","AOOC791125HCHLRR17","ALOR ORTEGA CRISTHIAN OMAR",20109,480,83101,1003,"01",56,"CF33206",0,13763,2,null,20180401,20180630,76485.63,0]
[null,"CHIHUAHUA","08DPT0003A",120,"AEHL721013358","AEHL721013MCHRRR04","ARMENDARIZ HUERTA LAURA ELENA",20216,480,83101,1003,"01",56,"CF19201",0,7495,2,null,20180401,20180630,43933.17,0]
[null,"CHIHUAHUA","08DPT0003A",120,"AOGA850323MS8","AOGA850323MCHRRD09","ARZOLA GARIBAY ADRIANA",20216,480,83101,1003,"01",56,"CF33203",0,7484,2,null,20180401,20180630,41884.6,0]
[null,"CHIHUAHUA","08DPT0003A",120,"BALJ741015QJ5","BALJ741015HNTCPR09","BACA LOPEZ JORGE GERARDO",50401,480,83101,1003,"01",56,"CF02103",0,12683,5,null,20180401,20180630,85992.48,0]
[null,"CHIHUAHUA","08DPT0003A",120,"CALS630411D26","CALS630411HCHNSL01","CANO LEOS SALVADOR",20206,480,83101,1003,"01",56,"CF02103",0,12683,5,null,20180401,20180630,93363.41,0]
[null,"CHIHUAHUA","08DPT0003A",120,"COSC761202AU8","COSC761202MCHRNL00","CORONADO SAENZ CLAUDIA",20215,480,83101,1003,"01",56,"CF02105",0,14575,2,null,20180401,20180630,50737.69,0]
[null,"CHIHUAHUA","08DPT0003A",120,"CORE740806FH5","CORE740806HCHRYN08","CORRAL REYES ENCARNACION",20401,480,83101,1003,"01",56,"CF34202",0,7498,2,null,20180401,20180630,33593.42,0]
[null,"CHIHUAHUA","08DPT0003A",120,"EABJ810502G45","EABJ810502HCHSYR08","ESPARZA BAYLON JORGE HUMBERTO",20215,480,83101,1003,"01",56,"S01201",0,7498,2,null,20180401,20180630,29780.9,0]
[null,"CHIHUAHUA","08DPT0003A",120,"EIHE740513ST9","EIHE740513MCHSRV03","ESPINOSA HERNANDEZ EVA CELINA",20216,480,83101,1003,"01",56,"CF33206",0,14307,2,null,20180401,20180630,76080.350000000006,0]
[null,"CHIHUAHUA","08DPT0003A",120,"FAJA861008RA4","FAJA861008MCHRRL05","FRANCO JURADO MARIA ALEJANDRA",20216,480,83101,1003,"01",56,"CF33206",0,13765,2,null,20180401,20180630,68950.06,0]
[null,"CHIHUAHUA","08DPT0003A",120,"GAFS650908R84","GAFS650908HCHRLR07","GARCIA FLORES SERGIO MARTIN",20212,480,83101,1003,"01",56,"A03202",0,7472,2,null,20180401,20180630,39981.51,0]
[null,"CHIHUAHUA","08DPT0003A",120,"GAAG630825HU2","GAAG630825HCHRLR06","GARDEA ALEMAN GREGORIO",20302,480,83101,1003,"01",56,"A03202",0,7473,2,null,20180401,20180630,45369.86,0]
[null,"CHIHUAHUA","08DPT0003A",120,"GAAV670716S40","GAAV670716HCHRRC06","GARDEA ARREDONDO VICTOR MANUEL",20206,480,83101,1003,"01",56,"CF34201",0,7504,2,null,20180401,20180630,69766.929999999993,0]
[null,"CHIHUAHUA","08DPT0003A",120,"GAHA8701284V2","GAHA870128HCHRRL07","GARDEA HEREDIA ALVARO",20401,480,83101,1003,"01",56,"S01201",0,7480,2,null,20180401,20180630,29719.66,0]
[null,"CHIHUAHUA","08DPT0003A",120,"GOVJ720801R43","GOVJ720801MCHNLD09","GONZALEZ VALLES JUDITH",20201,480,83101,1003,"01",56,"CF33204",0,7493,2,null,20180401,20180630,119981.17,0]
[null,"CHIHUAHUA","08DPT0003A",120,"HESH611022NF3","HESH611022HCHRNL03","HEREDIA SAENZ HILADRIO",20401,480,83101,1003,"01",56,"S01201",0,7485,2,null,20180401,20180630,39342.9,0]
[null,"CHIHUAHUA","08DPT0003A",120,"HEGM7510295L3","HEGM751029MCHRTY07","HERNANDEZ GUTIERREZ MAYRA VERONICA",20215,480,83101,1003,"01",56,"CF33206",0,13762,2,null,20180401,20180630,48338.03,0]
[null,"CHIHUAHUA","08DPT0003A",120,"MEHP811017GD5","MEHP811017HCHNRL02","MENDEZ HERRERA PAUL ALONSO",20402,480,83101,1003,"01",56,"S01201",0,7479,2,null,20180401,20180630,37178.07,0]
[null,"CHIHUAHUA","08DPT0003A",120,"MEMD550401S32","MEMD550401HCHNTL01","MENDEZ MOTA JOSE DOLORES",20401,480,83101,1003,"01",56,"CF04201",0,10159,2,null,20180401,20180630,37524.33,0]
[null,"CHIHUAHUA","08DPT0003A",120,"MOIR7306072Z5","MOIR730607HCHLBM08","MOLINA IBARRA RAMON HUMBERTO",20401,480,83101,1003,"01",56,"CF18201",0,7491,2,null,20180401,20180630,27922.799999999999,0]
[null,"CHIHUAHUA","08DPT0003A",120,"MOAM570729HK3","MOAM570729HCHNRN02","MONTES ARZOLA MANUEL",20401,80,83101,1003,"01",56,"S01201",0,7494,2,null,20180401,20180415,145529.88,0]
[null,"CHIHUAHUA","08DPT0003A",120,"MOME900109M68","MOHR810216HCHNLN06","MONTES HOLGUIN RENE GUADALUPE",20401,480,83101,1003,"01",56,"S01201",0,7494,2,null,20180401,20180630,28222.799999999999,0]
[null,"CHIHUAHUA","08DPT0003A",120,"MOHR810216267","MOME900109MCHNNS03","MONTES MONTES ESMERALDA JANETH",20401,480,83101,1003,"01",56,"A03202",0,7472,2,null,20180401,20180630,29145.18,0]
[null,"CHIHUAHUA","08DPT0003A",120,"MOCY820701FR6","MOCY820701MCHRHS01","ORTIZ CHAVEZ MARTHA ELVIRA",20201,480,83101,1003,"01",56,"S01201",0,7492,2,null,20180401,20180630,57786.65,0]
[null,"CHIHUAHUA","08DPT0003A",120,"PECF611129NU5","PECF611129MOCRSL04","PEREZ CASTRO FILOMENA IRMA",20216,480,83101,1003,"01",56,"CF33204",0,7489,2,null,20180401,20180630,50237.54,0]
[null,"CHIHUAHUA","08DPT0003A",120,"PESB570420393","PESB570420HCHRSN03","PEREZ SOSA BENJAMIN",20401,480,83101,1003,"01",56,"CF21202",0,7499,2,null,20180401,20180630,38178.959999999999,0]
[null,"CHIHUAHUA","08DPT0003A",120,"QURM641112699","QURM641112HCHXMR08","QUIÑONEZ RAMIREZ MARTIN RENE",20302,480,83101,1003,"01",56,"S01202",0,7500,2,null,20180401,20180630,43943.55,0]
[null,"CHIHUAHUA","08DPT0003A",120,"QUYA890925Q52","QUYA890925MCHXXN07","QUIÑONEZ YAÑEZ ANABEL",20215,480,83101,1003,"01",56,"S01202",0,7501,2,null,20180401,20180630,34250.74,0]
[null,"CHIHUAHUA","08DPT0003A",120,"RAGH640227EZ9","RAGH640227HCLMTR04","RAMIREZ GUTIERREZ JOSE HORACIO",20205,240,83101,1003,"01",56,"AO3202",0,7470,2,null,20180401,20180515,55139.85,0]
[null,"CHIHUAHUA","08DPT0003A",120,"SUCM720601QH7","SUCM720601MCHRRY01","SUAREZ CORRAL MYRNA MANUELA",20214,480,83101,1003,"01",56,"CF33206",0,14306,2,null,20180401,20180630,81732.100000000006,0]
[null,"CHIHUAHUA","08DPT0003A",120,"YADR7710046J3","YADR771004MCHXZS02","YAÑEZ DIAZ ROSA IVONNE",20214,480,83101,1003,"01",56,"CF33204",0,7487,2,null,20180401,20180630,21081.5,0]
[null,"CHIHUAHUA","08DPT0003A",100,"AOCF7610047IA","AOCF761204HCHCBR06","FRANCISCO ACOSTA CONTRERAS",30102,260,83101,1001,"01",56,"L5XCBII",20,0,3,null,20180401,20180630,29573,0]
[null,"CHIHUAHUA","08DPT0003A",100,"AOMM7702115QA","AOMM770211MCHCRD18","MIDIAM LOURDES ACOSTA MERAZ",30102,260,83101,1001,"01",56,"L5XCBII",20,0,3,null,20180401,20180630,29573,0]
[null,"CHIHUAHUA","08DPT0003A",120,"AUQN701229G72","AUQN701229MCHGNR05","NORMA AGUIRRE QUINTANA ",30102,234,83101,1001,"01",56,"L5XCBII",18,0,3,null,20180401,20180630,27115.7,0]
[null,"CHIHUAHUA","08DPT0003A",100,"AAHE730629HA8","AAHE730629HDGLRD05","EDGAR JESUS ALBA HERNANDEZ",30102,260,83101,1001,"01",56,"L5XCBII",20,0,3,null,20180401,20180630,29573,0]
[null,"CHIHUAHUA","08DPT0003A",200,"AEOP850816BU5","AEOP850816HCHRLD08","PEDRO RAFAEL ARMENDARIZ OLIVAS",30102,195,83101,1001,"01",56,"L5XC",15,0,3,null,20180401,20180630,26269,0]
[null,"CHIHUAHUA","08DPT0003A",120,"AERG670801H43","AERG670801HCHRVB09","GABRIEL ARMENDARIZ RIVAS",30102,195,83101,1001,"01",56,"L5XC",15,0,3,null,20180401,20180630,26269.279999999999,0]
[null,"CHIHUAHUA","08DPT0003A",100,"BAMF820909BC1","BAMF820909MCHLRT08","FATIMA DEL CARMEN BALDERAS MORALES",30102,234,83101,1001,"01",56,"L5XC",18,0,3,null,20180401,20180630,30523.1,0]
[null,"CHIHUAHUA","08DPT0003A",200,"CACF650131IUA","CACF650131HCHNHL00","FILIBERTO CANO CHAVEZ",30102,247,83101,1001,"01",56,"L5XCBI",19,0,3,null,20180401,20180630,25770.799999999999,0]
[null,"CHIHUAHUA","08DPT0003A",100,"CALA591128150","CALA591128HCHNSB00","ABRAHAM CANO LEOS",30102,130,83101,1001,"01",56,"L5XC",10,0,3,null,20180401,20180630,19179.5,0]
[null,"CHIHUAHUA","08DPT0003A",200,"CATI910806HS0","CATI910806HCHRRV03","IVAN DOROTEO CARRERA DE LA TORRE",30102,260,83101,1001,"01",56,"L5XCBI",20,0,3,null,20180401,20180630,29573,0]
[null,"CHIHUAHUA","08DPT0003A",200,"CATN8302135X1","CATN830213MCHRRD06","NADIA BEATRIZ CARRERA DE LA TORRE",30102,260,83101,1001,"01",56,"L5XC",20,0,3,null,20180401,20180630,33359,0]
[null,"CHIHUAHUA","08DPT0003A",100,"CAGG681119QE9","CAGG681119MCHRRB25","MARIA GABRIELA CARRILLO GARDEA",30102,247,83101,1001,"01",56,"L5XC",19,0,3,null,20180401,20180630,31941.08,0]
[null,"CHIHUAHUA","08DPT0003A",120,"CAMA550415A18","CAMA550415HCHRLR08","ARISTEO CARRILLO MALDONADO",30102,130,83101,1001,"01",56,"L5XCBII",10,0,3,null,20180401,20180630,13037,0]
[null,"CHIHUAHUA","08DPT0003A",200,"CATA900830PFA","CATA900830MCHRRL03","ALEJANDRA IVETTE  CARRILLO TRUJILLO",30102,234,83101,1001,"01",56,"L5XCBI",18,0,3,null,20180401,20180630,27115.7,0]
[null,"CHIHUAHUA","08DPT0003A",100,"CATI851219KEA","CATI851219MCHRRR12","IRMA RAQUEL CARRILLO TRUJILLO",30102,234,83101,1001,"01",56,"L5XC",18,0,3,null,20180401,20180630,30523.1,0]
[null,"CHIHUAHUA","08DPT0003A",100,"CAGL680404GU5","CAGL680404MCHSTT08","LETICIA CASILLAS GUTIERREZ",30102,156,83101,1001,"01",56,"L5XC",12,0,3,null,20180401,20180630,22015.4,0]
[null,"CHIHUAHUA","08DPT0003A",100,"CEBC880121MJ0","CEBC880121MCHBCL06","CLAUDIA INES CEBALLOS BACA",30102,195,83101,1001,"01",56,"L5XCBII",15,0,3,null,20180401,20180630,23429.78,0]
[null,"CHIHUAHUA","08DPT0003A",200,"CEHF701204P69","CEHF701204HDGRRR02","FRANCISCO JAVIER CERENIL HERRERA",30102,234,83101,1001,"01",56,"L5XC",18,0,3,null,20180401,20180630,30523.1,0]
[null,"CHIHUAHUA","08DPT0003A",100,"CASC781201J96","CASC781201MCHHNR02","CORINA CHAVEZ SANCHEZ",30102,234,83101,1001,"01",56,"L5XC",18,0,3,null,20180401,20180630,30523.1,0]
[null,"CHIHUAHUA","08DPT0003A",200,"DERI7801118J5","DEXR780111HCHLXC03","RICARDO DELGADO",30102,221,83101,1001,"01",56,"L5XC",17,0,3,null,20180401,20180630,29105.18,0]
[null,"CHIHUAHUA","08DPT0003A",200,"LEPJ860727765","LEPJ860727HCHNRV08","JAVIER EDUVIGES DE LEON PARADA",30102,260,83101,1001,"01",56,"L5XCBI",20,0,3,null,20180401,20180630,26864,0]
[null,"CHIHUAHUA","08DPT0003A",100,"EARD8007284EA","EARD800728MCHSCL06","DULCE MARGARITA ELIZABETH ESCALANTE ROCHA",30102,260,83101,1001,"01",56,"L5XC",20,0,3,null,20180401,20180630,33359,0]
[null,"CHIHUAHUA","08DPT0003A",100,"FEAL8707295J5","DUPB710508MCHRRR02","LUIS RAUL FERNANDEZ ACOSTA",30102,260,83101,1001,"01",56,"L5XC",20,0,3,null,20180401,20180630,33359,0]
[null,"CHIHUAHUA","08DPT0003A",200,"GAQL770122HI2","GAQL770122MCHLXZ06","LUZ ELIZABETH GALVAN QUIÑONEZ",30102,234,83101,1001,"01",56,"L5XC",18,0,3,null,20180401,20180630,30523.1,0]
[null,"CHIHUAHUA","08DPT0003A",200,"GACP590517MU6","GACP590517MCHRHT05","PATRICIA EUGENIA GARCIA CHAVEZ",30102,234,83101,1001,"01",56,"L5XC",18,0,3,null,20180401,20180630,30523.1,0]
[null,"CHIHUAHUA","08DPT0003A",100,"GARJ67122131A","GARJ671221HCHRZM09","JAIME GARCIA RUIZ",30102,260,83101,1001,"01",56,"L5XC",20,0,3,null,20180401,20180630,33359,0]
[null,"CHIHUAHUA","08DPT0003A",100,"GAAC630426E79","GAAC630429HCHRRR03","CARLOS DAVID GARDEA ARREDONDO",30102,247,83101,1001,"01",56,"L5XCBI",19,0,3,null,20180401,20180630,20770.8,0]
[null,"CHIHUAHUA","08DPT0003A",200,"GOGA810922999","GOGA810922HCHNRG02","AGUSTIN GONZALEZ GARCIA",30102,260,83101,1001,"01",56,"L5XC",20,0,3,null,20180401,20180630,33359,0]
[null,"CHIHUAHUA","08DPT0003A",100,"GOGJ8811064X6","GOGJ881106MCHNTS09","JESSICA JANETH GONZALEZ GUTIERREZ",30102,260,83101,1001,"01",56,"L5XCBII",20,0,3,null,20180401,20180630,29573,0]
[null,"CHIHUAHUA","08DPT0003A",200,"GOHD580525IP0","GOHD580525HCHNRV01","DAVID GONZALEZ HERNANDEZ",30102,234,83101,1001,"01",56,"L5XCBI",18,0,3,null,20180401,20180630,24677.599999999999,0]
[null,"CHIHUAHUA","08DPT0003A",100,"GUCG610126B56","GUCG610126HCHTNR03","JOSE GERARDO GUTIERREZ CONTRERAS",30102,130,83101,1001,"01",56,"L5XC",10,0,3,null,20180401,20180630,19179.5,0]
[null,"CHIHUAHUA","08DPT0003A",100,"HEAV711202QZ8","HEAV711202MCHRGV01","VIVIANA HERNANDEZ AGUILERA",30102,117,83101,1001,"01",56,"L5XC",9,0,3,null,20180401,20180630,17761.580000000002,0]
[null,"CHIHUAHUA","08DPT0003A",120,"HEAA900716PY3","HEAA900716HCHRGL00","ALFREDO HERNANDEZ AGUIRRE",30102,208,83101,1001,"01",56,"L5XCBI",16,0,3,null,20180401,20180630,22491.200000000001,0]
[null,"CHIHUAHUA","08DPT0003A",200,"HEAA881029IG6","HEAA881029MCHRNN04","ANGELICA HERNANDEZ ANGEL",30102,208,83101,1001,"01",56,"L5XC",16,0,3,null,20180401,20180630,27687.200000000001,0]
[null,"CHIHUAHUA","08DPT0003A",200,"HISE750912LP7","HISE750912MCHNNT05","ETHEL JANETH HINOJOS SANCHEZ",30102,247,83101,1001,"01",56,"L5XCBII",19,0,3,null,20180401,20180630,28344.38,0]
[null,"CHIHUAHUA","08DPT0003A",200,"HOOJ841127R23","HOOJ841127HCHLJS04","JESUS MANUEL HOLGUIN OJEDA",30102,260,83101,1001,"01",56,"L5XC",20,0,3,null,20180401,20180630,28632.5,0]
[null,"CHIHUAHUA","08DPT0003A",100,"HOQS841119E44","HOQS841119MCHLNL02","SILVIA HOLGUIN QUINTANA",30102,195,83101,1001,"01",56,"L5XC",15,0,3,null,20180401,20180630,26269.279999999999,0]
[null,"CHIHUAHUA","08DPT0003A",100,"IEPA690710Q2A","IEPA690710HZSRRL07","ALEJANDRO IRENE PEREZ",30102,195,83101,1001,"01",56,"L5XC",15,0,3,null,20180401,20180630,26269.279999999999,0]
[null,"CHIHUAHUA","08DPT0003A",100,"JUEM870729SW2","JUEM870729MCHRSR04","MARINA JUAREZ ESPARZA",30102,260,83101,1001,"01",56,"L5XCBI",20,0,3,null,20180401,20180630,26864,0]
[null,"CHIHUAHUA","08DPT0003A",120,"JUGE790622JJ2","JUGE790622HCHRRD03","EDGAR ELIEL JUAREZ GRAJEDA",30102,260,83101,1001,"01",56,"L5XC",20,0,3,null,20180401,20180630,33359,0]
[null,"CHIHUAHUA","08DPT0003A",200,"LARJ611212G44","LARJ611212HCHZDL03","JOEL GUADALUPE LAZCANO RODRIGUEZ",30102,130,83101,1001,"01",56,"L5XCBI",10,0,3,null,20180401,20180630,15932,0]
[null,"CHIHUAHUA","08DPT0003A",200,"LISA761208237","LISA761208HCHCLN05","ANGEL LICERIO SILVEYRA",30102,130,83101,1001,1,56,"L5XCBI",10,0,3,null,20180401,20180630,10932,0]
[null,"CHIHUAHUA","08DPT0003A",100,"LOGJ770422620","LOGJ770422HCHPRL08","JOEL ALONSO LOPEZ GRANADOS",30102,260,83101,1001,"01",56,"L5XC",20,0,3,null,20180401,20180630,33359,0]
[null,"CHIHUAHUA","08DPT0003A",100,"LOSS7606157X9","LOSS760615MCHPLL02","SILVIA LOPEZ SALCIDO",30102,260,83101,1001,"01",56,"L5XC",20,0,3,null,20180401,20180630,33359,0]
[null,"CHIHUAHUA","08DPT0003A",200,"LOCM7912081Q9","LOCM791208MCHYLR09","MARTHA LAURA LOYA CELESTIN",30102,234,83101,1001,"01",56,"L5XC",18,0,3,null,20180401,20180630,30523.1,0]
[null,"CHIHUAHUA","08DPT0003A",200,"LUMA890208UY4","LUMA890208HCHNLL06","ALEJANDRO LUNA MOLINA",30102,234,83101,1001,"01",56,"L5XC",18,0,3,null,20180401,20180630,30523.1,0]
[null,"CHIHUAHUA","08DPT0003A",200,"MAAK800331I60","MAAK800331MCHCGR00","KAREN LOURDES MACIAS AGUIRRE",30102,169,83101,1001,"01",56,"L5XC",13,0,3,null,20180401,20180630,23433.38,0]
[null,"CHIHUAHUA","08DPT0003A",100,"MAMF571028UH3","MAMF571028HCHRCR08","FRANCISCO ROBERTO MARTINEZ MACIAS",30102,247,83101,1001,"01",56,"L5XC",19,0,3,null,20180401,20180630,31941.08,0]
[null,"CHIHUAHUA","08DPT0003A",100,"MAMS761009L43","MASS761009HCHRCR04","SERGIO RENE MARTINEZ MACIAS",30102,260,83101,1001,"01",56,"L5XCBI",20,0,3,null,20180401,20180630,26864,0]
[null,"CHIHUAHUA","08DPT0003A",200,"MAML781222TP2","MAML781222MCHRNR05","LAURA GABRIELA MARTINEZ MONARREZ",30102,169,83101,1001,"01",56,"L5XC",13,0,3,null,20180401,20180630,23433.38,0]
[null,"CHIHUAHUA","08DPT0003A",100,"MAPJ881207NN8","MAPJ881207MCHRRN07","JANETH DERAT MARTINEZ PROSPERO",30102,247,83101,1001,"01",56,"L5XC",19,0,3,null,20180401,20180630,31941.08,0]
[null,"CHIHUAHUA","08DPT0003A",100,"MARB780909MG5","MARB780909MCHRSR07","BRENDA SOCORRO MARTINEZ RIOS",30102,247,83101,1001,"01",56,"L5XC",19,0,3,null,20180401,20180630,31941.08,0]
[null,"CHIHUAHUA","08DPT0003A",100,"MEMP850117HB8","MEMP850117MCHNNL01","PALOMA DEL CARMEN MENDEZ MENDEZ",30102,234,83101,1001,"01",56,"L5XC",18,0,3,null,20180401,20180630,30523.1,0]
[null,"CHIHUAHUA","08DPT0003A",120,"MOHE7612192R9","MOHE761219HCHNLD06","EDGAR OBEK MONTES HOLGUIN",30102,247,83101,1001,"01",56,"L5XC",19,0,3,null,20180401,20180630,31941.08,0]
[null,"CHIHUAHUA","08DPT0003A",100,"MOMA830930QR2","MOMA830930MCHRRN04","ANTONIA MORENO MORALES",30102,234,83101,1001,"01",56,"L5XC",18,0,3,null,20180401,20180630,30523.1,0]
[null,"CHIHUAHUA","08DPT0003A",100,"NAMR830722I63","NAMR830722MCHXNB01","REBECA DIANA NANEZ MENDOZA",30102,260,83101,1001,"01",56,"L5XCBI",20,0,3,null,20180401,20180630,29573,0]
[null,"CHIHUAHUA","08DPT0003A",100,"PAQR840612BHA","PAQR840612HCHLXM03","JOSE RAMON PALMA QUIÑONEZ",30102,260,83101,1001,"01",56,"L5XCBI",20,0,3,null,20180401,20180630,26864,0]
[null,"CHIHUAHUA","08DPT0003A",100,"PAMZ880803S42","PAMZ880803MCHTRM09","ZAMISH GABRIELA PATIÑO MORALES",30102,234,83101,1001,"01",56,"L5XCBI",18,0,3,null,20180401,20180630,24677.599999999999,0]
[null,"CHIHUAHUA","08DPT0003A",200,"PERO820514295","PERO820514HCHRMM06","OMAR ARMANDO PEREZ RAMIREZ",30102,260,83101,1001,"01",56,"L5XC",20,0,3,null,20180401,20180630,33359,0]
[null,"CHIHUAHUA","08DPT0003A",200,"QUVC860208IX4","QUVC860208MCHNLR06","CRISTINA QUINTANA VILLEGAS",30102,156,83101,1001,"01",56,"L5XCBI",12,0,3,null,20180401,20180630,18118.400000000001,0]
[null,"CHIHUAHUA","08DPT0003A",100,"QUGG830326LY2","QUGG830326MCHXRR05","GEORGINA ALHELI QUIÑONEZ GARCIA",30102,234,83101,1001,"01",56,"L5XC",18,0,3,null,20180401,20180630,30523.1,0]
[null,"CHIHUAHUA","08DPT0003A",120,"QUYD920620SG7","QUYD920620MCHXXN07","DANIA ANGELICA QUIÑONEZ YAÑEZ",30102,260,83101,1001,"01",56,"L5XCBI",20,0,3,null,20180401,20180630,26864,0]
[null,"CHIHUAHUA","08DPT0003A",100,"RACG650805Q12","RACG650805HSRMNM07","GAMALIEL RAMOS CONTRERAS",30102,97,83101,1001,"01",56,"L5XCBII",18,0,3,null,20180401,20180630,16057.85,0]
[null,"CHIHUAHUA","08DPT0003A",200,"RACA620817IU7","RACA620817HCHSHN09","ANTONIO RASCON CHAVEZ",30102,260,83101,1001,"01",56,"L5XCBI",20,0,3,null,20180401,20180630,26864,0]
[null,"CHIHUAHUA","08DPT0003A",200,"RERH8005305SA","RERH800530HCHNDC03","HECTOR RAUL RENTERIA RODRIGUEZ",30102,260,83101,1001,"01",56,"L5XCBII",20,0,3,null,20180401,20180630,29573,0]
[null,"CHIHUAHUA","08DPT0003A",100,"RIPS680731I67","RIPS680731HCHCRR07","SERGIO RICO PEREZ",30102,260,83101,1001,"01",56,"L5XCBI",20,0,3,null,20180401,20180630,26864,0]
[null,"CHIHUAHUA","08DPT0003A",200,"RIAJ830525SU3","RIAJ830525HCHVCM08","JAIME MICHAEL RIVERA ACOSTA",30102,260,83101,1001,"01",56,"L5XC",20,0,3,null,20180401,20180630,33359,0]
[null,"CHIHUAHUA","08DPT0003A",200,"ROSL891018R33","ROSL891018HCHDNS03","LUIS ISIDRO RODRIGUEZ SAENZ",30102,208,83101,1001,"01",56,"L5XCBII",16,0,3,null,20180401,20180630,24658.400000000001,0]
[null,"CHIHUAHUA","08DPT0003A",120,"ROSL8112066G9","ROSL811206HCHDFS05","LUIS CARLOS RODRIGUEZ SIFUENTES",30102,260,83101,1001,"01",56,"L5XC",20,0,3,null,20180401,20180630,33359,0]
[null,"CHIHUAHUA","08DPT0003A",100,"ROMC790529SQ8","ROMC790529HCHJZR03","CARLOS GERMAN ROJAS MEZA",30102,221,83101,1001,"01",56,"L5XC",17,0,3,null,20180401,20180630,29105.18,0]
[null,"CHIHUAHUA","08DPT0003A",100,"ROMJ820824341","ROMJ820824HCHMRN09","JUAN PABLO ROMO MARTINEZ",30102,130,83101,1001,"01",56,"L5XC",10,0,3,null,20180401,20180630,19179.5,0]
[null,"CHIHUAHUA","08DPT0003A",100,"ROQM800726NK3","ROQM800726MCHNXR09","MARISA JUDITH RONQUILLO QUIÑONEZ",30102,130,83101,1001,"01",56,"L5XCBI",10,0,3,null,20180401,20180630,15932,0]
[null,"CHIHUAHUA","08DPT0003A",200,"SARJ830528CW0","SARJ830528HCHLDR12","JORGE ARTURO SALAS RODRIGUEZ",30102,260,83101,1001,"01",56,"L5XCBI",20,0,3,null,20180401,20180630,26864,0]
[null,"CHIHUAHUA","08DPT0003A",100,"SADC810906EH7","SADC810906MCHNZR07","MARIA CRISTINA SANCHEZ DIAZ",30102,260,83101,1001,"01",56,"L5XCBI",20,0,3,null,20180401,20180630,26864,0]
[null,"CHIHUAHUA","08DPT0003A",100,"SASM890615RQ7","SASM890615HCHNXG03","MIGUEL ANGEL SANCHEZ SEAÑEZ",30102,234,83101,1001,1,56,"L5XCBI",18,0,3,null,20180401,20180630,19677.599999999999,0]
[null,"CHIHUAHUA","08DPT0003A",200,"SERM730609876","SERM730609MCHPYY01","MYRIAM SEPULVEDA REYES",30102,234,83101,1001,"01",56,"L5XC",18,0,3,null,20180401,20180630,30523.1,0]
[null,"CHIHUAHUA","08DPT0003A",200,"TEAR760610A38","TEAR760610HCHRGL01","RAUL FELIPE TERRAZAS AGUIRRE",30102,130,83101,1001,"01",56,"L5XC",10,0,3,null,20180401,20180630,19179.5,0]
[null,"CHIHUAHUA","08DPT0003A",120,"TOBT8310246R6","TOBT831024MCHRRH05","THELMA GUADALUPE TORRES BARRETO",30102,260,83101,1001,"01",56,"L5XC",20,0,3,null,20180401,20180630,33359,0]
[null,"CHIHUAHUA","08DPT0003A",100,"UUAJ8910286B1","UUAJ891028HCHRRL00","JOEL URTUZUASTEGUI ARZOLA",30102,260,83101,1001,"01",56,"L5XCBII",20,0,3,null,20180401,20180630,29573,0]
[null,"CHIHUAHUA","08DPT0003A",100,"VASM721005K88","VASM721005HCHLRR06","MARIO ALBERTO VALDEZ SIERRA",30102,117,83101,1001,"01",56,"L5XC",9,0,3,null,20180401,20180630,17761.580000000002,0]
[null,"CHIHUAHUA","08DPT0003A",100,"VATE6505053PA","VATE650505HCHLRR02","ERNESTO VALLEJO TERRAZAS",30102,221,83101,1001,"01",56,"L5XC",17,0,3,null,20180401,20180630,29105.18,0]
[null,"CHIHUAHUA","08DPT0003A",100,"VAGS580921NS3","VAGS580921MCHZRL04","SOLEDAD VAZQUEZ GARCIA",30102,208,83101,1001,"01",56,"L5XC",16,0,3,null,20180401,20180630,27687.200000000001,0]
[null,"CHIHUAHUA","08DPT0003A",100,"VASI870422IA8","VASI870422MCHZVS04","ISIS KRYSTAL VAZQUEZ SAENZ",30102,234,83101,1001,"01",56,"L5XC",18,0,3,null,20180401,20180630,30523.1,0]
[null,"CHIHUAHUA","08DPT0003A",200,"VEMA770621BW5","VEMA770621MCHLRN02","ANA ISABEL VELAZQUEZ MARTINEZ",30102,260,83101,1001,"01",56,"L5XC",20,0,3,null,20180401,20180630,33359,0]
[null,"CHIHUAHUA","08DPT0003A",200,"VEDA870119GY2","VEDA870119MDGRMD03","ADRIANA VERGARA DOMINGUEZ",30102,195,83101,1001,"01",56,"L5XCBI",15,0,3,null,20180401,20180630,23429.78,0]
[null,"CHIHUAHUA","08DPT0003A",200,"VILJ810613D4A","VILJ810613HCHLRR06","JORGE ANTONIO VILLAR LOERA",30102,234,83101,1001,"01",56,"L5XCBI",18,0,3,null,20180401,20180630,24677.599999999999,0]
[null,"CHIHUAHUA","08DPT0003A",200,"VIGR710609UT2","VIGR710609HCHLRF00","RAFAEL VILLEGAS GARCIA",30102,260,83101,1001,"01",56,"L5XC",20,0,3,null,20180401,20180630,33359,0]
[null,"CHIHUAHUA","08DPT0007X",100,"AUAC800520NRA","AUAC800520HDGGNS04","CESAR ALEJANDRO AGUILAR ANTUNEZ",10207,480,83101,1003,"02","07","CF18203",0,11986,2,null,20180401,20180630,49802.26,0]
[null,"CHIHUAHUA","08DPT0007X",100,"AARJ7003036F2","AARJ700303MCHNMS07","MARIA DE JESUS ANAYA RAMIREZ",20201,480,83101,1003,"02","07","CF33204",0,2390,2,null,20180401,20180630,84086.67,0]
[null,"CHIHUAHUA","08DPT0007X",100,"AIEL6711121J4","AIXE671112MCHRXL03","MARÍA ELIZABETTH ARRIETA",20401,480,83101,1003,"02","07","S01201",0,9329,2,null,20180401,20180630,32272.25,0]
[null,"CHIHUAHUA","08DPT0007X",100,"BELH630930M26","BELH630930HCHNNM06","JOSE HUMBERTO BENITEZ LONGORIA",10203,480,83101,1003,"02","07","CF19201",0,9327,2,null,20180401,20180630,53974.67,0]
[null,"CHIHUAHUA","08DPT0007X",100,"CAEA740422SF8","CAEA740422MCHBSL02","ALMA SOFIA CABALLERO ESPARZA",20109,80,83101,1003,"02","07","CF33206",0,13431,2,null,20180401,20180415,18759.48,0]
[null,"CHIHUAHUA","08DPT0007X",100,"CADE710915BB6","CADE710915MCHRZL02","ELVIRA CARRASCO DIAZ",40401,480,83101,1003,"02","07","CF02103",0,12600,5,null,20180401,20180630,100611.18,0]
[null,"CHIHUAHUA","08DPT0007X",100,"CACI7205151S9","CACI720515HOCHRS01","ISIDRO MANUEL CHAVEZ CARRERA",20202,480,83101,1003,"02","07","CF33204",0,9338,2,null,20180401,20180630,79256.84,0]
[null,"CHIHUAHUA","08DPT0007X",100,"DEML700812U65","DEML700812MDGLRR03","LAURA DIANA DELGADO MARRERO",20208,480,83101,1003,"02","07","A03202",0,9319,2,null,20180401,20180630,49874.32,0]
[null,"CHIHUAHUA","08DPT0007X",200,"EALJ731221FM3","EALJ731221HSLSRN06","JUAN DE DIOS ESCALANTE LAUREAN",10203,480,83101,1003,"02","07","S01202",0,9342,2,null,20180401,20180630,46601.46,0]
[null,"CHIHUAHUA","08DPT0007X",100,"GAEM680908Q97","GAEC680908MCLLSN03","MA. CONCEPCION GALLARDO ESPARZA",20401,480,83101,1003,"02","07","S01202",0,9337,2,null,20180401,20180630,37190.71,0]
[null,"CHIHUAHUA","08DPT0007X",100,"GADA760726L20","GADA760726MCHRZD02","ADRIANA GARCIA DIAZ",20208,480,83101,1003,"02","07","A03202",0,465,2,null,20180401,20180630,51024.06,0]
[null,"CHIHUAHUA","08DPT0007X",100,"HEGJ620729F26","HEGJ620729HCHRNV07","JOSE JAVIER HERNANDEZ GONZALEZ",20108,480,83101,1003,"02","07","CF33206",0,14112,2,null,20180401,20180630,77278.259999999995,0]
[null,"CHIHUAHUA","08DPT0007X",100,"HEGL611117FN5","HEGL611117MCHRNZ00","LUZ MARIA HERNANDEZ GONZALEZ",20203,480,83101,1003,"02","07","CF33204",0,2229,2,null,20180401,20180630,99010.85,0]
[null,"CHIHUAHUA","08DPT0007X",100,"HEPH660312FI8","HEPH660312HCHRRC02","HECTOR HERNANDEZ PEREZ",20202,480,83101,1003,"02","07","CF18203",0,9332,2,null,20180401,20180630,56780.78,0]
[null,"CHIHUAHUA","08DPT0007X",100,"LIMR6608162E8","LIMR660816HZSRNY01","RAYMUNDO LIRA MENDOZA",20109,480,83101,1003,"02","07","CF33206",0,13756,2,null,20180401,20180630,128753.35,0]
[null,"CHIHUAHUA","08DPT0007X",100,"MASF580311IY9","MASF580311HDGGCR04","FRANCISCO MAGDALENO SAUCEDO",20202,480,83101,1003,"02","07","CF33204",0,210,2,null,20180401,20180630,81496.479999999996,0]
[null,"CHIHUAHUA","08DPT0007X",100,"MARL701010AR4","MARL701010MCLRBD02","LUDIVINA MARTINEZ REBOLLOSO",20206,480,83101,1003,"02","07","CF04201",0,11955,2,null,20180401,20180630,55097.29,0]
[null,"CHIHUAHUA","08DPT0007X",100,"MECL790627CP7","MEXC790627MCHJXL02","CLAUDIA FABIOLA MEJIA",20211,480,83101,1003,"02","07","CF34202",0,12097,2,null,20180401,20180630,46980.22,0]
[null,"CHIHUAHUA","08DPT0007X",100,"MONM720514D8A","MONM720514HCHRXR04","MARCIAL EZEQUIEL MORALES NUÑEZ",20101,480,83101,1003,"02","07","CF33206",0,13430,2,null,20180401,20180630,113601.31,0]
[null,"CHIHUAHUA","08DPT0007X",100,"OIPL750706829","OIPL750706HNTRXS09","LUIS ALBERTO ORTIZ PEÑA",20206,480,83101,1003,"02","07","CF33204",0,9348,2,null,20180401,20180630,71328.179999999993,0]
[null,"CHIHUAHUA","08DPT0007X",100,"PECG710113QA8","PECG710113MCHRRB06","GABRIELA PEREZ CRUZ",20211,480,83101,1003,"02","07","S01202",0,7505,2,null,20180401,20180630,44944.23,0]
[null,"CHIHUAHUA","08DPT0007X",100,"ROCS700130LMA","ROCS700130MDGDLL00","SILVIA ESTELA RODRIGUEZ CALVILLO",20109,480,83101,1003,"02","07","CF33206",0,13432,2,null,20180401,20180630,81715.759999999995,0]
[null,"CHIHUAHUA","08DPT0007X",100,"ROMA711015CL1","ROMA711015MDFDLN06","ANA LUISA RODRIGUEZ MILAN",20206,480,83101,1003,"02","07","A03202",0,9322,2,null,20180401,20180630,48664.06,0]
[null,"CHIHUAHUA","08DPT0007X",100,"ROQM510228824","ROQR510228MCHGZF19","MARIA DEL REFUGIO ROGERO QUEZADA",40502,480,83101,1003,"02","07","CF02105",0,12864,5,null,20180401,20180630,66459.899999999994,0]
[null,"CHIHUAHUA","08DPT0007X",100,"ROME6706013EA","ROME670601MDFJLD04","MARIA EDITH ROJAS MELENDEZ",20211,480,83101,1003,"02","07","A03202",0,9320,2,null,20180401,20180630,49269.16,0]
[null,"CHIHUAHUA","08DPT0007X",100,"SOGC711207N65","SOGC711207MCHTRN06","MARIA CONCEPCION SOTO GUERRERO",20104,480,83101,1003,"02","07","CF33206",0,13433,2,null,20180401,20180630,123667.21,0]
[null,"CHIHUAHUA","08DPT0007X",100,"SOHJ7805045P4","SOHJ780504HCHTRS02","JOSE DE JESUS SOTO HERNANDEZ",20201,480,83101,1003,"02","07","CF33203",0,9335,2,null,20180401,20180630,45520.7,0]
[null,"CHIHUAHUA","08DPT0007X",100,"ZAVE920703L47","ZAVE920703HCHVLD09","EDGAR ALEJANDRO ZAVALA VALLES",20401,480,83101,1003,"02","07","S01201",0,9325,2,null,20180401,20180630,31365.78,0]
[null,"CHIHUAHUA","08DPT0007X",100,"AAVJ670109VEA","AAVJ670109HVZBLL08","ABSALON VILLEGAS JULIAN MIGUEL",30102,204,83101,1001,"02","07","L5XATEC",17,0,3,null,20180401,20180630,26382,0]
[null,"CHIHUAHUA","08DPT0007X",200,"AOLJ680721RSA","AOLJ680721MCHCJL09","ACOSTA LUJAN JULIA ROSA",30102,216,83101,1001,"02","07","L5XC",18,0,3,null,20180401,20180630,27444,0]
[null,"CHIHUAHUA","08DPT0007X",200,"AUCI871011KK9","AUCI871011MCHGLL16","AGUIRRE CALDERON ILEANA LIZELDY",30102,216,83101,1001,"02","07","L5XC",18,0,3,null,20180401,20180630,20583,0]
[null,"CHIHUAHUA","08DPT0007X",200,"AEMV850720NG8","AEMV850720MCHLNR03","ALMEIDA MONTES VIRIDIANA",30102,216,83101,1001,"02","07","L5XC",18,0,3,null,20180401,20180630,24013.5,0]
[null,"CHIHUAHUA","08DPT0007X",100,"AAGP8807274Z4","AAGP880727MMCLLB04","ALVARADO GALICIA PABLOVA",30102,240,83101,1001,"02","07","L5XCBI",20,0,3,null,20180401,20180630,26835.3,0]
[null,"CHIHUAHUA","08DPT0007X",200,"AASJ7104236Z2","AASJ710423HCHLNR06","ALVARADO SANCHEZ JORGE ADRIAN",30102,240,83101,1001,"02","07","L5XC",20,0,3,null,20180401,20180630,34305,0]
[null,"CHIHUAHUA","08DPT0007X",100,"AATG900815VD7","AATG900815MCHLRL09","ALVARADO TARANGO GLORIA YARALDY",30102,228,83101,1001,"02","07","L5XCBI",19,0,3,null,20180401,20180630,20871.900000000001,0]
[null,"CHIHUAHUA","08DPT0007X",100,"AARP801213GG6","AARP801213HCHVDD14","AVALOS RODARTE PEDRO ALONSO",30102,216,83101,1001,"02","07","L5XCBI",18,0,3,null,20180401,20180630,29817,0]
[null,"CHIHUAHUA","08DPT0007X",100,"BACJ730108BV7","BACJ730108MDFYRH00","BAYARDO CARVAJAL JAHEL",30102,192,83101,1001,"02","07","L5XCBI",16,0,3,null,20180401,20180630,29817,0]
[null,"CHIHUAHUA","08DPT0007X",100,"BECI670819Q93","BECI670819HCHLRV03","BELMONTE CARRILLO IVAN",30102,240,83101,1001,"02","07","L5XC",20,0,3,null,20180401,20180630,32589.780000000002,0]
[null,"CHIHUAHUA","08DPT0007X",100,"BEMY780623E38","BEMY780623MCHRRS01","BERUMEN MARTINEZ YESICA",30102,240,83101,1001,"02","07","L5XC",20,0,3,null,20180401,20180630,20583,0]
[null,"CHIHUAHUA","08DPT0007X",100,"BIRG861118GT6","BIRG861118MCHRYR07","BRIONES REYES GEORGINA",30102,108,83101,1001,"02","07","L5XATEC",9,0,3,null,20180401,20180630,10552.8,0]
[null,"CHIHUAHUA","08DPT0007X",100,"BUEL761105V38","BUEL761105MCHSSR05","BUSTAMANTE ESCOBEDO LAURA ISELA",30102,240,83101,1001,"02","07","L5XC",20,0,3,null,20180401,20180630,25728.780000000002,0]
[null,"CHIHUAHUA","08DPT0007X",200,"CAVM69042817A","CAVM690428HCHBGR00","CABALLERO VEGA MARIO ALBERTO",30102,120,83101,1001,"02","07","L5XATEC",10,0,3,null,20180401,20180630,25062.9,0]
[null,"CHIHUAHUA","08DPT0007X",100,"CASC9206274E9","CASC920627HCHLNH09","CALDERA SANCHEZ CHRISTIAN ALBERTO",30102,168,83101,1001,"02","07","L5XCBII",14,0,3,null,20180401,20180630,16641.3,0]
[null,"CHIHUAHUA","08DPT0007X",200,"CAVM6006195R6","CAVM600619HCHLLN01","CALLEROS VILLALOBOS MANUEL ALBERTO ",30102,240,83101,1001,"02","07","L5XCBI",20,0,3,null,20180401,20180630,29817,0]
[null,"CHIHUAHUA","08DPT0007X",200,"CARV8802245G8","CARV880224MCHHML04","CHACON RAMOS VIOLETA",30102,204,83101,1001,"02","07","L5XATEC",17,0,3,null,20180401,20180630,18687.25,0]
[null,"CHIHUAHUA","08DPT0007X",100,"CIGJ801220RP4","CIGJ801220HCHSRL09","CISNEROS GARCIA JULIO ALBERTO",30102,240,83101,1001,"02","07","L5XC",20,0,3,null,20180401,20180630,34305,0]
[null,"CHIHUAHUA","08DPT0007X",200,"DIAA860226874","DIAA860226MSRZGN04","DIAZ AGUILAR ANA FABIOLA",30102,228,83101,1001,"02","07","L5XC",19,0,3,null,20180401,20180630,20583,0]
[null,"CHIHUAHUA","08DPT0007X",200,"DOBG610203LR2","DOBG610203HCHMRL02","DOMINGUEZ BARAY GILBERTO",30102,204,83101,1001,"02","07","L5XC",17,0,3,null,20180401,20180630,34305,0]
[null,"CHIHUAHUA","08DPT0007X",400,"DOGC9306184A4","DOGC930618HCHMNR04","DOMINGUEZ GONZALEZ CARLOS RODRIGO",30102,144,83101,1001,"02","07","L5XATEC",12,0,3,null,20180401,20180630,15829.2,0]
[null,"CHIHUAHUA","08DPT0007X",200,"EADJ860902I17","EADJ860902HCHSZV01","ESPARZA DIAZ JAVIER EDUARDO",30102,240,83101,1001,"02","07","L5XC",20,0,3,null,20180401,20180630,25728.780000000002,0]
[null,"CHIHUAHUA","08DPT0007X",200,"EACL8412183L3","EACL841218MCHSRR08","ESTRADA CARRILLO LAURA VERONICA",30102,240,83101,1001,"02","07","L5XC",20,0,3,null,20180401,20180630,20583,0]
[null,"CHIHUAHUA","08DPT0007X",200,"EAHJ881022RT6","EAHJ881022HCHSRQ05","ESTRADA HERNANDEZ JOAQUIN JOEL",30102,120,83101,1001,"02","07","L5XC",10,0,3,null,20180401,20180630,34305,0]
[null,"CHIHUAHUA","08DPT0007X",200,"CARF8005231E2","CARF800523HCHRVD08","ESTRADA SALAYANDIA JOSE ANGEL",30102,192,83101,1001,"02","07","L5XCBII",16,0,3,null,20180401,20180630,14683.5,0]
[null,"CHIHUAHUA","08DPT0007X",200,"FOCG620409LQ0","FOCG620409HDGLHN03","FLORES CHACON GONZALO",30102,180,83101,1001,"02","07","L5XCBI",15,0,3,null,20180401,20180630,29817,0]
[null,"CHIHUAHUA","08DPT0007X",100,"GAEH711103S52","GAEH711103HCHBNC07","GABALDON ENRÍQUEZ HECTOR GERARDO                  ",30102,168,83101,1001,"02","07","L5XC",14,0,3,null,20180401,20180630,22298.280000000002,0]
[null,"CHIHUAHUA","08DPT0007X",200,"GAJE670908MV9","GAJE670908HDGLRV06","GALVAN JUAREZ EVARISTO",30102,240,83101,1001,"02","07","L5XCBI",20,0,3,null,20180401,20180630,29817,0]
[null,"CHIHUAHUA","08DPT0007X",100,"GAMY7604228L5","GAMY760422MDGLXL00","GALVAN MUÑOZ YOLANDA ALEJANDRA",30102,240,83101,1001,"02","07","L5XC",20,0,3,null,20180401,20180630,25728.780000000002,0]
[null,"CHIHUAHUA","08DPT0007X",200,"GAOR861127BG3","GAOR861127MCHMNQ19","GAMBOA ONTIVEROS RAQUEL",30102,240,83101,1001,"02","07","L5XC",20,0,3,null,20180401,20180630,34305,0]
[null,"CHIHUAHUA","08DPT0007X",100,"GAAN631226D5A","GAAN631226MCHNNR03","GANDARA ANGUIANO NORMA",30102,240,83101,1001,"02","07","L5XCBI",20,0,3,null,20180401,20180630,13417.680000000002,0]
[null,"CHIHUAHUA","08DPT0007X",100,"GARA6105276N5","GARA610527HCHRZL00","GARAY RUIZ JOSE ALFONSO",30102,228,83101,1001,"02","07","L5XC",19,0,3,null,20180401,20180630,34305,0]
[null,"CHIHUAHUA","08DPT0007X",100,"GOTD6910121D1","GOTD691012MCHMVY06","GOMEZ TAVARES DEYANIRA",30102,228,83101,1001,"02","07","L5XC",19,0,3,null,20180401,20180630,20583,0]
[null,"CHIHUAHUA","08DPT0007X",100,"SAMD9405148N8","SAMD940514HCHLNN04","GONZALEZ GANDARA GABRIELA ALEJANDRA",30102,216,83101,1001,"02","07","L5XCBII",18,0,3,null,20180401,20180630,17620.2,0]
[null,"CHIHUAHUA","08DPT0007X",100,"GONM640214JC7","GONM640214HJCNVG03","GONZÁLEZ NAVA MIGUEL",30102,216,83101,1001,"02","07","L5XATEC",18,0,3,null,20180401,20180630,23743.8,0]
[null,"CHIHUAHUA","08DPT0007X",100,"HEPR900403KQ2","HEPR900403HCHRRC03","HERNANDEZ PEREZ RICARDO",30102,228,83101,1001,"02","07","L5XC",19,0,3,null,20180401,20180630,20583,0]
[null,"CHIHUAHUA","08DPT0007X",100,"HEMA6604046K4","HEMA660404HCHRXN05","HERRERA MUÑOZ JOSE ANGEL",30102,240,83101,1001,"02","07","L5XC",20,0,3,null,20180401,20180630,34305,0]
[null,"CHIHUAHUA","08DPT0007X",100,"HEOS840726F25","HEOS840726HCHRGR06","HERRERA OGAZ SERGIO ARTURO",30102,240,83101,1001,"02","07","L5XCBI",20,0,3,null,20180401,20180630,29817,0]
[null,"CHIHUAHUA","08DPT0007X",100,"HOAG621120KT8","HOAG621120MCHLVB08","HOLGUIN AVILA GABRIELA ALEJANDRA",30102,216,83101,1001,"02","07","L5XCBI",18,0,3,null,20180401,20180630,26835.3,0]
[null,"CHIHUAHUA","08DPT0007X",200,"LOHA840518CS8","LOHA840518HCHPRL07","LOPEZ HERNANDEZ ALBERTO",30102,216,83101,1001,"02","07","L5XCBI",18,0,3,null,20180401,20180630,29817,0]
[null,"CHIHUAHUA","08DPT0007X",200,"MAVA850717159","MAVA850717MCHCLL06","MACÍAS VELAZQUEZ ALEJANDRA",30102,240,83101,1001,"02","07","L5XC",20,0,3,null,20180401,20180630,18867.780000000002,0]
[null,"CHIHUAHUA","08DPT0007X",200,"MAER720708DH1","MAXE720708MCHNXR00","MANCHA ERIKA SELENE",30102,180,83101,1001,"02","07","L5XC",15,0,3,null,20180401,20180630,27444,0]
[null,"CHIHUAHUA","08DPT0007X",400,"TOCJ650407CT0","TOCJ650407HVZRNS07","MARQUEZ OLIVAS DANIEL ANTONIO",30102,228,83101,1001,"02","07","L5XATEC",19,0,3,null,20180401,20180630,25062.9,0]
[null,"CHIHUAHUA","08DPT0007X",100,"MARS830130RA7","MARS830130HCHRVR05","MARTINEZ RIVERA SERGIO ALONSO",30102,204,83101,1001,"02","07","L5XCBI",17,0,3,null,20180401,20180630,14908.5,0]
[null,"CHIHUAHUA","08DPT0007X",200,"MALA850527KR1","MALA850527HTLTCN04","MATUS LECOURTOIS ANDRES ISAAC",30102,216,83101,1001,"02","07","L5XATEC",18,0,3,null,20180401,20180630,19786.5,0]
[null,"CHIHUAHUA","08DPT0007X",100,"MESO501218RY9","MESO501218HJCNLS04","MENDOZA SALAS OSCAR  IGNAC IO",30102,180,83101,1001,"02","07","L5XC",15,0,3,null,20180401,20180630,25728.780000000002,0]
[null,"CHIHUAHUA","08DPT0007X",200,"MESB8507159W0","MESB850715HCHNRN00","MENDOZA SORIANO BENJAMIN ALEJANDRO",30102,240,83101,1001,"02","07","L5XC",20,0,3,null,20180401,20180630,34305,0]
[null,"CHIHUAHUA","08DPT0007X",200,"MOAJ681102IQ0","MOAJ681102HCHNGS07","MONTES AGUILAR JESUS GERARDO",30102,204,83101,1001,"02","07","L5XATEC",17,0,3,null,20180401,20180630,23743.8,0]
[null,"CHIHUAHUA","08DPT0007X",200,"MOMM791027B8A","MOMM791027MCHRRY08","MORALES MORENO MAYRA MARGARITA",30102,228,83101,1001,"02","07","L5XC",19,0,3,null,20180401,20180630,29159.280000000002,0]
[null,"CHIHUAHUA","08DPT0007X",200,"OEPH7911267A5","OEPH791126HCHRNC09","ORNELAS DEL PINO HECTOR RICARDO",30102,216,83101,1001,"02","07","L5XCBI",18,0,3,null,20180401,20180630,29817,0]
[null,"CHIHUAHUA","08DPT0007X",200,"OIGA8509273I1","OIGA850927HCHRTL04","ORTIZ GUTIERREZ JOSE ALBERTO",30102,180,83101,1001,"02","07","L5XCBI",15,0,3,null,20180401,20180630,11926.8,0]
[null,"CHIHUAHUA","08DPT0007X",200,"PEME750130UP9","PEME750130HCHRRR00","PEREZ MARTINEZ ERICK DAVID",30102,216,83101,1001,"02","07","L5XCBI",18,0,3,null,20180401,20180630,26835.3,0]
[null,"CHIHUAHUA","08DPT0007X",100,"PERL8208024K1","PERL820802MCHRMR03","PEREZ RAMOS LAURA ANGELICA",30102,180,83101,1001,"02","07","L5XC",15,0,3,null,20180401,20180630,30874.5,0]
[null,"CHIHUAHUA","08DPT0007X",200,"PESD840502CP3","PESD840502HCHRCG00","PEREZ SAUCEDO DIEGO ALEJANDRO",30102,180,83101,1001,"02","07","L5XATEC",15,0,3,null,20180401,20180630,19786.5,0]
[null,"CHIHUAHUA","08DPT0007X",200,"POMJ860826TB2","POMJ860826HCHRDN05","PORRAS MEDINA JUAN CARLOS",30102,216,83101,1001,"02","07","L5XCBI",18,0,3,null,20180401,20180630,28326.179999999997,0]
[null,"CHIHUAHUA","08DPT0007X",200,"RIBG810102KB8","RIBG810102MCHVRR02","RIVAS BARRAGAN GRACIELA",30102,168,83101,1001,"02","07","L5XCBI",14,0,3,null,20180401,20180630,29817,0]
[null,"CHIHUAHUA","08DPT0007X",100,"ROMP8008014S4","ROMP800801MCSBZT07","ROBLERO MAZARIEGOS PATRICIA",30102,240,83101,1001,"02","07","L5XC",20,0,3,null,20180401,20180630,15437.280000000002,0]
[null,"CHIHUAHUA","08DPT0007X",200,"ROCG680807P47","ROCG680807MCLLSR09","ROLDAN CASTILLO GRISELDA",30102,168,83101,1001,"02","07","L5XCBI",14,0,3,null,20180401,20180630,19381.079999999998,0]
[null,"CHIHUAHUA","08DPT0007X",200,"ROMM911224P47","ROMM911224HCHSNR07","ROSALES MENDOZA MARIO",30102,180,83101,1001,"02","07","L5XATEC",15,0,3,null,20180401,20180630,18467.400000000001,0]
[null,"CHIHUAHUA","08DPT0007X",200,"RUGA7605108F9","RUGA760510MCHVTN01","RUVALCABA GUTIERREZ MARIA ANTONIETA",30102,216,83101,1001,"02","07","L5XCBI",18,0,3,null,20180401,20180630,11926.8,0]
[null,"CHIHUAHUA","08DPT0007X",100,"SASE940502AY3","SASE940502HCHLLD03","SALAZAR SILVA EDGAR OVED",30102,132,83101,1001,"02","07","L5XATEC",11,0,3,null,20180401,20180630,9233.7000000000007,0]
[null,"CHIHUAHUA","08DPT0007X",100,"SAMD9405148N8","SAMD940514HCHLNN04","SALCEDO MONRREAL DANIEL",30102,240,83101,1001,"02","07","L5XCBII",20,0,3,null,20180401,20180630,14683.5,0]
[null,"CHIHUAHUA","08DPT0007X",100,"SAFA580219G58","SAFA580219HVZMLL08","SAMARIO FLORES ALVARO",30102,216,83101,1001,"02","07","L5XC",18,0,3,null,20180401,20180630,34305,0]
[null,"CHIHUAHUA","08DPT0007X",100,"SAOA880909JJ6","SAOA880909HOCMSL00","SAMARIO OSORIO ALVARO OSCAR",30102,204,83101,1001,"02","07","L5XATEC",17,0,3,null,20180401,20180630,25062.9,0]
[null,"CHIHUAHUA","08DPT0007X",100,"SAEO910403QK8","SAEO910403HNLNSS08","SANCHEZ ESTRADA OSCAR IVAN",30102,240,83101,1001,"02","07","L5XATEC",20,0,3,null,20180401,20180630,26382,0]
[null,"CHIHUAHUA","08DPT0007X",100,"SEEI760505188","SAOA880909HOCMSL00","SERRATOS ESPARZA ILSE",30102,192,83101,1001,"02","07","L5XCBI",16,0,3,null,20180401,20180630,29817,0]
[null,"CHIHUAHUA","08DPT0007X",100,"SOSF8907289K0","SOSF890728HSLLNR00","SOLIS SANCHEZ FRANK ALEXIS",30102,204,83101,1001,"02","07","L5XATEC",17,0,3,null,20180401,20180630,22424.7,0]
[null,"CHIHUAHUA","08DPT0007X",200,"TAVY911105KV5","TAVI911105MCHGNS05","TAGLE VENZOR YASSMIN",30102,228,83101,1001,"02","07","L5XCBI",19,0,3,null,20180401,20180630,29817,0]
[null,"CHIHUAHUA","08DPT0007X",200,"TENA800305KZ2","TENA800305HCHJVN00","TEJADA NEVAREZ ANGEL ADRIAN",30102,228,83101,1001,"02","07","L5XCBI",19,0,3,null,20180401,20180630,29817,0]
[null,"CHIHUAHUA","08DPT0007X",200,"TORE8012234Y9","TORE801223HNTPYD08","TOPETE REYES EDGAR",30102,120,83101,1001,"02","07","L5XC",10,0,3,null,20180401,20180630,20583,0]
[null,"CHIHUAHUA","08DPT0007X",100,"TOCJ650407CT0","TOCJ650407HVZRNS07","TORRES CANTERO JOSE",30102,240,83101,1001,"02","07","L5XC",20,0,3,null,20180401,20180630,34305,0]
[null,"CHIHUAHUA","08DPT0007X",200,"TORN791114PY6","TORN791114MCHRYD07","TORRES REY NADIA MARIA",30102,192,83101,1001,"02","07","L5XCBI",16,0,3,null,20180401,20180630,26835.3,0]
[null,"CHIHUAHUA","08DPT0007X",100,"UUAR860131EV3","UUAR860131HCHRRF06","URTUZUASTEGUI ARZOLA RAFAEL",30102,240,83101,1001,"02","07","L5XC",20,0,3,null,20180401,20180630,34305,0]
[null,"CHIHUAHUA","08DPT0007X",200,"VAAF840608FK3","VAAF840608HCHZCR03","VAZQUEZ ACEVEDO FERNANDO",30102,228,83101,1001,"02","07","L5XCBI",19,0,3,null,20180401,20180630,29817,0]
[null,"CHIHUAHUA","08DPT0007X",200,"VIAS640217RZ1","VIAS640217HCHLGL08","VILLALOBOS AGUIRRE SAUL",30102,228,83101,1001,"02","07","L5XCBI",19,0,3,null,20180401,20180630,28326.179999999997,0]
[null,"CHIHUAHUA","08DPT0007X",100,"VIGR720403880","VIGR720403HVZLBC14","VILLARAUZ GABINO RICARDO",30102,216,83101,1001,"02","07","L5XCBI",18,0,3,null,20180401,20180630,29159.280000000002,0]
[null,"CHIHUAHUA","08DPT0008W",100,"AUED570608MR1","AUED570608HZSGSN08","DANIEL AGUILAR ESPARZA",20214,480,83101,1003,"02","08","CF33203",0,"9354",2,null,20180401,20180630,48493.66,0]
[null,"CHIHUAHUA","08DPT0008W",100,"BESJ800501RQ3","BESJ800501HCLRLL06","JULIO CESAR BERNAL SALAS",20214,480,83101,1003,"02","08","CF33206",0,13383,2,null,20180401,20180630,69514.94,0]
[null,"CHIHUAHUA","08DPT0008W",100,"EOCA6608284C4","EOCA660828HCHSRG02","AGUSTIN ESCOBAR CERVANTES",20214,480,83101,1003,"02","08","CF18201",0,12852,2,null,20180401,20180630,32880.230000000003,0]
[null,"CHIHUAHUA","08DPT0008W",100,"EOHE660901TLA","EOHE660901MCHSLV04","EVA MARIA ESCOBAR HOLGUIN",20214,480,83101,1003,"02","08","SO1202",0,"9359",2,null,20180401,20180630,44497.209999999992,0]
[null,"CHIHUAHUA","08DPT0008W",100,"HEGA690525I40","HEGA690525MCHRRL02","ALICIA HERNANDEZ GARCIA",20214,480,83101,1003,"02","08","AO3202",0,"13382",2,null,20180401,20180630,44957.929999999993,0]
[null,"CHIHUAHUA","08DPT0008W",100,"HEGE6610076V0","HEGE661007MSIRLG06","MARIA EUGENIA HERRERA GOLARTE",20214,480,83101,1003,"02","08","CF33206",0,"9350",2,null,20180401,20180630,107402.38000000002,0]
[null,"CHIHUAHUA","08DPT0008W",100,"MAVM680815AT6","MAVM680815HCHRLR01","MARIO ALBERTO MARTINEZ VILLELA",20214,480,83101,1003,"02","08","CF33206",0,"13384",2,null,20180401,20180630,106817.63999999998,0]
[null,"CHIHUAHUA","08DPT0008W",100,"MALM890515EN0","MALM890515HCHTCR05","MARIO ALBERTO MATA LICON",20514,480,83101,1003,"02","08","CF02103",0,"12588",5,null,20180401,20180630,85992.48,0]
[null,"CHIHUAHUA","08DPT0008W",100,"MEMF660302UM0","MEMF660302HCHNLD06","FEDERICO MENDOZA MOLINA",20214,480,83101,1003,"02","08","CF18203",0,"9369",2,null,20180401,20180630,50829.700000000012,0]
[null,"CHIHUAHUA","08DPT0008W",100,"MOAG600916JW6","MOAG600916HCHYCL04","GUILLERMO MOY ACOSTA",20214,480,83101,1003,"02","08","CF02105",0,2377,5,null,20180401,20180630,66459.899999999994,0]
[null,"CHIHUAHUA","08DPT0008W",100,"OOVM6504302T1","OOVM650430HCHRLS07","MOISES OROZCO VALDEZ",20214,480,83101,1003,"02","08","CF18203",0,"9363",2,null,20180401,20180630,52313.700000000004,0]
[null,"CHIHUAHUA","08DPT0008W",100,"PANA720117JW4","PANA720117HDGLVN01","ANTONIO PALMA NEVAREZ",20214,480,83101,1003,"02","08","CF19201",0,"9365",2,null,20180401,20180630,43819.409999999996,0]
[null,"CHIHUAHUA","08DPT0008W",100,"PAHA640330KP3","PAHA640330MCHYLR06","ARMIDA IRENE PAYAN HOLGUIN",20214,480,83101,1003,"02","08","CF33206",0,"13385",2,null,20180401,20180630,125820.52999999997,0]
[null,"CHIHUAHUA","08DPT0008W",100,"POAJ710301PK6","POAJ710301MCHRLS06","MARIA DE JESUS PORTILLO ALARCON",20214,480,83101,1003,"02","08","CF34201",0,"9358",2,null,20180401,20180630,33991.599999999999,0]
[null,"CHIHUAHUA","08DPT0008W",100,"RIGR710129FB6","RIGR710129MCHVRQ06","RAQUEL ERENDIDA RIVERA GARCIA",20214,480,83101,1003,"02","08","CF04201",0,"9366",2,null,20180401,20180630,47306.17,0]
[null,"CHIHUAHUA","08DPT0008W",100,"SAML750404ND1","SAML750404MCHNXZ07","SAENZ MUNOZ LUZ MARIA",20214,480,83101,1003,"02","08","SO1201",0,9358,2,null,20180401,20180630,28686.11,0]
[null,"CHIHUAHUA","08DPT0008W",100,"SADE650818IV1","SADE650818MCHLRL09","MARIA ELENA SALAZAR DUARTE",20214,480,83101,1003,"02","08","AO3202",0,"9352",2,null,20180401,20180630,44957.929999999993,0]
[null,"CHIHUAHUA","08DPT0008W",100,"TAHJ7109304KA","TAHJ710930HCHRLV01","JAVIER EUSEBIO TARANGO HOLGUIN",20214,480,83101,1003,"02","08","CF33206",0,"14089",2,null,20180401,20180630,107997.63999999998,0]
[null,"CHIHUAHUA","08DPT0008W",100,"VARJ610925H36","VARJ610925HCHLSS00","JESUS ANTONIO VALDEZ ROSALES",20214,480,83101,1003,"02","08","CF18201",0,"9367",2,null,20180401,20180630,39458.6,0]
[null,"CHIHUAHUA","08DPT0008W",100,"VEGR750904UR2","VEGR750904MCHLRS06","ROSALIA MARGARITA VELARDE GARCIA",20214,480,83101,1003,"02","08","CF33206",0,9350,2,null,20180401,20180630,69514.94,0]
[null,"CHIHUAHUA","08DPT0008W",100,"VARO691222JA8","VAXR691222MCHLXS07","ROSA MARIA VALENZUELA",30102,216,83101,1003,"02","08","L5XCBI",18,0,3,null,20180401,20180630,25523.1,0]
[null,"CHIHUAHUA","08DPT0008W",100,"AUMM780328A31","AUMM780328MCHGLN09","MINERVA AGUILAR MOLINAR",30102,240,83101,1003,"02","08","L5XCBI",20,0,3,null,20180401,20180630,28359,0]
[null,"CHIHUAHUA","08DPT0008W",100,"AEGL800105RF6","AEGL800105MCHLNZ06","LIZETTE JOHANNA ALEJANDRO GONZALEZ",30102,228,83101,1003,"02","08","L5XCBI",19,0,3,null,20180401,20180630,26941.08,0]
[null,"CHIHUAHUA","08DPT0008W",100,"AAGJ670423U8A","AAGJ670423HCHMNR05","JORGE AMPARAN GONZALEZ",30102,240,83101,1003,"02","08","L5XCBI",20,0,3,null,20180401,20180630,28359,0]
[null,"CHIHUAHUA","08DPT0008W",100,"AESS721002N67","AESS721002MCHRTS00","SUSANA ARMENDARIZ SOTO",30102,240,83101,1003,"02","08","L5XCBI",20,0,3,null,20180401,20180630,24573,0]
[null,"CHIHUAHUA","08DPT0008W",100,"BAVM821203FN0","BAVM821203MCHRLN06","MONICA LOURDES BARRAZA VILLALOBOS",30102,228,83101,1003,"02","08","L5XC",19,0,3,null,20180401,20180630,26941.08,0]
[null,"CHIHUAHUA","08DPT0008W",100,"CAVS820702FV1","CAVS820702MCHRRN01","SANDRA ELIZABETH CARDENAS VARGAS",30102,216,83101,1003,"02","08","L5XCBI",18,0,3,null,20180401,20180630,22115.7,0]
[null,"CHIHUAHUA","08DPT0008W",100,"ROMJ731201675","CANA840815MCHRVN00","ANA ISABEL CARREON NAVA",30102,228,83101,1003,"02","08","L5XCBI",19,0,3,null,20180401,20180630,20770.8,0]
[null,"CHIHUAHUA","08DPT0008W",100,"COMR940524BD4","COMR940524HCHNRD00","CONTRERAS MARTINEZ RODOLFO",30102,168,83101,1003,"02","08","L5XCBI",14,0,3,null,20180401,20180630,15304.8,0]
[null,"CHIHUAHUA","08DPT0008W",100,"COFA750408JB9","COFA750408MCHRRZ08","AZUCENA CORRAL FRANCO",30102,160,83101,1003,"02","08","L5XCBII",20,0,3,null,20180401,20180630,24573,0]
[null,"CHIHUAHUA","08DPT0008W",100,"DIHL770620B93","DIHL770620MCHZRZ06","LUZ IMELDA DIAZ HERNANDEZ",30102,240,83101,1003,"02","08","L5ATEC",20,0,3,null,20180401,20180630,28359,0]
[null,"CHIHUAHUA","08DPT0008W",100,"GASJ850822GF7","GASJ850822HCHLNS04","JOSE GALVEZ SANTANA",30102,228,83101,1003,"02","08","L5XCBI",19,0,3,null,20180401,20180630,26941.08,0]
[null,"CHIHUAHUA","08DPT0008W",100,"CAEJ9105085V8","GASA810331MCHRRD08","ADRIANA GARDEA SERRANO",30102,240,83101,1003,"02","08","L5XCBI",20,0,3,null,20180401,20180630,21864,0]
[null,"CHIHUAHUA","08DPT0008W",100,"GULM750313628","GULM750313HCHLNN08","MANUEL ALEJANDRO GULLEN LUNA",30102,228,83101,1003,"02","08","L5XC",19,0,3,null,20180401,20180630,26941.08,0]
[null,"CHIHUAHUA","08DPT0008W",100,"HEAJ8610295N1","HEAJ861029HCHRCN09","JUAN CARLOS HERNANDEZ ACOSTA ",30102,240,83101,1003,"02","08","L5XATEC",20,0,3,null,20180401,20180630,28359,0]
[null,"CHIHUAHUA","08DPT0008W",100,"HEGE760311918","HEGE760311HCHRTF05","EFRAIN ARTURO HERNANDEZ GUTIERREZ",30102,204,83101,1003,"02","08","L5XCBI",17,0,3,null,20180401,20180630,13662.9,0]
[null,"CHIHUAHUA","08DPT0008W",100,"MAML7703077T7","MAML770307MCHCRS01","LESSLEY MYRLEE MACIAS MARTINEZ",30102,216,83101,1003,"02","08","L5XCBI",18,0,3,null,20180401,20180630,25523.1,0]
[null,"CHIHUAHUA","08DPT0008W",100,"MAEJ690219AK2","MAEJ690219HCHRSS06","JESUS MARTINEZ ESPARZA",30102,204,83101,1003,"02","08","L5XCBII",17,0,3,null,20180401,20180630,24105.18,0]
[null,"CHIHUAHUA","08DPT0008W",100,"MECO5508271G3","MECO550827MSLXSL09","MEXIA CASTRO OLGA PATRICIA",30102,240,83101,1003,"02","08","L5XC",20,0,3,null,20180401,20180630,28359,0]
[null,"CHIHUAHUA","08DPT0008W",100,"MOGE730414EA4","MOGE730414HCHRRL09","MORENO GARCIA ELISEO",30102,216,83101,1003,"02","08","L5XCBI",18,0,3,null,20180401,20180630,19677.599999999999,0]
[null,"CHIHUAHUA","08DPT0008W",100,"MUMP8911284K8","MUMP891128HCHXXS06","PASCUAL ABRAHAM MUÑOZ MUÑOZ",30102,240,83101,1003,"02","08","L5XCBI",20,0,3,null,20180401,20180630,21864,0]
[null,"CHIHUAHUA","08DPT0008W",100,"NAHJ790815BF0","NAHJ790815HCHVRS00","JESUS MIGUEL NAVARRO HERNANDEZ",30102,240,83101,1003,"02","08","L5XCBI",20,0,3,null,20180401,20180630,21864,0]
[null,"CHIHUAHUA","08DPT0008W",100,"OIGM890424IC1","OIGM890424MCHLRR06","MARTA ALEJANDRA OLIVAS GUERRERO",30102,228,83101,1003,"02","08","L5XC",19,0,3,null,20180401,20180630,26941.08,0]
[null,"CHIHUAHUA","08DPT0008W",100,"OINS5902223YA","OINS590222HMNLXL02","OLIVO NUÑEZ JOSE SALVADOR",30102,240,83101,1003,"02","08","L5XC",20,0,3,null,20180401,20180630,28595.33,0]
[null,"CHIHUAHUA","08DPT0008W",100,"PAVF6602076Y9","PAVF660207MCHLRL06","PALMA VARGAS FLOR",30102,180,83101,1003,"02","08","L5XCBI",15,0,3,null,20180401,20180630,16398,0]
[null,"CHIHUAHUA","08DPT0008W",100,"PAFV661205KZ5","PAFV661205HCHTRC01","PATENA FIERRO VICTOR MANUEL",30102,216,83101,1003,"02","08","L5XCBI",18,0,3,null,20180401,20180630,22115.7,0]
[null,"CHIHUAHUA","08DPT0008W",100,"RERP770809FK9","RERP770809HCHDDD04","PEDRO OSWALDO REDE RODRIGUEZ",30102,240,83101,1003,"02","08","L5XC",20,0,3,null,20180401,20180630,28359,0]
[null,"CHIHUAHUA","08DPT0008W",100,"REVY780409NT1","REVY780409MCHYLZ05","YASMIN LISSET REYES VALLES",30102,216,83101,1003,"02","08","L5XCBI",18,0,3,null,20180401,20180630,22115.7,0]
[null,"CHIHUAHUA","08DPT0008W",100,"RIGJ610311956","RIGJ610311HDFVRL08","JOEL RAUL RIVAS GARCIA",30102,216,83101,1003,"02","08","L5XC",18,0,3,null,20180401,20180630,22115.7,0]
[null,"CHIHUAHUA","08DPT0008W",100,"ROGR680108PWA","ROGR680108HCHDRC09","RICARDO RODRIGUEZ GARCIA",30102,240,83101,1003,"02","08","L5XCBI",20,0,3,null,20180401,20180630,28359,0]
[null,"CHIHUAHUA","08DPT0008W",100,"RORF881013FI1","RORF881013MCHDBT02","RODRIGUEZ ROBLES FATIMA",30102,228,83101,1003,"02","08","L5XCBI",19,0,3,null,20180401,20180630,23344.38,0]
[null,"CHIHUAHUA","08DPT0008W",100,"SADR840831726","SADR840831HCHNZM02","RAMON AGUSTO SANCHEZ DIAZ",30102,120,83101,1003,"02","08","L5XCBI",10,0,3,null,20180401,20180630,14179.5,0]
[null,"CHIHUAHUA","08DPT0008W",100,"SARJ650111CB4","SARJ650111HCHNVM05","JAIME SANCHEZ RIVERA",30102,120,83101,1003,"02","08","L5XCBI",10,0,3,null,20180401,20180630,14179.5,0]
[null,"CHIHUAHUA","08DPT0008W",100,"VAVS740521TK5","VAVS740521HCHLLL09","SAUL ARMANDO VALLES VALLE",30102,120,83101,1003,"02","08","L5XCBI",10,0,3,null,20180401,20180630,14180.1,0]
[null,"CHIHUAHUA","08DPT0008W",100,"VICG5002047Q6","VICG500204HCHTRL01","GILBERTO FELICIANO VITELA CARRASCO",30102,216,83101,1003,"02","08","L5XCBI",18,0,3,null,20180401,20180630,25523.1,0]
[null,"CHIHUAHUA","08DPT0012I",124,"CAMC8511068L5","CAMC851106MCHRRR00","CARMEN IVONNE CARMONA MURILLO","20216",480,83101,1003,"02","18","SO1201",0,9680,2,null,20180401,20180630,29102.82,0]
[null,"CHIHUAHUA","08DPT0012I",124,"CATJ640415MG5","CATJ640415HCHHRN06","JUAN ANTONIO CHAVEZ TERRAZAS","20108",480,83101,1003,"02","18","CF33206",0,13933,2,null,20180401,20180630,122743.15,0]
[null,"CHIHUAHUA","08DPT0012I",124,"COVC830703U30","COVC830703MCHRZY01","CYNTHIA ROSARIO CORONADO VAZQUEZ","20109",480,83101,1003,"02","18","CF33206",0,14308,2,null,20180401,20180630,89368.86,0]
[null,"CHIHUAHUA","08DPT0012I",124,"EIRL670407TS6","EIRL670407MCHNDT08","LETICIA ENRIQUEZ RODRIGUEZ","20105",480,83101,1003,"02","18","CF33206",0,13934,2,null,20180401,20180630,125150.95,0]
[null,"CHIHUAHUA","08DPT0012I",124,"GACI7107098NA","GACI710709MCHRRM01","IMELDA IVONE GARCIA CARMONA","20201",480,83101,1003,"02","18","CF33203",0,9688,2,null,20180401,20180630,51266.209999999992,0]
[null,"CHIHUAHUA","08DPT0012I",124,"GOMB690116428","GOMB690116MCHNRL02","BELIA LORENA GONZALEZ  MORENO","20206",480,83101,1003,"02","18","A03202",0,9677,2,null,20180401,20180630,42481.22,0]
[null,"CHIHUAHUA","08DPT0012I",124,"IAMM880831RY4","IAMM880831MCHZRR03","MAR ELISA IZAGUIRRE MARTINEZ","20216",480,83101,1003,"02","18","A03202",0,9678,2,null,20180401,20180630,36642.19,0]
[null,"CHIHUAHUA","08DPT0012I",124,"LECG700827GY1","LECG700827MCHCHL00","GLORIA A LECHUGA CHAVEZ","20201",480,83101,1003,"02","18","CF33204",0,9675,2,null,20180401,20180630,79047.649999999994,0]
[null,"CHIHUAHUA","08DPT0012I",124,"LOLJ670723J90","LOLJ670723HCHPZV05","JAVIER LOPEZ LOZANO","20401",480,83101,1003,"02","18","SO1201",0,9681,2,null,20180401,20180630,27922.82,0]
[null,"CHIHUAHUA","08DPT0012I",124,"MAAS821018113","MAAS821018HCHRNG05","SIGIFREDO MARQUEZ ANCHONDO","20216",480,83101,1003,"02","18","CF18203",0,8788,2,null,20180401,20180630,40876.230000000003,0]
[null,"CHIHUAHUA","08DPT0012I",124,"MAQS651014TH4","MAQS651014HCHRNL03","SAUL MARQUEZ QUINTANA","20302",480,83101,1003,"02","18","CF18201",0,9689,2,null,20180401,20180630,32847.839999999997,0]
[null,"CHIHUAHUA","08DPT0012I",124,"PEDR620906HG6","PEDR620906HCHRMM07","RAMON JAVIER PEREZ DOMINGUEZ","50401",480,83101,1003,"02","18","CF02104",0,12726,5,null,20180401,20180630,85992.48,0]
[null,"CHIHUAHUA","08DPT0012I",124,"ROCR700830F58","ROCR700830HCHDNC08","RICARDO ANTELMO RODRIGUEZ CANO","20302",480,83101,1003,"02","18","S01202",0,9681,2,null,20180401,20180630,37613.01,0]
[null,"CHIHUAHUA","08DPT0012I",124,"ROTF760823LY5","ROTF760823MCHDRL03","FLOR GUADALUPE RODRIGUEZ TREJO","20216",480,83101,1003,"02","18","CF04201",0,9676,2,null,20180401,20180630,40565.329999999994,0]
[null,"CHIHUAHUA","08DPT0012I",124,"SOMD561124TEA","SOMD561124HCHTDV09","DAVID SOTELO MEDRANO","20205",480,83101,1003,"02","18","T08201",0,11851,2,null,20180401,20180630,44840.69,0]
[null,"CHIHUAHUA","08DPT0012I",124,"TERL781019J60","TERL781019HCHNDS08","LUIS CARLOS TENA RODELAS","20206",480,83101,1003,"02","18","CF21202",0,9694,2,null,20180401,20180630,41325.800000000003,0]
[null,"CHIHUAHUA","08DPT0012I",124,"UIST6008045JA","UIST600804HDGRMM07","TOMAS URBINA SIMENTAL","20216",480,83101,1003,"02","18","CF18203",0,9691,2,null,20180401,20180630,48007.009999999995,0]
[null,"CHIHUAHUA","08DPT0012I",124,"VAGA800112LSA","VAGA800112HCHLTL07","ALBERTO VALENZUELA GUTIERREZ",20216,480,83101,1003,"02","18","CF19201",0,9692,2,null,20180401,20180630,30100.23,0]
[null,"CHIHUAHUA","08DPT0012I",124,"VIMD590726DU0","VIMD590726HCHLRN05","DONACIANO VILLALOBOS MORENO","20109",480,83101,1003,"02","18","CF33206",0,13932,2,null,20180401,20180630,121150.56,0]
[null,"CHIHUAHUA","08DPT0012I",200,"AARP7710257KA","AARP771025MCHLZL02","PALMA LILIANA ALMANZA RUIZ","30102",168,83101,1001,"02","18","L5XC",14,0,3,null,20180401,20180630,19851.3,0]
[null,"CHIHUAHUA","08DPT0012I",124,"AAOG811026Q47","AAOG811026MCHRRB02","GABRIELA MARIA ARAGON ORTIZ","30102",240,83101,1001,"02","18","L5XCBII",20,0,3,null,20180401,20180630,24573,0]
[null,"CHIHUAHUA","08DPT0012I",100,"CARE8810091J2","CARE881009HCHRMD08","EDGAR ENRIQUE CARREON RAMOS","30102",216,83101,1001,"02","18","L5XC",18,0,3,null,20180401,20180630,25523.1,0]
[null,"CHIHUAHUA","08DPT0012I",100,"CACP850903KT2","CACP850903MCHHHR00","PERLA JAZMIN CHAIREZ CHACON","30102",204,83101,1001,"02","18","L5XC",17,0,3,null,20180401,20180630,24105.18,0]
[null,"CHIHUAHUA","08DPT0012I",100,"CAJG690110UD1","CAJG690110HCHHRN00","GONZALO CHAVEZ JUAREZ","30102",240,83101,1001,"02","18","L5XC",20,0,3,null,20180401,20180630,28359,0]
[null,"CHIHUAHUA","08DPT0012I",200,"CAMN760505UE4","CAMN760505MCHHNN03","NANCY LORENA CHAVEZ MONCADA","30102",192,83101,1001,"02","18","L5XC",16,0,3,null,20180401,20180630,22687.200000000001,0]
[null,"CHIHUAHUA","08DPT0012I",100,"PEMC8412061M5","PEMC841206HCHXRR02","CARLOS DE LA PEÑA MERAZ","30102",240,83101,1001,"02","18","L5XC",20,0,3,null,20180401,20180630,24105.18,0]
[null,"CHIHUAHUA","08DPT0012I",100,"DOCE610806AJ3","DOCE610806MCHMMS03","ESPERANZA DOMINGUEZ CAMUÑEZ","30102",216,83101,1001,"02","18","L5XCBI",18,0,3,null,20180401,20180630,19677.599999999999,0]
[null,"CHIHUAHUA","08DPT0012I",100,"DOCA7712105BA","DOCA771210HCHMSL05","ALVARO DOMINGUEZ CASARES","30102",228,83101,1001,"02","18","L5XCBI",19,0,3,null,20180401,20180630,20770.8,0]
[null,"CHIHUAHUA","08DPT0012I",200,"DOTW8710023S3","DOTW871002HCHMRL06","WALTER ALEJANDRO DOMINGUEZ TORRES","30102",180,83101,1001,"02","18","L5XC",15,0,3,null,20180401,20180630,21269.280000000002,0]
[null,"CHIHUAHUA","08DPT0012I",100,"DUIA911217JM8","DUIA911217HCHRBR05","ARMANDO ALEXIS DUARTE IBARRA","30102",240,83101,1001,"02","18","L5XCBI",20,0,3,null,20180401,20180630,18584.399999999998,0]
[null,"CHIHUAHUA","08DPT0012I",124,"EACL761108IA6","EACL761108HCHSHS08","JOSE LUIS ESTRADA CHAVEZ","30102",168,83101,1001,"02","18","L5XATEC",14,0,3,null,20180401,20180630,11251.8,0]
[null,"CHIHUAHUA","08DPT0012I",200,"FITM7609208P9","FITM760920MCHGVR05","MARISOL FIGUEROA TOVAR","30102",216,83101,1001,"02","18","L5XC",18,0,3,null,20180401,20180630,25523.1,0]
[null,"CHIHUAHUA","08DPT0012I",124,"FORM921019289","FORM921019HCHLDR09","MARCO ANTONIO FLORES RODRIGUEZ","30102",216,83101,1001,"02","18","L5XCBI",18,0,3,null,20180401,20180630,19677.599999999999,0]
[null,"CHIHUAHUA","08DPT0012I",100,"GAMC820716BJ4","GAMC820716MCHLRR08","MARIA DEL CARMEN GALLEGOS MARTINEZ","30102",240,83101,1001,"02","18","L5XC",20,0,3,null,20180401,20180630,28359,0]
[null,"CHIHUAHUA","08DPT0012I",100,"GOCS820528T91","GOCS820528MCHNLN05","SANDRA BERENICE GONZALEZ COLMENERO","30102",240,83101,1001,"02","18","L5XC",20,0,3,null,20180401,20180630,28359,0]
[null,"CHIHUAHUA","08DPT0012I",100,"GOGG631226J88","GOGG631226MCHNLL06","GLORIA MARINA GONZALEZ GALLEGOS","30102",216,83101,1001,"02","18","L5XC",18,0,3,null,20180401,20180630,25523.1,0]
[null,"CHIHUAHUA","08DPT0012I",100,"GOQM960413969","GOQM960413HCHNXR03","MARCO ANTONIO GONZALEZ QUIÑONEZ","30102",120,83101,1001,"02","18","L5XATEC",10,0,3,null,20180401,20180630,8037,0]
[null,"CHIHUAHUA","08DPT0012I",100,"GAMO630830H94","GAMO630830MCHRRL07","OLGA CECILIA GRAJEDA  MIRAMONTES","30102",240,83101,1001,"02","18","L5XC",20,0,3,null,20180401,20180630,28359,0]
[null,"CHIHUAHUA","08DPT0012I",124,"HEGP741201TCA","HEGP741201MCHRRT03","PATRICIA OLAYA HERRERA GARCIA","30102",228,83101,1001,"02","18","L5XC",19,0,3,null,20180401,20180630,26941.08,0]
[null,"CHIHUAHUA","08DPT0012I",100,"IIOF8012093M1","IIOF801209HCHRLR08","FRANCISCO IRIGOYEN OLIVAS","30102",240,83101,1001,"02","18","L5XC",20,0,3,null,20180401,20180630,23632.5,0]
[null,"CHIHUAHUA","08DPT0012I",200,"IAFR620519979","IAFR620519HSLZRM07","RAMON  IZAGUIRRE FIERRO","30102",240,83101,1001,"02","18","L5XCBII",20,0,3,null,20180401,20180630,24573,0]
[null,"CHIHUAHUA","08DPT0012I",200,"JAAG74101784A","JAAG741017MCHQRL01","GLORIA LINDA JAQUEZ ARBALLO","30102",240,83101,1001,"02","18","L5XC",20,0,3,null,20180401,20180630,28359,0]
[null,"CHIHUAHUA","08DPT0012I",200,"LAGL890709J41","LAGL890709MCHZNL07","LLUVIA CRISTINA LAZO GONZALEZ","30102",228,83101,1001,"02","18","L5XCBII",19,0,3,null,20180401,20180630,23344.38,0]
[null,"CHIHUAHUA","08DPT0012I",200,"MALS840210DM2","MALS840210MCHCYL02","SILVIA ISELA MACIAS LOYA","30102",120,83101,1001,"02","18","L5XC",10,0,3,null,20180401,20180630,14179.5,0]
[null,"CHIHUAHUA","08DPT0012I",124,"MAGZ860917JB4","MAGZ860917MCHLLL02","ZULEYKA MARIELA MALDONADO GIL","30102",240,83101,1001,"02","18","L5XC",20,0,3,null,20180401,20180630,28359,0]
[null,"CHIHUAHUA","08DPT0012I",200,"MATM841124GU1","MATM841124MCHRLY00","MAYTEE ABRIL MARQUEZ TELLO","30102",168,83101,1001,"02","18","L5XC",14,0,3,null,20180401,20180630,19851.3,0]
[null,"CHIHUAHUA","08DPT0012I",100,"MAGM880802UR1","MAGM880802MCHRRR08","MARINA ANGELICA MARTINEZ GARCIA","30102",228,83101,1001,"02","18","L5XC",19,0,3,null,20180401,20180630,26941.08,0]
[null,"CHIHUAHUA","08DPT0012I",200,"MEOE6606187C0","MEOE660618HCHLRF02","EFREN MELENDEZ ORTIZ","30102",180,83101,1001,"02","18","L5XC",15,0,3,null,20180401,20180630,21269.280000000002,0]
[null,"CHIHUAHUA","08DPT0012I",100,"MERA900126FD2","MERA900126MCHNMN03","ANA ISABEL MENDOZA RAMOS","30102",240,83101,1001,"02","18","L5XCBI",20,0,3,null,20180401,20180630,21864,0]
[null,"CHIHUAHUA","08DPT0012I",124,"MOEJ8410204P7","MOEJ841020HCHRSS09","JESUS MORENO ESTRADA","30102",120,83101,1001,"02","18","L5XCBII",10,0,3,null,20180401,20180630,14179.5,0]
[null,"CHIHUAHUA","08DPT0012I",200,"NUMR860506DV4","NUMR860506MCHXRQ03","RAQUEL NUÑEZ MARTINEZ","30102",240,83101,1001,"02","18","L5XC","20.0",0,3,null,20180401,20180630,28359,0]
[null,"CHIHUAHUA","08DPT0012I",200,"OIPC830620AE8","OIPC830620HCHRRR03","CARLOS ALEJANDRO ORTIZ PAREDES","30102",228,83101,1001,"02","18","L5XC",19,0,3,null,20180401,20180630,26941.08,0]
[null,"CHIHUAHUA","08DPT0012I",100,"PAVC680810379","PAVC680810MCHLLR09","CARMEN LORENA PALMA VALVERDE","30102",192,83101,1001,"02","18","L5XC",16,0,3,null,20180401,20180630,22687.200000000001,0]
[null,"CHIHUAHUA","08DPT0012I",100,"PAVK8303143F4","PAVK830314MCHYLR05","KARLA DENISSE PAYAN VALVERDE","30102",240,83101,1001,"02","18","L5XC",20,0,3,null,20180401,20180630,28359,0]
[null,"CHIHUAHUA","08DPT0012I",100,"POED8604086S3","POED860408MCHRCN03","DIANA ELIZABETH PORTILLO ECHAVARRIA","30102",240,83101,1001,"02","18","L5XC",20,0,3,null,20180401,20180630,28359,0]
[null,"CHIHUAHUA","08DPT0012I",200,"RORH430507A24","RORH430507HDGBMC03","HECTOR ANTONIO ROBALI ROMERO","30102",240,83101,1001,"02","18","L5XC",20,0,3,null,20180401,20180630,14179.5,0]
[null,"CHIHUAHUA","08DPT0012I",200,"ROAN6811104YA","ROAN681110HVZDGX08","JOSE NOE RODRIGUEZ AGUILERA","30102",156,83101,1001,"02","18","L5XC",13,0,3,null,20180401,20180630,18433.38,0]
[null,"CHIHUAHUA","08DPT0012I",100,"ROVC830522ILA","ROVC830522MCHDLR00","CRISTINA RODRIGUEZ VALVERDE","30102",216,83101,1001,"02","18","L5XCBI",18,0,3,null,20180401,20180630,19677.599999999999,0]
[null,"CHIHUAHUA","08DPT0012I",200,"SAME780216645","SAME780216MCHCLS05","ESMERALDA SAUCEDO MOLINA","30102",240,83101,1001,"02","18","L5XC",20,0,3,null,20180401,20180630,28359,0]
[null,"CHIHUAHUA","08DPT0012I",200,"UUGA831111DY9","UUGA831111MCHRND03","ADRIANA ARMINE URQUIZA GONZALEZ","30102",216,83101,1001,"02","18","L5XC",18,0,3,null,20180401,20180630,25523.1,0]
[null,"CHIHUAHUA","08DPT0012I",100,"VATL8403292K8","VATL840329HCHLRS05","LUIS OCTAVIO VALVERDE TORRES","30102",240,83101,1001,"02","18","L5XCBII",20,0,3,null,20180401,20180630,24573,0]
[null,"CHIHUAHUA","08DPT0012I",100,"VACA8309027BA","VXCA830902HCHZHN07","ANDRES VAZQUEZ  CHAVEZ","30102",216,83101,1001,"02","18","L5XC",18,0,3,null,20180401,20180630,25523.1,0]
[null,"CHIHUAHUA","08DPT0012I",100,"VIMG940827G9A","VIMG940827MCHLNL05","GUILLE LIZBETH VILLALOBOS MONAÑO","30102",120,83101,1001,"02","18","L5XCBI",10,0,3,null,20180401,20180630,6559.2000000000007,0]
[null,"CHIHUAHUA","08DPT0012I",200,"VIVR8208282I1","VIVR820828HDGLLB03","ROBERTO RENE VILLALPALDO VILLALPANDO","30102",204,83101,1001,"02","18","L5XATEC",17,0,3,null,20180401,20180630,13662.9,0]
[null,"CHIHUAHUA","08DPT0011J",120,"AAEJ730109C94","AAEJ730109HCHLSL06","ALVAREZ ESCARCEGA JULIAN ","20206",480,83101,1003,"02",19,"S01201",0,"9738",2,null,20180401,20180630,28590.7,0]
[null,"CHIHUAHUA","08DPT0011J",120,"AOJS831129TE8","AOJS831129MCHNRL09","ANCHONDO JUAREZ SILVIA GRACIELA",20206,480,83101,1003,"02",19,"S01202",0,"2386",2,null,20180401,20180630,36658.03,0]
[null,"CHIHUAHUA","08DPT0011J",120,"AOLY671118ELA","AOLY671118MDGRCZ05","ARROYO LECHUGA YAZMIN",20109,480,83101,1003,"02",19,"CF33206",0,"14302",2,null,20180401,20180630,113080.12999999999,0]
[null,"CHIHUAHUA","08DPT0011J",120,"AIAA780609P70","AIAA780609HCHVGG01","AVITIA AGUILAR AGUSTIN ",20105,240,83101,1003,"02",19,"CF02105",0,"14576",5,null,20180401,20180630,33229.949999999997,0]
[null,"CHIHUAHUA","08DPT0011J",120,"BARM6606271QA","BARM660627HCHRBR03","MARIO ALBERTO BARBA RUBIO ","20216",480,83101,1003,"02",19,"CF18201",0,"9741",2,null,20180401,20180630,27544.82,0]
[null,"CHIHUAHUA","08DPT0011J",120,"CAMF661018JC7","CAMF661018HCHHDR08","FRANCISCO JAVIER CABRERA MEDINA","20205",480,83101,1003,"02",19,"CF33204",0,"6359",2,null,20180401,20180630,80769.080000000016,0]
[null,"CHIHUAHUA","08DPT0011J",120,"CAVJ9010233Z3","CAVJ901023MCHXZH05","CAÑAS VAZQUEZ JAHAIRA ARANI ",20205,480,83101,1003,"02",19,"CF33204",0,"9734",2,null,20180401,20180630,43946.960000000006,0]
[null,"CHIHUAHUA","08DPT0011J",120,"AESG7103187K4","AESG710318MCLNGL04","DE LOS ANGELES SEGURA GLORIA MARIA ",20109,480,83101,1003,"02",19,"CF33206",0,"13638",2,null,20180401,20180630,60190.439999999995,0]
[null,"CHIHUAHUA","08DPT0011J",120,"EUGM7504107E2","EUGM750410HCHSRR05","ESQUIVEL GUERRERO MAURO EZEQUIEL ",20216,480,83101,1003,"02",19,"S01202",0,"9718",2,null,20180401,20180630,29192.959999999995,0]
[null,"CHIHUAHUA","08DPT0011J",120,"FACG681029MZ8","FACG681029MCHDRR04","GEORGINA FAUDOA CRUZ","50408",480,83101,1003,"02",19,"CF19201",0,9706,2,null,20180401,20180630,50382.65,0]
[null,"CHIHUAHUA","08DPT0011J",120,"FEPD840911LH2","FEPD840911MCHRZN04","DENISSE JANETT FERNANDEZ PAEZ","20214",480,83101,1003,"02",19,"CF33204",0,"9714",2,null,20180401,20180630,68716.37,0]
[null,"CHIHUAHUA","08DPT0011J",120,"FOTL710111D65","FOTL710111MDFLNL02","LILLIAN KARINA FLOTTE TINOCO ",20109,480,83101,1003,"02",19,"CF33206",0,"14303",2,null,20180401,20180630,76849.7,0]
[null,"CHIHUAHUA","08DPT0011J",120,"GAGJ740328P75","GAGJ740328HCHLNR03","JORGE ARTURO GALLEGOS GONZALEZ","20109",480,83101,1003,"02",19,"CF18203",0,"9725",2,null,20180401,20180630,46053.259999999995,0]
[null,"CHIHUAHUA","08DPT0011J",120,"GOML880120US2","GOML880120MCHMNZ01","LUZ IVONNE GOMEZ MENDOZA ",20202,240,83101,1003,"02",19,"S01201",0,"9723",2,null,20180401,20180630,9373.39,0]
[null,"CHIHUAHUA","08DPT0011J",120,"GOQG650428BVA","GOQG650428MCHNNR07","GEORGINA GONZALEZ QUINTANA","20216",480,83101,1003,"02",19,"A03202",0,"9700",2,null,20180401,20180630,37454.890000000007,0]
[null,"CHIHUAHUA","08DPT0011J",120,"GURJ541104T10","GURJ541104HCHRMS04","JESUS LUIS GUERRA RAMIREZ","20206",480,83101,1003,"02",19,"CF18201",0,"9720",2,null,20180401,20180630,45088.539999999994,0]
[null,"CHIHUAHUA","08DPT0011J",120,"HENE680323MJ1","HENE680323MCHRRL03","ELIDA HERNANDEZ NORES","20214",480,83101,1003,"02",19,"A03202",0,"9701",2,null,20180401,20180630,47503.659999999996,0]
[null,"CHIHUAHUA","08DPT0011J",120,"LIGG8206272AA","LIGG820627HCLRRZ15","GIEZI LIRA GARCIA","20214",480,83101,1003,"02",19,"CF18203",0,"9710",2,null,20180401,20180630,44791.41,0]
[null,"CHIHUAHUA","08DPT0011J",120,"LOCJ4605101D2","LOCJ460510HCHPSS06","JESUS LOPEZ CASTRO","20206",480,83101,1003,"02",19,"A03202",0,"9776",2,null,20180401,20180630,47351.86,0]
[null,"CHIHUAHUA","08DPT0011J",120,"LOPO671113I30","LOPO671113HCHPRS00","OSCAR BENJAMIN LOPEZ PEREZ","20216",480,83101,1003,"02",19,"CF33206",0,"13188",2,null,20180401,20180630,114780.42,0]
[null,"CHIHUAHUA","08DPT0011J",120,"MACE880915VB1","MACE880915HCHRNR04","ERICK MARTELL CONTRERAS ",20205,480,83101,1003,"02",19,"CF33204",0,"9705",2,null,20180401,20180630,51286.680000000008,0]
[null,"CHIHUAHUA","08DPT0011J",120,"MAGI710826BY5","MAGI710826HCHRNV05","IVONNE ARACELI MARTINEZ GONZALEZ","20216",480,83101,1003,"02",19,"CF33204",0,"9699",2,null,20180401,20180630,76567.78,0]
[null,"CHIHUAHUA","08DPT0011J",120,"MAVE810424SY3","MAVE810424MCHRLL08","ELIA ZURASY MARTINEZ VELO","20206",480,83101,1003,"02",19,"S01201",0,"9738",2,null,20180401,20180630,29791.889999999996,0]
[null,"CHIHUAHUA","08DPT0011J",120,"MEGM480906839","MEGM480906HCHNNG00","MIGUEL ANGEL MENDOZA GONZALEZ","20206",480,83101,1003,"02",19,"S01201",0,"9728",2,null,20180401,20180630,36757.590000000004,0]
[null,"CHIHUAHUA","08DPT0011J",120,"MOCY820701FR6","MOCY820701MCHRHS01","YESSENIA IVONNE MORENO CHAVEZ","20202",480,83101,1003,"02",19,"CF33206",0,"13640",2,null,20180401,20180630,103078.61999999998,0]
[null,"CHIHUAHUA","08DPT0011J",120,"OIFL620226IA5","OIFL620226MCHLLD03","LIDIA GUADALUPE OLIVAS FLORES",20102,480,83101,1003,"02",19,"CF33206",0,"14303",2,null,20180401,20180630,65685.84,0]
[null,"CHIHUAHUA","08DPT0011J",120,"OESN6905137N5","OESN690513MCHRCR06","NORMA ORTEGA SCOTT","20104",480,83101,1003,"02",19,"CF33204",0,"9704",2,null,20180401,20180630,78633.52,0]
[null,"CHIHUAHUA","08DPT0011J",120,"OIAA580304QJA","OIAA580304HCHRRB04","ABRAHAM ORTIZ ARMENDARIZ","20206",480,83101,1003,"02",19,"S01202",0,"9722",2,null,20180401,20180630,40694.340000000004,0]
[null,"CHIHUAHUA","08DPT0011J",120,"PICM810405PX1","PICM810405MCHRRR02","MARIANA PRIETO CARRASCO ","20214",240,83101,1003,"02",19,"S01201",0,"9723",2,null,20180401,20180630,12045.43,0]
[null,"CHIHUAHUA","08DPT0011J",120,"RUAJ680828NZ1","RUAJ680828HCHZGN01","JUAN CARLOS RUIZ AGUIRRE","20214",480,83101,1003,"02",19,"S1201",0,"9709",2,null,20180401,20180630,28705.040000000001,0]
[null,"CHIHUAHUA","08DPT0011J",120,"SADC620717A78","SADC620717MCHLMR01","CARMEN ESTELA SALAS DOMINGUEZ",20214,480,83101,1003,"02",19,"CF33204",0,"9702",2,null,20180401,20180630,65610.52,0]
[null,"CHIHUAHUA","08DPT0011J",120,"SACG701206260","SACG701206MCHLND02","MARIA GUADALUPE SALAZAR CONTRERAS","20214",480,83101,1003,"02",19,"CF33204",0,"9730",2,null,20180401,20180630,85935.66,0]
[null,"CHIHUAHUA","08DPT0011J",120,"VAAG6312036W2","VAAG631203HTSLVR03","GERARDO VALDEZ AVILA",20105,480,83101,1003,"02",19,"CF02103",0,"13638",5,null,20180401,20180630,85992.48,0]
[null,"CHIHUAHUA","08DPT0011J",120,"VILA590828MZ1","VILA590828HCHLZG06","AGUSTIN VILLAGRAN LOZOYA","20214",480,83101,1003,"02",19,"S1202",0,"9737",2,null,20180401,20180630,36881.629999999997,0]
[null,"CHIHUAHUA","08DPT0011J",120,"VIDV791004RJ0","VIDV791004MCHLRR04","VIRGINIA VILLALBA DURAN","20206",480,83101,1003,"02",19,"CF04201",0,"9696",2,null,20180401,20180630,48413.299999999996,0]
[null,"CHIHUAHUA","08DPT0011J",120,"VIMS620916I47","VIMS620916MCHLRN00","SANDRA HORTENSIA VILLALOBOS MARIN","20214",480,83101,1003,"02",19,"CF33204",0,"2404",2,null,20180401,20180630,81657.100000000006,0]
[null,"CHIHUAHUA","08DPT0011J",120,"VIYD6702201Q6","VIYD670220MCHLXR09","DORA EMMA VILLALOBOS YAÑEZ","20214",480,83101,1003,"02",19,"A03202",0,"9695",2,null,20180401,20180630,45485.11,0]
[null,"CHIHUAHUA","08DPT0011J",120,"AOAJ720609R46","AOAJ720609MCHCLS06","MARÍA DE JESÚS ACOSTA ÁLVAREZ",30102,240,83101,1001,"02",19,"L5XCBI",20,0,3,null,20180401,20180630,21864,0]
[null,"CHIHUAHUA","08DPT0011J",120,"AORC6607129B3","AORC660712HCHCMS03","CÉSAR RENÉ ACOSTA ROMO",30102,168,83101,1001,"02",19,"L5XCCBII",14,0,3,null,20180401,20180630,17201.099999999999,0]
[null,"CHIHUAHUA","08DPT0011J",120,"AUVX671108950","AUVX671108MCHGLC09","XOCHITL MARGARITA AGUILAR VILLALOBOS",30102,240,83101,1001,"02",19,"L5XC",20,0,3,null,20180401,20180630,22687.200000000001,0]
[null,"CHIHUAHUA","08DPT0011J",120,"AADF760822JB4","AADF760822MCHLML07","FLOR ANEL ALMANZA DOMÍNGUEZ",30102,216,83101,1001,"02",19,"L5XCCBII",18,0,3,null,20180401,20180630,25523.1,0]
[null,"CHIHUAHUA","08DPT0011J",120,"AADF541004UL3","AADF541004HDGLMR07","FRANCISCO ALVARADO DOMÍNGUEZ",30102,240,83101,1001,"02",19,"L5XC",20,0,3,null,20180401,20180630,28359,0]
[null,"CHIHUAHUA","08DPT0011J",120,"AAGD820816HU2","AAGD820816MCHLTL09","DALYLA ALVARADO GUTIÉRREZ",30102,240,83101,1001,"02",19,"L5XC",20,0,3,null,20180401,20180630,28359,0]
[null,"CHIHUAHUA","08DPT0011J",120,"AASE930324BT6","AASE930324MCHLLD02","EDITH ALVAREZ SALASAR",30102,216,83101,1001,"02",19,"L5XCCBII",18,0,3,null,20180401,20180630,16074,0]
[null,"CHIHUAHUA","08DPT0011J",120,"AAOG691105623","AAOG691105HCHLCS09","GASTÓN ÁLVAREZ OCHOA",30102,216,83101,1001,"02",19,"L5XCBII",18,0,3,null,20180401,20180630,25523.1,0]
[null,"CHIHUAHUA","08DPT0011J",120,"AIRL900105A19","AIRL900105HCHLSS09","JOSÉ LUIS ALVÍDREZ RÍOS",30102,216,83101,1001,"02",19,"L5XCBI",18,0,3,null,20180401,20180630,24573,0]
[null,"CHIHUAHUA","08DPT0011J",120,"AALU670310HX2","AAXL670310HCHMXS16","LUIS CARLOS AMAYA X",30102,240,83101,1001,"02",19,"L5XC",20,0,3,null,20180401,20180630,26941.08,0]
[null,"CHIHUAHUA","08DPT0011J",120,"AAAM8805014VA","AAAM880501MCHNCL02","MILDRET ARLETTE ANDRADE ACOSTA",30102,216,83101,1001,"02",19,"L5XCBI ",18,0,3,null,20180401,20180630,21864,0]
[null,"CHIHUAHUA","08DPT0011J",120,"AIDJ6101296Q4","AIDJ610129HCHVLS09","JESÚS HUMBERTO ÁVILA DELGADO",30102,240,83101,1001,"02",19,"L5XC",20,0,3,null,20180401,20180630,24105.18,0]
[null,"CHIHUAHUA","08DPT0011J",120,"AIQC690227LQ0","AIQC690227HCHVNS05","CESAR ROGACIANO ÁVILA QUINTANA",30102,180,83101,1001,"02",19,"L5XCBI",15,0,3,null,20180401,20180630,14179.5,0]
[null,"CHIHUAHUA","08DPT0011J",120,"BABR540126HB4","BABR540126HCHZDL02","RAÚL GABRIEL BAEZA BEDOY",30102,240,83101,1001,"02",19,"L5XC",20,0,3,null,20180401,20180630,17015.400000000001,0]
[null,"CHIHUAHUA","08DPT0011J",120,"BAGA570401CF3","BAGA570401HCHRNN09","ANDRÉS BARBA GÁNDARA",30102,240,83101,1001,"02",19,"L5XC",20,0,3,null,20180401,20180630,28359,0]
[null,"CHIHUAHUA","08DPT0011J",120,"BASZ650208NL8","BASZ650208MMCRTH02","ZHENIA PATRICIA BARRAZA STOELTING",30102,180,83101,1001,"02",19,"L5XC",15,0,3,null,20180401,20180630,21269.279999999999,0]
[null,"CHIHUAHUA","08DPT0011J",120,"BEAG740617SI1","BEAG740617MSLJRB00","MARÍA GABIELA BEJARANO ARREDONDO",30102,240,83101,1001,"02",19,"L5XCBI",20,0,3,null,20180401,20180630,28359,0]
[null,"CHIHUAHUA","08DPT0011J",120,"BEML730902B28","BEML730902HCHLRS07","JOSÉ LUIS BELTRÁN MÁRQUEZ",30102,240,83101,1001,"02",19,"L5XC",20,0,3,null,20180401,20180630,21269.279999999999,0]
[null,"CHIHUAHUA","08DPT0011J",120,"BACJ820811R51","BACJ820811HCHLRN02","JUAN JOSÉ BLANCO CRUZ",30102,120,83101,1001,"02",19,"L5XCCBII",10,0,3,null,20180401,20180630,14179.5,0]
[null,"CHIHUAHUA","08DPT0011J",120,"BASH700602N82","BASH700602HCHLNR08","HERNÁN BLANCO SÁENZ",30102,216,83101,1001,"02",19,"L5XC",18,0,3,null,20180401,20180630,22687.200000000001,0]
[null,"CHIHUAHUA","08DPT0011J",120,"CAHJ821204323","CAHJ821204HCHBRL07","JOEL ANTONIO CABALLERO HERNÁNDEZ",30102,216,83101,1001,"02",19,"L5XC",18,0,3,null,20180401,20180630,25523.1,0]
[null,"CHIHUAHUA","08DPT0011J",120,"CADL780717DQ0","CADL780717HCHMLS06","LUIS MANUEL CAMACHO DELGADO",30102,240,83101,1001,"02",19,"L5XCCBII",20,0,3,null,20180401,20180630,24573,0]
[null,"CHIHUAHUA","08DPT0011J",120,"CAML770621S57","CAML770621HCHRRS02","LUIS CARMONA MORA",30102,120,83101,1001,"02",19,"L5XCCBII",10,0,3,null,20180401,20180630,14179.5,0]
[null,"CHIHUAHUA","08DPT0011J",120,"CAEI831214746","CAEI831214MCHRSV05","IVETH SELENE CARO ESCUDERO",30102,240,83101,1001,"02",19,"L5XCCBII",20,0,3,null,20180401,20180630,18429.78,0]
[null,"CHIHUAHUA","08DPT0011J",120,"CAGS5611036P5","CAGS561103MCHRLL06","SILVIA CARRASCO GALVÁN",30102,240,83101,1001,"02",19,"L5XC",20,0,3,null,20180401,20180630,25523.1,0]
[null,"CHIHUAHUA","08DPT0011J",120,"CAVJ780821N37","CAVJ780821HCHZLS05","JESÚS MANUEL CAZARES VILLARREAL",30102,240,83101,1001,"02",19,"L5XCCBII",20,0,3,null,20180401,20180630,24573,0]
[null,"CHIHUAHUA","08DPT0011J",120,"CEPJ5209176A4","CEPJ520917MCLDXS03","MARÍA DE JESÚS CEDILLO PEÑA",30102,180,83101,1001,"02",19,"L5XC",15,0,3,null,20180401,20180630,18433.38,0]
[null,"CHIHUAHUA","08DPT0011J",120,"CACL6504048EA","CACL650404HCHHHS06","JOSÉ LUIS CHAVARRÍA CHÁVEZ",30102,228,83101,1001,"02",19,"L5XC",19,0,3,null,20180401,20180630,26941.08,0]
[null,"CHIHUAHUA","08DPT0011J",120,"CALM790104KB2","CALM790104HCHHPN06","MANUEL ALBERTO CHAVIRA LÓPEZ",30102,240,83101,1001,"02",19,"L5XC",20,0,3,null,20180401,20180630,22687.200000000001,0]
[null,"CHIHUAHUA","08DPT0011J",120,"CORI861010967","CORI861010HCHNVS07","ISAÚL CONTRERAS RIVERA",30102,240,83101,1001,"02",19,"L5XCBI",20,0,3,null,20180401,20180630,24573,0]
[null,"CHIHUAHUA","08DPT0011J",120,"COVM710719995","COVM710719HCHRLR08","MARCO ANTONIO CORONADO VILLARREAL",30102,240,83101,1001,"02",19,"L5XC",20,0,3,null,20180401,20180630,26941.08,0]
[null,"CHIHUAHUA","08DPT0011J",120,"DIVM670828475","DIVM670828HCHZQN04","MANUEL DÍAZ VAQUERA",30102,180,83101,1001,"02",19,"L5XC",15,0,3,null,20180401,20180630,21269.279999999999,0]
[null,"CHIHUAHUA","08DPT0011J",120,"EICP660518T31","EICP660518MCHSRT02","PATRICIA EISSA CARRILLO",30102,180,83101,1001,"02",19,"L5XC",15,0,3,null,20180401,20180630,21269.279999999999,0]
[null,"CHIHUAHUA","08DPT0011J",120,"EIAL6904095Y1","EIAL690409MCHSLR06","LORENA MARGARITA ESPINOZA ALCALÁ",30102,240,83101,1001,"02",19,"L5XC",20,0,3,null,20180401,20180630,28359,0]
[null,"CHIHUAHUA","08DPT0011J",120,"FOSJ7411047Y2","FOSJ741104HCHLLV00","JAVIER ARTURO FLORES SALAS",30102,180,83101,1001,"02",19,"L5XC",15,0,3,null,20180401,20180630,25523.1,0]
[null,"CHIHUAHUA","08DPT0011J",120,"GAGJ7110079I6","GAGJ711007HCHBRL03","JULIÁN GABIRA DE LA GARZA",30102,228,83101,1001,"02",19,"L5XC",19,0,3,null,20180401,20180630,22687.200000000001,0]
[null,"CHIHUAHUA","08DPT0011J",120,"GALP8605195S6","GALP860519MCHRCR06","PERLA LILIANA GARCÍA LUCERO",30102,240,83101,1001,"02",19,"L5XCCBII",20,0,3,null,20180401,20180630,24573,0]
[null,"CHIHUAHUA","08DPT0011J",120,"GAMJ7901211A8","GAMJ790121HCHRDS09","JESÚS ANTONIO GARCÍA MEDINA",30102,108,83101,1001,"02",19,"L5XCCBII",9,0,3,null,20180401,20180630,11057.88,0]
[null,"CHIHUAHUA","08DPT0011J",120,"GOCC7107156X6","GOCC710715MCHNHR03","CARMEN GUADALUPE GONZÁLEZ CHACÓN",30102,216,83101,1001,"02",19,"L5XC",18,0,3,null,20180401,20180630,15597.48,0]
[null,"CHIHUAHUA","08DPT0011J",120,"GOGJ721103UI4","GOGJ721103HCHNRL03","JULIO CESAR GONZÁLEZ GRANADOS",30102,240,83101,1001,"02",19,"L5XCCBII",20,0,3,null,20180401,20180630,28359,0]
[null,"CHIHUAHUA","08DPT0011J",120,"GOPS631119234","GOPS631119HCHNZX06","SIXTO HUMBERTO GONZÁLEZ PÁEZ",30102,240,83101,1001,"02",19,"L5XC",20,0,3,null,20180401,20180630,28359,0]
[null,"CHIHUAHUA","08DPT0011J",120,"GUTM700125HI4","GUTM700125MCHRRR03","MARGARITA GUARDADO TORRES",30102,240,83101,1001,"02",19,"L5XC",20,0,3,null,20180401,20180630,28359,0]
[null,"CHIHUAHUA","08DPT0011J",120,"GUGL640702V28","GUGL640702HCHTRS02","LUIS ROGELIO GUTIÉRREZ GARCÍA",30102,240,83101,1001,"02",19,"L5XC",20,0,3,null,20180401,20180630,28359,0]
[null,"CHIHUAHUA","08DPT0011J",120,"HECM730118LI9","HECM730118HCHRDR06","MAURICIO HERNÁNDEZ CAUDILLO",30102,48,83101,1001,"02",19,"L5XCCBII",4,0,3,null,20180401,20180630,7089.78,0]
[null,"CHIHUAHUA","08DPT0011J",120,"HEOD870714897","HEOD870714MCLRLN06","DIANA HERNÁNDEZ OLIVARES",30102,240,83101,1001,"02",19,"L5XCCBII",20,0,3,null,20180401,20180630,22687.200000000001,0]
[null,"CHIHUAHUA","08DPT0011J",120,"HETC830217EB1","HETC830217MCHRRN07","CINTHIA LIZETH HERNÁNDEZ TREVIÑO",30102,240,83101,1001,"02",19,"L5XC",20,0,3,null,20180401,20180630,21269.279999999999,0]
[null,"CHIHUAHUA","08DPT0011J",120,"HEDM761211T33","HEDM761211MCHRZY08","MAYRA GUADALUPE HERRERA DÍAZ",30102,180,83101,1001,"02",19,"L5XC",15,0,3,null,20180401,20180630,25523.1,0]
[null,"CHIHUAHUA","08DPT0011J",120,"JASX660321NQ4","JASX660321HZSYTM15","XAMIR JAYDAR SOTO",30102,240,83101,1001,"02",19,"L5XCCBII",20,0,3,null,20180401,20180630,21269.279999999999,0]
[null,"CHIHUAHUA","08DPT0011J",120,"JILS7804098R3","JILS780409HCHMZR04","SERGIO ARMANDO JIMÉNEZ LOZANO",30102,240,83101,1001,"02",19,"L5XCCBII",20,0,3,null,20180401,20180630,24573,0]
[null,"CHIHUAHUA","08DPT0011J",120,"JISR460111595","JISR460111HBCMLY00","REYNALDO JIMÉNEZ SOLÍS",30102,192,83101,1001,"02",19,"L5XC",16,0,3,null,20180401,20180630,11343.6,0]
[null,"CHIHUAHUA","08DPT0011J",120,"LEGI810812S76","LEGI810812HCHYNR04","IRVING LEYVA GONZÁLEZ",30102,240,83101,1001,"02",19,"L5XC",20,0,3,null,20180401,20180630,28359,0]
[null,"CHIHUAHUA","08DPT0011J",120,"LOGE770513DS3","LOGE770513MCHPLL01","ELENA DEL ROSARIO LÓPEZ GALAVIZ",30102,240,83101,1001,"02",19,"L5XC",20,0,3,null,20180401,20180630,25523.1,0]
[null,"CHIHUAHUA","08DPT0011J",120,"LUCL830421CC7","LUCL830421HCHVNS03","LUIS FERNANDO LUÉVANO CONTRERAS",30102,240,83101,1001,"02",19,"L5XCBI",20,0,3,null,20180401,20180630,22115.7,0]
[null,"CHIHUAHUA","08DPT0011J",120,"LURI7603163W9","LURI760316MCHJDR01","IRMA EMILLIA LUJAN RODRÍGUEZ",30102,228,83101,1001,"02",19,"L5XCBI",19,0,3,null,20180401,20180630,20770.8,0]
[null,"CHIHUAHUA","08DPT0011J",120,"MEFJ6010186V1","MEFJ601018HCHNNS07","JESÚS ALBERTO MENCHACA FUENTES",30102,216,83101,1001,"02",19,"L5XCCBII",18,0,3,null,20180401,20180630,28359,0]
[null,"CHIHUAHUA","08DPT0011J",120,"MEEJ750705D34","MEEJ750705HCHNSS02","JESÚS MENDOZA ESTEVANÉ",30102,240,83101,1001,"02",19,"L5XC",20,0,3,null,20180401,20180630,25523.1,0]
[null,"CHIHUAHUA","08DPT0011J",120,"MOVI660317J46","MOXV660317HCHLXC08","VÍCTOR MANUEL MOLINAR X",30102,240,83101,1001,"02",19,"L5XCCBII",20,0,3,null,20180401,20180630,20887.080000000002,0]
[null,"CHIHUAHUA","08DPT0011J",120,"MORR640403339","MORR640403MCHNDS08","ROSARIO FLORENTINA MONTOYA RODRÍGUEZ",30102,240,83101,1001,"02",19,"L5XCCBII",20,0,3,null,20180401,20180630,28359,0]
[null,"CHIHUAHUA","08DPT0011J",120,"MOEC8307215B7","MOEC830721HCHRSR06","CARLOS DANIEL MORALES ESPINOZA",30102,240,83101,1001,"02",19,"L5XCCBII",20,0,3,null,20180401,20180630,28359,0]
[null,"CHIHUAHUA","08DPT0011J",120,"MOSV610329FQ2","MOSV610329HCHRTC06","VÍCTOR MORENO SOTO",30102,240,83101,1001,"02",19,"L5XC",20,0,3,null,20180401,20180630,28359,0]
[null,"CHIHUAHUA","08DPT0011J",120,"MOOL690713831","MOOL690713MCHRSR07","LAURA MAGDALENA MORONES OSUNA",30102,240,83101,1001,"02",19,"L5XC",20,0,3,null,20180401,20180630,28359,0]
[null,"CHIHUAHUA","08DPT0011J",120,"MORC720201UY4","MORC720201MCHRDL09","CLAUDIA MORONES RODRÍGUEZ",30102,240,83101,1001,"02",19,"L5XC",20,0,3,null,20180401,20180630,21269.279999999999,0]
[null,"CHIHUAHUA","08DPT0011J",120,"MUNL690829H48","MUNL690829MCHXTZ04","LUZ EMILIA MUÑOZ NATIVIDAD",30102,180,83101,1001,"02",19,"L5XC",15,0,3,null,20180401,20180630,17015.400000000001,0]
[null,"CHIHUAHUA","08DPT0011J",120,"NADJ630505N67","NADJ630505HCHVLN05","JUAN NAVA DELGADO",30102,240,83101,1001,"02",19,"L5XC",20,0,3,null,20180401,20180630,26941.08,0]
[null,"CHIHUAHUA","08DPT0011J",120,"NAML740428B29","NAML740428MCHVRR05","LORENA IVONNE NAVA MORALES",30102,240,83101,1001,"02",19,"L5XC",20,0,3,null,20180401,20180630,28359,0]
[null,"CHIHUAHUA","08DPT0011J",120,"NUGA831209HF9","NUGA831209HSLVZR04","ARTURO GUADALUPE NUEVO GUZMAN",30102,228,83101,1001,"02",19,"L5XCBI",19,0,3,null,20180401,20180630,16398,0]
[null,"CHIHUAHUA","08DPT0011J",120,"OOMJ6108305IA","OOMJ610830MCHCDN00","JUANA ROSA OCHOA MADRID",30102,240,83101,1001,"02",19,"L5XC",20,0,3,null,20180401,20180630,28359,0]
[null,"CHIHUAHUA","08DPT0011J",120,"OOGI7603109Y9","OOGI760310HDGRNS08","ISIDRO OROZCO GONZÁLEZ",30102,240,83101,1001,"02",19,"L5XC",20,0,3,null,20180401,20180630,28359,0]
[null,"CHIHUAHUA","08DPT0011J",120,"OORA820321MG3","OORA820321MCHRNY08","AYDE OROZCO RENOVA",30102,240,83101,1001,"02",19,"L5XCCBII",20,0,3,null,20180401,20180630,24105.18,0]
[null,"CHIHUAHUA","08DPT0011J",120,"PAMC840828GP8","PAMC840828MCHCRR08","CRISTINA PACHECO MÁRQUEZ",30102,192,83101,1001,"02",19,"L5XC",16,0,3,null,20180401,20180630,28359,0]
[null,"CHIHUAHUA","08DPT0011J",120,"PAPA610623V58","PAPA610623HCHLXN04","ANTONIO PALACIO PIÑA",30102,240,83101,1001,"02",19,"L5XC",20,0,3,null,20180401,20180630,26941.08,0]
[null,"CHIHUAHUA","08DPT0011J",120,"PEHJ6802298H5","PEHJ680229HCHRRN03","JUAN JOSÉ PÉREZ HERNÁNDEZ",30102,120,83101,1001,"02",19,"L5XC",10,0,3,null,20180401,20180630,22687.200000000001,0]
[null,"CHIHUAHUA","08DPT0011J",120,"PERM720917SD7","PERM720917MCHRMR06","MARGARITA PÉREZ RAMÍREZ",30102,120,83101,1001,"02",19,"L5XCCBII",10,0,3,null,20180401,20180630,12761.58,0]
[null,"CHIHUAHUA","08DPT0011J",120,"PADM510809SZ5","PADM510809HNTLZG08","MIGUEL ÁNGEL PLASCENCIA DÍAZ",30102,240,83101,1001,"02",19,"L5XC",20,0,3,null,20180401,20180630,25523.1,0]
[null,"CHIHUAHUA","08DPT0011J",120,"POSR7405169R0","POSR740516HCHRNB07","JOSÉ ROBERTO PORTILLO SÁENZ",30102,216,83101,1001,"02",19,"L5XC",18,0,3,null,20180401,20180630,21269.279999999999,0]
[null,"CHIHUAHUA","08DPT0011J",120,"QUCC800518RJ7","QUCC800518MCHZML03","CLAUDIA ROCÍO QUEZADA CAMPOYA",30102,180,83101,1001,"02",19,"L5XC",15,0,3,null,20180401,20180630,17015.400000000001,0]
[null,"CHIHUAHUA","08DPT0011J",120,"QUME830808SH6","QUME830808HCHXRR06","ERIC QUIÑONES MARIÑELARENA",30102,228,83101,1001,"02",19,"L5XC",19,0,3,null,20180401,20180630,21269.279999999999,0]
[null,"CHIHUAHUA","08DPT0011J",120,"RARR491119L95","RARR491119HPLMVB06","ROBERTO PONCIANO RAMÍREZ RIVERA",30102,228,83101,1001,"02",19,"L5XC",19,0,3,null,20180401,20180630,28359,0]
[null,"CHIHUAHUA","08DPT0011J",120,"RAHA780618377","RAHA780618HCHMRD01","ADARIK QUILEO RAMOS HERRERA",30102,216,83101,1001,"02",19,"L5XC",18,0,3,null,20180401,20180630,25523.1,0]
[null,"CHIHUAHUA","08DPT0011J",120,"RARL740713SN9","RARL740713MCHSYR08","LOURDES GABRIELA RASCÓN REYES",30102,240,83101,1001,"02",19,"L5XC",20,0,3,null,20180401,20180630,21269.279999999999,0]
[null,"CHIHUAHUA","08DPT0011J",120,"REGJ630501KR7","REGJ630501HDFNRN07","JUAN CARLOS RENDÓN GARCÍA",30102,216,83101,1001,"02",19,"L5XC",18,0,3,null,20180401,20180630,21269.279999999999,0]
[null,"CHIHUAHUA","08DPT0011J",120,"RILA820506DD4","RILA820506HCHVCN08","ÁNGEL ARMANDO RIVERA LECHUGA",30102,216,83101,1001,"02",19,"L5XCBI",18,0,3,null,20180401,20180630,19658.400000000001,0]
[null,"CHIHUAHUA","08DPT0011J",120,"ROVW790131VE9","ROVW790131HCHJLL05","WILFREDO ROJO VELÁZQUEZ",30102,240,83101,1001,"02",19,"L5XCCBII",20,0,3,null,20180401,20180630,28359,0]
[null,"CHIHUAHUA","08DPT0011J",120,"ROHE830406P40","ROHE830406MCHMRL03","ELSA SAMANTHA ROMERO HERRERA",30102,156,83101,1001,"02",19,"L5XCBI",13,0,3,null,20180401,20180630,22115.7,0]
[null,"CHIHUAHUA","08DPT0011J",120,"RUHJ7401277YA","RUHJ740127HCHZRR00","JORGE ARTURO RUIZ HEIRAS",30102,240,83101,1001,"02",19,"L5XC",20,0,3,null,20180401,20180630,25523.1,0]
[null,"CHIHUAHUA","08DPT0011J",120,"RUBJ910211L87","RUBJ910211HCHZCS01","RUIZ ESPARZA BACASEHUA JOSÉ",30102,204,83101,1001,"02",19,"L5XCBII",17,0,3,null,20180401,20180630,16074,0]
[null,"CHIHUAHUA","08DPT0011J",120,"RUCJ590315LP9","RUCJ590315HZSZMS00","JOSÉ RUIZ ESPARZA CAMARENA",30102,120,83101,1001,"02",19,"L5XCCBII",10,0,3,null,20180401,20180630,18429.78,0]
[null,"CHIHUAHUA","08DPT0011J",120,"SARC670203156","SARC670203MDGLZR00","MARIA DEL CARMEN SALAS RUIZ",30102,156,83101,1001,"02",19,"L5XC",13,0,3,null,20180401,20180630,17015.400000000001,0]
[null,"CHIHUAHUA","08DPT0011J",120,"SACD640228KY5","SACD640228HCHLNN03","DANIEL JAVIER SALAZAR CONTRERAS",30102,240,83101,1001,"02",19,"L5XC",20,0,3,null,20180401,20180630,21269.279999999999,0]
[null,"CHIHUAHUA","08DPT0011J",120,"SASL611115CC2","SASL611115HCHMPP00","LEOPOLDO SAMANIEGO SEPÚLVEDA",30102,240,83101,1001,"02",19,"L5XC",20,0,3,null,20180401,20180630,28359,0]
[null,"CHIHUAHUA","08DPT0011J",120,"SAPJ770502I20","SAPJ770502HCHNRV00","JAVIER SÁNCHEZ PÉREZ",30102,168,83101,1001,"02",19,"L5XC",14,0,3,null,20180401,20180630,11343.6,0]
[null,"CHIHUAHUA","08DPT0011J",120,"SEVK920127JG4","SEVK920127MCHGLR02","KAREN JEMIMA SEGOVIA VILLALOBOS",30102,240,83101,1001,"02",19,"L5XCBI",20,0,3,null,20180401,20180630,24573,0]
[null,"CHIHUAHUA","08DPT0011J",120,"TORR510819H11","TORR510819HDFLSL04","RAÚL ALBERTO TOLEDO ROSILLO",30102,240,83101,1001,"02",19,"L5XC",20,0,3,null,20180401,20180630,21269.279999999999,0]
[null,"CHIHUAHUA","08DPT0011J",120,"TOMG6805124B0","TOMG680512MCHRRB05","GABRIELA TORRES MORENO",30102,168,83101,1001,"02",19,"L5XC",14,0,3,null,20180401,20180630,11343.6,0]
[null,"CHIHUAHUA","08DPT0011J",120,"TOPD7211138C2","TOPD721113MCHRRL03","DELIA ARMIDA TORRES PORTILLO",30102,240,83101,1001,"02",19,"L5XC",20,0,3,null,20180401,20180630,17015.400000000001,0]
[null,"CHIHUAHUA","08DPT0011J",120,"TORJ640811CX6","TORJ640811HCHVVS02","JOSÉ TOVAR RIVERO",30102,228,83101,1001,"02",19,"L5XC",19,0,3,null,20180401,20180630,28359,0]
[null,"CHIHUAHUA","08DPT0011J",120,"UUIL8212152F2","UUIL821215HCHRBS02","LUIS ALBERTO URQUIDI IBARBOL",30102,240,83101,1001,"02",19,"L5XCCBII",20,0,3,null,20180401,20180630,26941.08,0]
[null,"CHIHUAHUA","08DPT0011J",120,"VAPD660401U61","VAPD660401HCHLRN00","DANIEL VALADEZ PORTILLO",30102,240,83101,1001,"02",19,"L5XCCBII",20,0,3,null,20180401,20180630,26941.08,0]
[null,"CHIHUAHUA","08DPT0011J",120,"VAGB5901245Z9","VAGB590124MCHLNL07","VALDERRABANO GONZÁLEZ BLANCA ESTELA ",30102,216,83101,1001,"02",19,"L5XC",18,0,3,null,20180401,20180630,25523.1,0]
[null,"CHIHUAHUA","08DPT0011J",120,"VAHJ690910EY0","VAHJ690910HCHLRM02","JAIME VALENZUELA HERNÁNDEZ",30102,240,83101,1001,"02",19,"L5XC",20,0,3,null,20180401,20180630,28359,0]
[null,"CHIHUAHUA","08DPT0011J",120,"VAGJ670203PVA","VAGJ670203HCLLVS03","JOSÉ VALLEJO GUEVARA",30102,228,83101,1001,"02",19,"L5XCCBII",19,0,3,null,20180401,20180630,26941.08,0]
[null,"CHIHUAHUA","08DPT0011J",120,"VEDL620727PL3","VEDL620727MCHGRR05","LORETO VEGA DURAN",30102,240,83101,1001,"02",19,"L5XC",20,0,3,null,20180401,20180630,28359,0]
[null,"CHIHUAHUA","08DPT0011J",120,"VEMA551027JGA","VEMA551027HCHGRR06","ARIEL VEGA MIRANDA",30102,204,83101,1001,"02",19,"L5XCCBII",17,0,3,null,20180401,20180630,14179.5,0]
[null,"CHIHUAHUA","08DPT0011J",120,"VIPT690222SN0","VIPT690222MCHLXR04","MARIA TERESA VILLARREAL PIÑÓN",30102,240,83101,1001,"02",19,"L5XC",20,0,3,null,20180401,20180630,25523.1,0]
[null,"CHIHUAHUA","08DPT0013H",200,"AOLA8503074R3","AOLA830507HCHLNL04","ALBERTO ISRAEL ALCOCER LONGORIA",30102,240,83101,1001,"03",23,"L5XC","20.0",0,3,null,20180401,20180630,34305,0]
[null,"CHIHUAHUA","08DPT0013H",120,"AOVP680821N74","AOVP680821MCHLLT07","PATRICIA GUADALUPE ALONSO VALENZUELA",30102,240,83101,1001,"03",23,"L5XCBI","20.0",0,3,null,20180401,20180630,19578,0]
[null,"CHIHUAHUA","08DPT0013H",120,"AAOC930925J35","AAOC930925MCHLLL07","CLAUDIA LIZETH ALVARADO OLIVAS",30102,240,83101,1001,"03",23,"L5XATEC","20.0",0,3,null,20180401,20180630,26382,0]
[null,"CHIHUAHUA","08DPT0013H",200,"AAOP870805580","AAOP870805HCHLLD04","PEDRO TOMAS ALVARADO OLIVAS",30102,204,83101,1001,"03",23,"L5XATEC","17.0",0,3,null,20180401,20180630,22424.7,0]
[null,"CHIHUAHUA","08DPT0013H",120,"AAGL910215RT7","AAGL910215HCHNTW07","LEONARDO SEBASTIAN ANDRADE GUTIERREZ",30102,240,83101,1001,"03",23,"L5XC","20.0",0,3,null,20180401,20180630,34305,0]
[null,"CHIHUAHUA","08DPT0013H",120,"AIBS821008VBA","AIBS821008HVZRRR09","SERGIO ARIAS BRAVO",30102,240,83101,1001,"03",23,"L5XC","20.0",0,3,null,20180401,20180630,34305,0]
[null,"CHIHUAHUA","08DPT0013H",120,"AACJ8907149C6","AACJ890714HCHTHS04","JESUS ADRIAN ATAYDE CHACON",30102,240,83101,1001,"03",23,"L5XATEC","20.0",0,3,null,20180401,20180630,26382,0]
[null,"CHIHUAHUA","08DPT0013H",120,"BAMG8304085L6","BAMG830408MCHRRR05","GEORGINA IVETH BARRAZA MARQUEZ",30102,240,83101,1001,"03",23,"L5XC","20.0",0,3,null,20180401,20180630,34305,0]
[null,"CHIHUAHUA","08DPT0013H",100,"BAMM890408B93","BAMM890408HCHSLR00","MARTIN YAHIR BASURTO MELENDEZ",30102,240,83101,1001,"03",23,"L5XC","20.0",0,3,null,20180401,20180630,34305,0]
[null,"CHIHUAHUA","08DPT0013H",120,"BEGN750326UYA","BEGN750326MCHLRN05","NANCY NOHEMI BELTRAN GARCIA",30102,68,83101,1001,"03",23,"L5XCBII","14.0",0,3,null,20180401,20180430,8448.15,0]
[null,"CHIHUAHUA","08DPT0013H",100,"BUMA741111CX0","BUMA741111MCHSNN11","ANGELICA BUSTILLOS MINJAREZ",30102,240,83101,1001,"03",23,"L5XC","20.0",0,3,null,20180401,20180630,34305,0]
[null,"CHIHUAHUA","08DPT0013H",200,"BURK950212RQ2","BURK950212MCHSNR03","KARLA ESTRELLA BUSTILLOS RENDON",30102,192,83101,1001,"03",23,"L5XATEC","16.0",0,3,null,20180401,20180630,21105.599999999999,0]
[null,"CHIHUAHUA","08DPT0013H",120,"CACR890101JE8","CACR890101HCHLRN05","RENE CALDERON CARNERO",30102,240,83101,1001,"03",23,"L5XC","20.0",0,3,null,20180401,20180630,34305,0]
[null,"CHIHUAHUA","08DPT0013H",100,"CAMM870530IJ9","CAMM870530HCHMRG02","MIGUEL ABRAHAM CAMPOYA MORALES",30102,228,83101,1001,"03",23,"L5XCBII","19.0",0,3,null,20180401,20180630,28326.179999999997,0]
[null,"CHIHUAHUA","08DPT0013H",100,"CAMY820713FS4","CAMY820713MCHRTR09","YURIDIA ITZEL CARDONA MATA",30102,240,83101,1001,"03",23,"L5XC","20.0",0,3,null,20180401,20180630,34305,0]
[null,"CHIHUAHUA","08DPT0013H",100,"CAVE870113T2A","CAVE870113HCHRLD06","EDUARDO CARDONA VILLAGRANA",30102,240,83101,1001,"03",23,"L5XC","20.0",0,3,null,20180401,20180630,34305,0]
[null,"CHIHUAHUA","08DPT0013H",120,"CECD871010N16","CECD871010HCHRSG08","DIEGO ADOLFO CERVANTES CASTILLO",30102,204,83101,1001,"03",23,"L5XATEC","17.0",0,3,null,20180401,20180630,22424.7,0]
[null,"CHIHUAHUA","08DPT0013H",100,"COTD9112155M3","COTD911215MCHRRN03","DENISSE ALEJANDRA CORELLA TRUJILLO",30102,240,83101,1001,"03",23,"L5XCBII","20.0",0,3,null,20180401,20180630,29817,0]
[null,"CHIHUAHUA","08DPT0013H",100,"CUAL871105HE1","CUAL871105HCHRLS08","LUIS ALEJANDRO CRUZ ALVARADO",30102,240,83101,1001,"03",23,"L5XCBII","20.0",0,3,null,20180401,20180630,29817,0]
[null,"CHIHUAHUA","08DPT0013H",120,"ROCJ811214HD5","ROCJ811214HCLSMV04","JAVIER ROLANDO DE LA ROSA CAMPOS",30102,240,83101,1001,"03",23,"L5XC","20.0",0,3,null,20180401,20180630,34305,0]
[null,"CHIHUAHUA","08DPT0013H",200,"LEVD880414UB2","LEVD880414MCLNLN07","DIANA GABRIELA DE LEON VELAZQUEZ",30102,144,83101,1001,"03",23,"L5XC","12.0",0,3,null,20180401,20180630,20583,0]
[null,"CHIHUAHUA","08DPT0013H",120,"DODK891025237","DODK891025MCHMMR03","KARLA KARINA DOMINGUEZ DOMINGUEZ",30102,240,83101,1001,"03",23,"L5XC","20.0",0,3,null,20180401,20180630,34305,0]
[null,"CHIHUAHUA","08DPT0013H",100,"EECA8503081Q2","EECA850308HSLCRB06","ABRAHAM JACOBO ECHEVARRIA CORRALES",30102,240,83101,1001,"03",23,"L5XCBII","20.0",0,3,null,20180401,20180630,29817,0]
[null,"CHIHUAHUA","08DPT0013H",200,"EILC8907199K2","EILC890719HDGSPS00","CESAR ESPINO LOPEZ",30102,138,83101,1001,"03",23,"L5XATEC","10.0",0,3,null,20180401,20180630,15169.65,0]
[null,"CHIHUAHUA","08DPT0013H",120,"EISC871230RT1","EISC871230MCHSNR08","CAROLINA ESPINOZA DE SANTIAGO",30102,240,83101,1001,"03",23,"L5XATEC","20.0",0,3,null,20180401,20180630,26382,0]
[null,"CHIHUAHUA","08DPT0013H",200,"FOLM7810127Q9","FOLM781012HCHLYG02","MIGUEL ANGEL FLORES LEYVA",30102,180,83101,1001,"03",23,"L5XCBII","15.0",0,3,null,20180401,20180630,22362.780000000002,0]
[null,"CHIHUAHUA","08DPT0013H",120,"GAOR680723LM5","GAOR680723HCHLRC05","RICARDO RAUL GALARZA ORTEGA",30102,240,83101,1001,"03",23,"L5XATEC","20.0",0,3,null,20180401,20180630,26382,0]
[null,"CHIHUAHUA","08DPT0013H",120,"GAFM850702EM7","GAFM850702HCHRLR00","MARIO ALBERTO GARCIA FLORES",30102,216,83101,1001,"03",23,"L5XCBI","18.0",0,3,null,20180401,20180630,17620.2,0]
[null,"CHIHUAHUA","08DPT0013H",200,"GONJ870317J36","GONJ870317MVZMCN02","JENNY PATRICIA GOMEZ NICIDA",30102,240,83101,1001,"03",23,"L5XATEC","20.0",0,3,null,20180401,20180630,26382,0]
[null,"CHIHUAHUA","08DPT0013H",120,"GOHD860913N63","GOHD860913MCLNRL08","DALIA LIBERTAD GONZALEZ HERNANDEZ",30102,240,83101,1001,"03",23,"L5XCBI","20.0",0,3,null,20180401,20180630,19578,0]
[null,"CHIHUAHUA","08DPT0013H",200,"GOMA820909QV4","GOMA820909MCHNRD09","ADRIANA GONZALEZ MARQUEZ",30102,240,83101,1001,"03",23,"L5XC","20.0",0,3,null,20180401,20180630,34305,0]
[null,"CHIHUAHUA","08DPT0013H",100,"GORR890405IP7","GORR890405HCHNMY01","RAYMUNDO RAMIREZ GONZALEZ",30102,240,83101,1001,"03",23,"L5XCBII","20.0",0,3,null,20180401,20180630,29817,0]
[null,"CHIHUAHUA","08DPT0013H",200,"GUCD860131S71","GUCD860131HCHRLV06","JOSE DAVID GUERRERO CALLEROS",30102,192,83101,1001,"03",23,"L5XCBII","16.0",0,3,null,20180401,20180630,23853.599999999999,0]
[null,"CHIHUAHUA","08DPT0013H",100,"GUMG891202IP6","GUMG891202MCHTRR04","GRECIA REYNA GUTIERREZ MARRUFO",30102,228,83101,1001,"03",23,"L5XCBII","19.0",0,3,null,20180401,20180630,28326.179999999997,0]
[null,"CHIHUAHUA","08DPT0013H",200,"HEAN911008UH6","HEAN911008MCHRLN03","NANCY ELIZABETH HEREDIA ALVARADO",30102,228,83101,1001,"03",23,"L5XATEC","19.0",0,3,null,20180401,20180630,25062.9,0]
[null,"CHIHUAHUA","08DPT0013H",100,"HEAL6501012W6","HEAL650101HCHRRR04","LORENZO HERNANDEZ ARMENTA",30102,240,83101,1001,"03",23,"L5XC","20.0",0,3,null,20180401,20180630,34305,0]
[null,"CHIHUAHUA","08DPT0013H",100,"HEPM870418QNA","HEPM870418MDFRRR08","MARY CARMEN HERNANDEZ PERALES",30102,240,83101,1001,"03",23,"L5XC","20.0",0,3,null,20180401,20180630,34305,0]
[null,"CHIHUAHUA","08DPT0013H",120,"IAVJ901113B56","IAVJ901113HVZXRL02","JULIO CESAR IXBA VARGAS",30102,240,83101,1001,"03",23,"L5XC","20.0",0,3,null,20180401,20180630,34305,0]
[null,"CHIHUAHUA","08DPT0013H",120,"JUAS860801FD3","JUAS860801MCHRLL00","SILVIA ANGELICA JUAREZ ALVARADO",30102,240,83101,1001,"03",23,"L5XC","20.0",0,3,null,20180401,20180630,34305,0]
[null,"CHIHUAHUA","08DPT0013H",200,"LERK931113PQ5","LERK931113MCHCNR03","KARLA PAOLA LECHUGA RONQUILLO",30102,108,83101,1001,"03",23,"L5XCBII","9.0",0,3,null,20180401,20180630,13417.680000000002,0]
[null,"CHIHUAHUA","08DPT0013H",200,"LINM5608318QA","LINM560731HDFVTG06","MIGUEL ARTURO LIEVANO NORMAN",30102,150,83101,1001,"03",23,"L5XATEC","15.0",0,3,null,20180416,20180630,16488.75,0]
[null,"CHIHUAHUA","08DPT0013H",200,"LOMR7805084Z7","LOMR780508HCHRNL09","RAUL ERNESTO LOERA MONARREZ",30102,240,83101,1001,"03",23,"L5XC","20.0",0,3,null,20180401,20180630,34305,0]
[null,"CHIHUAHUA","08DPT0013H",120,"LOAA850515Q46","LOAA850515HCHPRL03","ALEJANDRO LOPEZ ARMENDARIZ",30102,240,83101,1001,"03",23,"L5XCBII","20.0",0,3,null,20180401,20180630,29817,0]
[null,"CHIHUAHUA","08DPT0013H",120,"LOCS771008517","LOCS771008HCHPRR09","SERGIO LOPEZ DE LA CRUZ",30102,240,83101,1001,"03",23,"L5XC","20.0",0,3,null,20180401,20180630,34305,0]
[null,"CHIHUAHUA","08DPT0013H",200,"MAGT901211DE9","MAGT901211MCHLNH09","THANIA GUADALUPE MALDONADO GONZALEZ",30102,240,83101,1001,"03",23,"L5XC","20.0",0,3,null,20180401,20180630,34305,0]
[null,"CHIHUAHUA","08DPT0013H",100,"MAGC661008FYA","MAGC661008HCHRNN09","CANDELARIO MARTINEZ GONZALEZ",30102,240,83101,1001,"03",23,"L5XC","20.0",0,3,null,20180401,20180630,25728.75,0]
[null,"CHIHUAHUA","08DPT0013H",120,"MEMO900505E38","MEMO900505HCHDJM04","OMAR ALONSO MEDINA MUJICA",30102,240,83101,1001,"03",23,"L5XATEC","20.0",0,3,null,20180401,20180630,26382,0]
[null,"CHIHUAHUA","08DPT0013H",200,"METJ941115RJ7","METJ941115MCHDNN07","JENIFFER MEDINA TUNCHEZ",30102,112,83101,1001,"03",23,"L5XATEC","14.0",0,3,null,20180516,20180630,12311.6,0]
[null,"CHIHUAHUA","08DPT0013H",200,"MUSF8807088K7","MUSF880708HCHRLR03","FRANCISCO JAVIER MURILLO SALAZAR",30102,240,83101,1001,"03",23,"L5XATEC","20.0",0,3,null,20180401,20180630,26382,0]
[null,"CHIHUAHUA","08DPT0013H",200,"NUEG910323HJ7","NUEG910323HCHXSL05","GUILLERMO ALEJANDRO NUÑEZ ESTRADA",30102,80,83101,1001,"03",23,"L5XC","10.0",0,3,null,20180401,20180531,11435,0]
[null,"CHIHUAHUA","08DPT0013H",200,"OESG9309215R5","OESG930921HCHJLB01","GABRIEL ARMANDO OJEDA SALAS",30102,240,83101,1001,"03",23,"L5XATEC","20.0",0,3,null,20180401,20180630,26382,0]
[null,"CHIHUAHUA","08DPT0013H",200,"OISE771121RD9","OISE771121HCHLNL07","ELIAS HERIBERTO OLIVAS SAENZ",30102,240,83101,1001,"03",23,"L5XCBII","20.0",0,3,null,20180401,20180630,29817,0]
[null,"CHIHUAHUA","08DPT0013H",100,"POGD861005KA6","POGD861005MCHRMN00","DANIELA PORRAS GOMEZ",30102,240,83101,1001,"03",23,"L5XC","20.0",0,3,null,20180401,20180630,34305,0]
[null,"CHIHUAHUA","08DPT0013H",100,"PUZM810413GK5","PUZM810413HDGNPN02","MANUEL ANTONIO PUENTE ZAPATA",30102,240,83101,1001,"03",23,"L5XC","20.0",0,3,null,20180401,20180630,34305,0]
[null,"CHIHUAHUA","08DPT0013H",120,"PUYR780420I72","PUYR780420MMCLXC00","ROCIO PULIDO YAÑEZ",30102,240,83101,1001,"03",23,"L5XC","20.0",0,3,null,20180401,20180630,34305,0]
[null,"CHIHUAHUA","08DPT0013H",120,"QUPK7804119NA","QUPK780411MSRVRR11","KARLA LIZETTE  QUEVEDO PRECIADO",30102,240,83101,1001,"03",23,"L5XC","20.0",0,3,null,20180401,20180630,34305,0]
[null,"CHIHUAHUA","08DPT0013H",120,"RACL961009QBA","RACL961009HCHMSS07","LUIS ARMANDO RAMIREZ CASTRO",30102,168,83101,1001,"03",23,"L5XCBI","14.0",0,3,null,20180401,20180630,13704.6,0]
[null,"CHIHUAHUA","08DPT0013H",120,"RESJ851201GQ9","RESJ851201HCHVPV07","JAVIER EDUARDO  REVELES SAPIEN",30102,240,83101,1001,"03",23,"L5XC","20.0",0,3,null,20180401,20180630,34305,0]
[null,"CHIHUAHUA","08DPT0013H",200,"ROGM9209304F8","ROGM920930HMCDLG05","MIGUEL ANGEL RODRIGUEZ GALVAN",30102,240,83101,1001,"03",23,"L5XATEC","20.0",0,3,null,20180401,20180630,26382,0]
[null,"CHIHUAHUA","08DPT0013H",200,"RORE881219EW3","RORE881219HVZJYR07","ERNESTO IVAN ROJAS REYES",30102,240,83101,1001,"03",23,"L5XATEC","20.0",0,3,null,20180401,20180630,26382,0]
[null,"CHIHUAHUA","08DPT0013H",200,"SASG860316EQ4","SASG860316HCHNNN09","GENARO ALONSO SAENZ SAENZ",30102,228,83101,1001,"03",23,"L5XCBI","19.0",0,3,null,20180401,20180630,18599.099999999999,0]
[null,"CHIHUAHUA","08DPT0013H",200,"SACR870225HZ8","SACR870225HCHLLB02","ROBERTO ISMAEL SALAZAR CALDERA",30102,240,83101,1001,"03",23,"L5XC","20.0",0,3,null,20180401,20180630,34305,0]
[null,"CHIHUAHUA","08DPT0013H",200,"SACE740906S3A","SACE740906HCLLMN05","ENRIQUE  SALAZAR CAMPOS",30102,240,83101,1001,"03",23,"L5XC","20.0",0,3,null,20180401,20180630,34305,0]
[null,"CHIHUAHUA","08DPT0013H",120,"SARC911030SC8","SARC911030HCHLMR00","CARLOS SALGADO ROMO",30102,240,83101,1001,"03",23,"L5XCBII","20.0",0,3,null,20180401,20180630,29817,0]
[null,"CHIHUAHUA","08DPT0013H",100,"SESU611116K12","SESU611116HDFGRL05","ULISES SEGURA SIERRA",30102,240,83101,1001,"03",23,"L5XCBI","20.0",0,3,null,20180401,20180630,19578,0]
[null,"CHIHUAHUA","08DPT0013H",120,"SIER8905149W5","SIER890514MCHGSS03","ROSA SELENE SIGALA ESQUIVEL",30102,240,83101,1001,"03",23,"L5XC","20.0",0,3,null,20180401,20180630,34305,0]
[null,"CHIHUAHUA","08DPT0013H",100,"SORR740817E88","SORR740817HCHSDC09","RICARDO SOSA RODRIGUEZ",30102,240,83101,1001,"03",23,"L5XC","20.0",0,3,null,20180401,20180630,34305,0]
[null,"CHIHUAHUA","08DPT0013H",100,"TECI630106UW7","TECI630106MDFLBS09","MARIA ISABEL TELLEZ GIRON COBOS",30102,240,83101,1001,"03",23,"L5XCBII","20.0",0,3,null,20180401,20180630,29817,0]
[null,"CHIHUAHUA","08DPT0013H",120,"TOEJ9207179L1","TOEJ920717HCHRSS09","JESUS TORRES ESTRADA",30102,228,83101,1001,"03",23,"L5XATEC","19.0",0,3,null,20180401,20180630,25062.9,0]
[null,"CHIHUAHUA","08DPT0013H",120,"TORR840104UJ5","TORR840104MCHRMQ05","RAQUEL IVETTE TORRES RAMIREZ",30102,240,83101,1001,"03",23,"L5XCBII","20.0",0,3,null,20180401,20180630,29817,0]
[null,"CHIHUAHUA","08DPT0013H",100,"UUMM850610TB5","UUMM850610HCHNNN02","MANUEL EDUARDO UNZUETA MONTES",30102,240,83101,1001,"03",23,"L5XCBII","20.0",0,3,null,20180401,20180630,29817,0]
[null,"CHIHUAHUA","08DPT0013H",100,"VATB930812JK4","VATB930812MCHLRR05","BRENDA SUJEY VALADEZ TRUJILLO",30102,216,83101,1001,"03",23,"L5XCBII","18.0",0,3,null,20180401,20180630,26835.3,0]
[null,"CHIHUAHUA","08DPT0013H",100,"VEPS7608116K0","VEPS760811MCHLBS04","SUSANA ADRIANA VELAZQUEZ POBLANO",30102,240,83101,1001,"03",23,"L5XC","20.0",0,3,null,20180401,20180630,34305,0]
[null,"CHIHUAHUA","08DPT0013H",100,"VIPL700512EU4","VIPL700512HCHDRS00","JOSE LUIS VIDAÑA PEREZ",30102,228,83101,1001,"03",23,"L5XC","19.0",0,3,null,20180401,20180630,32589.780000000002,0]
[null,"CHIHUAHUA","00XXX0000X",124,"LIAL810304JK3","LIAL810304MCHCRL00","LILIANA LICON ARAGONEZ","50301",480,83101,1003,"07",4,"CF11102",0,10994,5,null,20180401,20180630,100611.2,0]
[null,"CHIHUAHUA","00XXX0000X",124,"CATC7205274V8","CATC720527HCHNRR09","CARLOS CANO TORRES","20303",480,83101,1003,"07",4,"CF33204",0,10990,2,null,20180401,20180630,88055.44,0]
[null,"CHIHUAHUA","00XXX0000X",124,"EATH590728P67","EATH590728HCHSRG00","HUGO ESNAYRA TRISTAN","50705",480,83101,1003,"07",4,"CF01601",0,10992,5,null,20180401,20180630,54383.88,0]
[null,"CHIHUAHUA","00XXX0000X",124,"GOMD671113QD6","GOMD671113HCHMRG03","DIEGO RAUL GOMEZ MARTINEZ","20303",480,83101,1003,"07",4,"CF33204",0,11820,2,null,20180401,20180630,88055.44,0]
[null,"CHIHUAHUA","00XXX0000X",124,"MONL710121CT7","MONL710121MSLGVR08","LORENA INES MOGUEL NOVELO","50703",480,83101,1003,"07",4,"CF01601",0,10993,5,null,20180401,20180630,66459.899999999994,0]
[null,"CHIHUAHUA","00XXX0000X",124,"MOHB751008LK5","MOHB751008MMNNRL03","BLANCA ESTELA MONTAÑEZ HERNANDEZ","20201",480,83101,1003,"07",4,"CF33204",0,10999,2,null,20180401,20180630,72348.23,0]
[null,"CHIHUAHUA","00XXX0000X",124,"PALU750621U84","PAXL750621HCHLXS05","LUIS ENRIQUE PALACIOS","20303",480,83101,1003,"07",4,"CF33204",0,10995,2,null,20180401,20180630,80536.600000000006,0]
[null,"CHIHUAHUA","00XXX0000X",124,"QUEG630216GA8","QUEG630216MCHXSR02","GRACIELA QUIÑONEZ ESTRADA",50201,480,83101,1003,"07",4,"CF01601",0,11822,5,null,20180401,20180630,66459.899999999994,0]
[null,"CHIHUAHUA","00XXX0000X",124,"SAWV80120227A","SAWV801202MCLNLV05","VIVIANA SANCHEZ WILLIAMS","50704",480,83101,1003,"07",4,"CF01601",0,11000,5,null,20180401,20180630,66459.899999999994,0]
[null,"CHIHUAHUA","00XXX0000X",124,"VARM7910137D6","VARM791013MCHLMR03","MARISOL VALLES RAMOS","20206",480,83101,1003,"07",4,"CF33204",0,11819,2,null,20180401,20180630,77147.509999999995,0]
[null,"CHIHUAHUA","00XXX0000X",124,"AOCF590913PU5","AOCF590913HCHCNL08","FLAVIO FILOMENO ACOSTA CANO DE LOS RIOS","50201",480,83101,1003,"05","12","CF11100",0,10166,5,null,20180401,20180630,236416.25999999998,0]
[null,"CHIHUAHUA","00XXX0000X",124,"AAGE900717365","AAGE900717MCHZZL09","ELIZABETH AZAETA GUZMAN","20215",480,83101,1003,"05","12","CF34201",0,9729,2,null,20180401,20180630,33032.43,0]
[null,"CHIHUAHUA","00XXX0000X",124,"CAMH8103197WA","CAMH810319HCHRRG06","HUGO ALBERTO CARMONA MORA","50608",480,83101,1003,"05","12","CF02100",0,12457,5,null,20180401,20180630,75764.28,0]
[null,"CHIHUAHUA","00XXX0000X",124,"DEMS680803PI5","DEMS680803MCHLXN06","SANDRA DELGADO MUÑOZ","20109",480,83101,1003,"05","12","CF33206",0,13183,2,null,20180401,20180630,76849.7,0]
[null,"CHIHUAHUA","00XXX0000X",124,"DUCD810810J24","DUCD810810MCHRRN06","DANISSA DURAN CARO","20201",480,83101,1003,"05","12","CF33204",0,13186,2,null,20180401,20180630,85778.209999999992,0]
[null,"CHIHUAHUA","00XXX0000X",124,"GACS670112I53","GACS670112MCHRHN02","SANDRA MARGARITA GARCIA CHAVEZ","20109",480,83101,1003,"05","12","CF33206",0,14136,2,null,20180401,20180630,106396.63999999998,0]
[null,"CHIHUAHUA","00XXX0000X",124,"GARG760607HY8","GARG760607HCHSMS07","GUSTAVO ALONSO GASCA RAMIREZ ",50201,480,83101,1003,"05","12","CF02100",0,10166,5,null,20180401,20180630,75764.28,0]
[null,"CHIHUAHUA","00XXX0000X",124,"LAAC860420JE7","LAAC860420MCHBPL04","CLAUDIA PATRICIA LABRADO APARICIO","20201",480,83101,1003,"05","12","CF34205",0,10163,2,null,20180401,20180630,63302,0]
[null,"CHIHUAHUA","00XXX0000X",124,"MOSF7009259L5","MOSF700925HCHRTR02","FERNANDO ALBERTO MORA SOTO","20109",480,83101,1003,"05","12","CF33206",0,10160,2,null,20180401,20180630,113837.00000000001,0]
[null,"CHIHUAHUA","00XXX0000X",124,"PAMA800623I22","PAMA800623MDGDRL02","PADILLA MARQUEZ ALICIA","20101",480,83101,1003,"05","12","CF33204",0,2413,2,null,20180401,20180630,64428.789999999994,0]
[null,"CHIHUAHUA","00XXX0000X",124,"PEGC781114HZ3","PEGC781114HCHRRS06","CESAR VALENTE PEREA GARCIA ","20202",480,83101,1003,"05","12","S01202",0,9718,2,null,20180401,20180615,20192.57,0]
[null,"CHIHUAHUA","00XXX0000X",124,"RAMJ770419E96","RAMJ770419HSPMRS01","JESUS ALFONSO RAMIREZ MARRUFO","20201",480,83101,1003,"05","12","CF33204",0,8024,2,null,20180401,20180630,73677.08,0]
[null,"CHIHUAHUA","00XXX0000X",124,"RAPE620309J41","RAPE620309HCHYRN08","ENRIQUE RAY PORTILLO",20201,480,83101,1003,"05","12","CF02100",0,10164,2,null,20180401,20180630,74102,0]
[null,"CHIHUAHUA","00XXX0000X",124,"ROMF8411116Z4","ROMF841111MCHJXR01","FARINA ROJAS MUÑOZ","20201",480,83101,1003,"05","12","ED01201",0,11615,2,null,20180401,20180630,36453.07,0]
[null,"CHIHUAHUA","00XXX0000X",124,"SACP740829IP4","SACP740829MCHLNL05","PILAR ALICIA SALAZAR CONTRERAS",20214,480,83101,1003,"05","12","T08201",0,11845,2,null,20180401,20180630,47806.39,0]
[null,"CHIHUAHUA","00XXX0000X",124,"SIRS640927FF8","SIRS640927MCHLDL09","SILVIA SILVA RODRIGUEZ ","20104",480,83101,1003,"05","12","CF33206",0,14135,2,null,20180401,20180630,122635.43000000001,0]
[null,"CHIHUAHUA","00XXX0000X",124,"VARS761230AZ5","VARS761230MCHLML03","VALENZUELA RAMIREZ SILVIA CAROLINA",20215,480,83101,1003,"05","12","ED01201",0,11615,2,null,20180401,20180630,44459.020000000004,0]
[null,"CHIHUAHUA","00XXX0000X",124,"VAGP6007013D4","VAGP600701MCHLNT09","PATRICIA RAQUEL VALVERDE GONZALEZ","20105",480,83101,1003,"05","12","CF33206",0,10165,2,null,20180401,20180630,107402.38000000002,0]
[null,"Total Personas : ",null,827,null,null,null,null,null,null,null,null,null,"Total Plazas : ",null,243,null,null,"Total Pto. Federal",null,{"$f":"SUBTOTAL(109,Tabla12[Columna20])","v":28928029.880000014}]
[]
[null,null,null,null,null,null,null,null,null,null,null,null,null,null,null,null,null,null,"Total Ppto. Otras Fuentes:",null,null,{"$f":"SUM(V16:V844)","v":0}]
[]
[null,"*Total de Percepciones reportadas por la Entidad Federativa como pagadas al trabajador durante la comisión."]
[null,"Fuente : Información proporcionada por las Entidades Federativas"]

{"sheet":"II D) 2","index":7,"n_rows":53,"n_cols":19,"rows_kept":53,"cut":false,"hidden":false,"merged":[[11,16,12,16],[11,15,12,15],[11,17,12,17],[11,18,12,18],[11,6,11,12],[11,13,12,13],[11,14,12,14],[8,1,8,9],[11,0,12,0],[11,1,12,1],[11,5,12,5],[11,2,12,2],[11,3,12,3],[11,4,12,4]]}
[]
[]
[]
[]
[]
[]
[]
[null,"Formato: Movimientos de Plazas"]
[null,{"$f":"IF('1'!D22=\"Elige el Periodo…\",\"\",'1'!D22)","v":"Fondo de Aportaciones para la Educación Tecnológica y de Adultos/Colegio Nacional de Educación Profesional Técnica (FAETA/CONALEP)"},null,null,null,null,null,null,null,null,null,null,null,null,null,null,null,"2do. Trimestre 2018"]
[]
[]
[null,"Entidad Federativa","RFC","CURP","Nombre","Origen Presupuestal\n de la plazas","Clave Presupuestal",null,null,null,null,null,null,"Clave de nivel de puesto","Clave de nivel de sueldo","Zona Económica","Tipo de movimiento","Quincena Inicial","Quincena Final"]
[null,null,null,null,null,null,"Partida Presupuestal","Código de Pago","Clave de Unidad","Clave de Sub Unidad","Clave de Categoría","Horas Semana Mes ","Número de Plaza"]
[]
[null,"Entidad Federativa","RFC","CURP","Nombbre","Origen Presupuestal\n de la plazas","Partida Presupuestal","Código de Pago","Clave de Unidad","Clave de Sub Unidad","Clave de Categoría","Horas semana mes","Número de plaza","Clave de nivel de puesto","Clave de nivel de sueldo","Zona Económica","Tipo de movimiento","Quincena Inicial","Quincena Final"]
[null,"CHIHUAHUA","OIFL620226IA5","OIFL620226MCHLLD03  ","LIDIA GUADALUPE OLIVAS FLORES",1,83101,1003,"02","19","CF33206","00.0",13638,27,"N15","C",1,201807,999999]
[null,"CHIHUAHUA","AESG7103187K4","AESG710318MCLNGL04  ","GLORIA MARIA DE LOS ANGELES SEGURA",1,83101,1003,"02","19","CF33206","00.0",14303,27,"N15","C",1,201807,999999]
[null,"CHIHUAHUA","OOSJ921202I59","OOSJ921202HCHCTR06  ","JORGE ROBERTO OCHOA SOTELO",1,83101,1003,"00","25","A03202","00.0",10169,27,"N05","C",1,201808,999999]
[null,"CHIHUAHUA","AIBC800120C20","AIBC800120HCHVLS02  ","CESAR NOE AVILA BOLIVAR",1,83101,1003,"00","26","S01201","00.0",2440,27,"N02","A",1,201808,999999]
[null,"CHIHUAHUA","AUVJ9103083J2","AUVJ910308HCHGLN07  ","JUAN DE DIOS AGUIRRE VILLARREAL",1,83101,1003,"01","56","S01201","00.0",7492,27,"N02","C",1,201808,999999]
[null,"CHIHUAHUA","GOML880120US2","GOML880120MCHMNZ01  ","LUZ IVONNE GOMEZ MENDOZA",1,83101,1003,"02",19,"S01201","00.0",9723,27,"N02","C",1,201808,999999]
[null,"CHIHUAHUA","CURL721031RX6","CURL721031HCHVVS02  ","JOSE LUIS CUEVAS RIVERA",1,83101,1003,"00",26,"CF18201","00.0",2422,27,"N02","A",1,201809,999999]
[null,"CHIHUAHUA","AIAA780609P70","AIAA780609HCHVGG01  ","AGUSTIN AVITIA AGUILAR",1,83101,1003,"02",19,"CF02105","00.0",14576,27,"OB2","C",1,201810,999999]
[null,"CHIHUAHUA","QUHM750313QX2","QUHM750313HZSNZN02  ","MANUEL QUINTERO HUIZAR",1,83101,1003,"00",25,"CF18201","00.0",11868,27,"N02","C",1,201812,999999]
[null,"CHIHUAHUA","MOAM570729HK3","MOAM570729HCHNRN02  ","MANUEL MONTES ARZOLA",1,83101,1003,"01",56,"S01201","00.0",7492,27,"N02","C",2,199007,201807]
[null,"CHIHUAHUA","CAEA740422SF8","CAEA740422MCHBSL02  ","ALMA SOFIA CABALLERO ESPARZA",1,83101,1003,"02","07","CF33206","00.0",13431,27,"N15","A",2,201204,201807]
[null,"CHIHUAHUA","VASF7408232D8","VASF740823HCHLLR05  ","FRANCISCO JAVIER VALVERDE SALAZAR",1,83101,1003,"00",26,"CF18201","00.0",2422,27,"N02","A",2,201802,201808]
[null,"CHIHUAHUA","RAGH640227EZ9","RAGH640227HCLMTR04  ","JOSE HORACIO RAMIREZ GUTIERREZ",1,83101,1003,"01",56,"CF33206","00.0",14307,27,"N15","C",2,199719,201809]
[null,"CHIHUAHUA","GOML880120US2","GOML880120MCHMNZ01  ","LUZ IVONNE GOMEZ MENDOZA",1,83101,1003,"02",19,"S01201","00.0",9723,27,"N02","C",2,201809,201809]
[null,"CHIHUAHUA","BAPF541102CN1","BAPF541102HCHCRR00  ","FRANCISCO ALBERTO BACA PEREZ",1,83101,1003,"00",25,"CF21202","00.0",12683,27,"N07","C",2,199220,201810]
[null,"CHIHUAHUA","OOSJ921202I59","OOSJ921202HCHCTR06  ","JORGE ROBERTO OCHOA SOTELO",1,83101,1003,"00",25,"A03202","00.0",10169,27,"N05","C",2,201808,201812]
[null,"CHIHUAHUA","VIMD590726DU0","VIMD590726HCHLRN05  ","DONACIANO VILLALOBOS MORENO",1,83101,1003,"02",18,"CF33206","00.0",13932,27,"N15","C",2,198813,201813]
[null,"CHIHUAHUA","DIAF6905309M4","DIAF690530HDGZLR08","FRANCISCO ROBERTO DIAZ ALVARADO",4,83101,1001,"00","25","L5XCBII","12.0","0",27,0,"C",2,201803,201811]
[null,"CHIHUAHUA","LOGM811218IW7","LOGM811218MCHRNY01","MYRNA GUADALUPE LOERA GONZALEZ",4,83101,1001,"00","25","L5XCBII","15.0","0",27,0,"C",2,201803,201808]
[null,"CHIHUAHUA","RUNH860818SE6","RUNH860818HCHBJM07","HUMBERTO ALONSO RUBIO NAJERA",4,83101,1001,"00","25","L5XCBI","18.0","0",27,0,"C",1,201809,999999]
[null,"CHIHUAHUA","RALK790326386","RALK790326MCHMPR08","KARINA CECILIA RAMIREZ LOPEZ",4,83101,1001,"00","26","L5XC","20.0","0",27,0,"A",2,201803,201811]
[null,"CHIHUAHUA","RACG650805Q12","RACG650805HSRMNM07","GAMALIEL RAMOS CONTRERAS",4,83101,1001,"01","56","L5XCBII","18.0","0",27,0,"C",2,201803,201809]
[null,"CHIHUAHUA","BIRG861118GT6","BIRG861118MCHRYR07","GEORGINA BRIONES REYES",4,83101,1001,"02","07","L5XCBI","12.0","0",27,0,"A",2,201803,201810]
[null,"CHIHUAHUA","CARV8802245G8","CARV880224MCHHML04","VIOLETA CHACON RAMOS",4,83101,1001,"02","07","L5XCBI","17.0","0",27,0,"A",2,201803,201811]
[null,"CHIHUAHUA","SASE940502AY3","SASE940502HCHLLD03","EDGAR OVED SALAZAR SILVA",4,83101,1001,"02","07","L5XCBI","14.0","0",27,0,"A",2,201803,201809]
[null,"CHIHUAHUA","RORH430507A24","RORH430507HDGBMC03","HECTOR ANTONIO ROBALI ROMERO",4,83101,1001,"02","18","L5XC","18.0","0",27,0,"C",2,201803,201809]
[null,"CHIHUAHUA","IIOF8012093M1","IIOF801209HCHRLR08","FRANCISCO IRIGOYEN OLIVAS",4,83101,1001,"02","18","L5XC","20.0","0",27,0,"C",2,201803,201809]
[null,"CHIHUAHUA","IIOF8012093M1","IIOF801209HCHRLR08","FRANCISCO IRIGOYEN OLIVAS",4,83101,1001,"02","18","L5XC","20.0","0",27,0,"C",1,201810,999999]
[null,"CHIHUAHUA","VIMG940827G9A","VIMG940827MCHLNL05","GUILLE LIZBETH VILLALOBOS MONTA¥O",4,83101,1001,"02","18","L5XCBI","12.0","0",27,0,"C",1,201810,999999]
[null,"CHIHUAHUA","NUEG910323CD1","NUEG910323HCHXSL05","GUILLERMO ALEJANDRO NUñEZ ESTRADA",4,83101,1001,"03","23","L5XC","10.0","0",27,0,"A",2,201803,201810]
[null,"CHIHUAHUA","BEGN750326UYA","BEGN750326MCHLRN05","NANCY NOHEMI BELTRAN GARCIA",4,83101,1001,"03","23","L5XCBII","14.0","0",27,0,"A",2,201803,201808]
[null,"CHIHUAHUA","LINM5608318QA","LINM560831HDFVRG06","MIGUEL ARTURO LIEVANO NORMAN",4,83101,1001,"03","23","L5XCBI","15.0","0",27,0,"A",1,201808,999999]
[null,"CHIHUAHUA","METJ941115RJ7","METJ941115MCHDNN07","JENNIFER MEDINA TUNCHEZ",4,83101,1001,"03","23","L5XCBI","14.0","0",27,0,"A",1,201809,999999]
[null,"Total Personas : ",33,null,null,null,null,null,null,null,"Total Plazas : ",null,17]
[]
[]
[]
[null,"Fuente : Información proporcionada por las Entidades Federativas"]

{"sheet":"II D) 4","index":8,"n_rows":24,"n_cols":17,"rows_kept":24,"cut":false,"hidden":false,"merged":[[12,16,13,16],[12,5,13,5],[12,4,13,4],[12,3,13,3],[9,1,9,9],[20,13,20,14],[12,0,13,0],[12,6,13,6],[12,7,12,13],[12,14,12,15],[12,2,13,2],[12,1,13,1]]}
[]
[]
[]
[]
[]
[]
[]
[]
[null,"Formato: Trabajadores Jubilados en el Periodo"]
[null,{"$f":"IF('1'!D22=\"Elige el Periodo…\",\"\",'1'!D22)","v":"Fondo de Aportaciones para la Educación Tecnológica y de Adultos/Colegio Nacional de Educación Profesional Técnica (FAETA/CONALEP)"},null,null,null,null,null,null,null,null,null,null,null,null,null,"2do. Trimestre 2018"]
[]
[]
[null,"Entidad Federativa","R.F.C.","CURP","NOMBRE","Clave CT","Última(s) ó Penultima(s) Plaza(s) Ocupada(s)\n(*)","Clave Presupuestal de la Jubilación",null,null,null,null,null,null,"Periodo ocupado",null,"Quincena de inicio de jubilación"]
[null,null,null,null,null,null,null,"Partida Presupuestal","Código de Pago","Clave de Unidad","Clave de Sub Unidad","Clave de Categoría","Horas Semana Mes ","Número de Plaza","Inicio","Conclusión"]
[]
[null,"Entidad Federativa","R.F.C.","CURP","NOMBRE","Clave Centro de Trabajo","Última(s) ó Penultima(s) Plaza(s) Ocupada(s)\n(*)","Partida Presupuestal","Código de Pago","Clave de Unidad","Clave de Sub Unidad","Clave de Categoría","Horas Semana Mes ","Número de Plaza","Periodo ocupado\nInicio","Periodo ocupado\nConclusión","Quincena de inicio de jubilación"]
[null,"CHIHUAHUA","BAPF541102CN1","BAPF541102HCHCRR00","FRANCISCO ALBERTO BACA PEREZ","08DPT0001C",1,83101,1003,"00","25","CF21202","00.0",2376,199220,201810,201811]
[null,"CHIHUAHUA","MOAM570729HK3","MOAM570729HCHNRN02","MONTES ARZOLA MANUEL","08DPT0003A",1,83101,1003,"01","56","S01201","00.0",7455,199007,201807,201808]
[null,"Total Personas : ",2,null,null,null,null,null,null,null,null,"Total Plazas : ",null,2]
[]
[]
[]
[null,"Fuente : Información proporcionada por las Entidades Federativas"]
[null,"(*) Si  el trabajador se jubila con más de una clave presupuestal, por cada plaza se debe llenar un registro hasta que se haya informado acerca de todas las plazas del trabajador."]

{"sheet":"II D) 4 A","index":9,"n_rows":24,"n_cols":18,"rows_kept":24,"cut":false,"hidden":false,"merged":[[18,13,18,14],[9,1,9,7],[20,13,20,14],[12,17,13,17],[12,1,13,1],[12,2,13,2],[12,3,13,3],[12,4,13,4],[12,5,13,5],[12,6,12,12],[12,13,12,14],[12,15,13,15],[12,16,13,16]]}
[]
[]
[]
[]
[]
[]
[]
[]
[null,"Formato: Trabajadores que Tramitaron Licencia Prejubilatoria en el Periodo"]
[null,{"$f":"IF('1'!D22=\"Elige el Periodo…\",\"\",'1'!D22)","v":"Fondo de Aportaciones para la Educación Tecnológica y de Adultos/Colegio Nacional de Educación Profesional Técnica (FAETA/CONALEP)"},null,null,null,null,null,null,null,null,null,null,null,null,null,null,"2do. Trimestre 2018"]
[]
[]
[null,"Entidad Federativa","R.F.C.","CURP","NOMBRE","Clave integrada","Clave Presupuestal",null,null,null,null,null,null,"Periodo Licencia",null,"Percepciones pagadas con Presupuesto Federal en el  Periodo reportado*","Percepciones pagadas con Presupuesto de otra Fuente en el  Periodo reportado*","Clave CT Origen"]
[null,null,null,null,null,null,"Partida Presupuestal","Código de Pago","Clave de Unidad","Clave de Sub Unidad","Clave de Categoría","Horas Semana Mes ","Número de Plaza","Inicio","Conclusión"]
[]
[null,"Entidad Federativa","R.F.C.","CURP","NOMBRE","Clave integrada","Partida Presupuestal","Código de Pago","Clave de Unidad","Clave de Sub Unidad","Clave de Categoría","Horas Semana Mes ","Número de Plaza","Periodo Licencia\nInicio","Periodo Licencia\nConclusión","Percepciones pagadas con Presupuesto Federal en el  Periodo reportado*","Percepciones pagadas con Presupuesto de otra Fuente en el  Periodo reportado*","Clave CT Origen"]
[null,"CHIHUAHUA","BAPF541102CN1","BAPF541102HCHCRR00","FRANCISCO ALBERTO BACA PEREZ","8310110030025CF3420100.02376",83101,1003,"00","25","CF34201","00.0",2376,20180301,20180531,48594.71,0,"08DPT0001C"]
[null,"CHIHUAHUA","VIMD590726DU0","VIMD590726HCHLRN05","DONACIANO VILLALOBOS MORENO","8310110030218CF3320600.013932",83101,1003,"02","18","CF33206","00.0",13932,20180416,20180715,98073.75,0,"08DPT0012I"]
[null,"Total Personas : ",2,null,null,null,null,null,null,null,"Total Plazas : ",null,2,"Total Pto. Federal",null,{"$f":"SUM(P17:P18)","v":146668.46}]
[]
[null,null,null,null,null,null,null,null,null,null,null,null,null,"Total Ppto. Otras Fuentes",null,null,0]
[]
[null,"*Total de Percepciones reportadas por la Entidad Federativa como pagadas en el periodo "]
[null,"Fuente : Información proporcionada por las Entidades Federativas"]

{"sheet":"II D) 6","index":10,"n_rows":24,"n_cols":13,"rows_kept":24,"cut":false,"hidden":false,"merged":[[10,1,10,6],[13,12,14,12],[13,9,13,10],[13,11,14,11],[13,1,14,1],[13,2,14,2],[13,3,14,3],[13,4,14,4],[13,5,14,5],[13,6,14,6],[13,7,13,8]]}
[]
[]
[]
[]
[]
[]
[]
[]
[]
[null,"Formato: Trabajadores Contratados por Honorarios en el Periodo"]
[null,{"$f":"IF('1'!D22=\"Elige el Periodo…\",\"\",'1'!D22)","v":"Fondo de Aportaciones para la Educación Tecnológica y de Adultos/Colegio Nacional de Educación Profesional Técnica (FAETA/CONALEP)"},null,null,null,null,null,null,null,null,null,"2do. Trimestre 2018"]
[]
[]
[null,"Entidad Federativa","Clave Centro de Trabajo","R.F.C.","CURP","Nombre","Identificador del Contrato","Equivalencia",null,"Periodo de Contratación",null,"Función","Percepciones pagadas dentro del periodo reportado"]
[null,null,null,null,null,null,null,"Clave de Categoría","Horas Semana Mes ","Inicio","Conclusión"]
[]
[null,"Entidad Federativa","Clave Centro de Trabajo","R.F.C.","CURP","Nombre","Identificador del Contrato","Clave de Categoría","Horas Semana Mes ","Periodo de Contratación\nInicio","Periodo de Contratación\nConclusión","Función","Percepciones pagadas dentro del periodo reportado"]
[null,"CHIHUAHUA","08DPT0011J","BAGA570401CF3","BAGA570401HCHRNN09","ANDRÉS BARBA GÁNDARA",1,"L5XC",20,20180401,20180630,"DOCENTE",28359]
[null,"Total Entidad Federativa Personas : ",null,1,null,null,null,null,null,null,null,"Subtotal Monto Pagado en el Periodo:",{"$f":"Tabla14[Percepciones pagadas dentro del periodo reportado]","v":28359}]
[]
[]
[null,null,null,null,null,null,null,null,null,"Total   Percepciones :",null,{"$f":"M19","v":28359}]
[]
[null,"Fuente : Información proporcionada por las Entidades Federativas"]

{"sheet":"II D) 7 1","index":11,"n_rows":168,"n_cols":19,"rows_kept":168,"cut":false,"hidden":false,"merged":[[8,17,8,18],[9,1,9,9],[12,6,13,6],[12,7,12,9],[12,10,13,10],[12,11,13,11],[12,12,13,12],[12,1,13,1],[12,2,13,2],[12,3,13,3],[12,4,13,4],[12,5,13,5],[12,17,13,17],[9,17,9,18],[161,16,161,17],[12,18,13,18],[12,13,13,13],[12,14,13,14],[12,15,13,15],[12,16,13,16]]}
[]
[]
[]
[]
[]
[]
[]
[]
[null,"Formato: Analítico de Categorías / Plazas Autorizadas con su Tabulador",null,null,null,null,null,null,null,null,null,null,null,null,null,null,"Entidad Federativa:",{"$f":"IF('1'!D21=\"Elige el Periodo…\",\"\",'1'!D21)","v":"CHIHUAHUA "}]
[null,{"$f":"IF('1'!D22=\"Elige el Periodo…\",\"\",'1'!D22)","v":"Fondo de Aportaciones para la Educación Tecnológica y de Adultos/Colegio Nacional de Educación Profesional Técnica (FAETA/CONALEP)"},null,null,null,null,null,null,null,null,null,null,null,null,null,null,null,"2do. Trimestre 2018"]
[]
[]
[null,"Clave Tipo educativo","Clave Nivel educativo","Clave Subnivel educativo","Descripción Nivel / Subnivel","Tipo Financiamiento","Partida Presupuestal","CATEGORIA",null,null,"Zona Económica","Nivel Puesto","Nivel Sueldo","Tipo Contratación","Monto mensual\npor plaza jornada","Monto mensual\nPor Plaza HSM","Número de Plazas Jornada","Número de Plazas HSM","Monto total autorizado"]
[null,null,null,null,null,null,null,"Tipo de Categoría"," Categoría","Descripción"]
[null,null,null,null,null,null,null,null,null,null,null,null,null,null,null,0]
[null,"Clave Tipo educativo","Clave Nivel educativo","Clave Subnivel educativo","Descripción Nivel / Subnivel","Tipo Financiamiento","Partida Presupestal","Tipo de Categoría"," Categoría","Descripción","Zona Económica","Nivel Puesto","Nivel Sueldo","Tipo Contratación","Monto mensual\npor plaza jornada","0","Número de Plazas Jornada","Número de Plazas HSM","Monto total autorizado"]
[null,2,21,"020","PERSONAL TECNICO",1,83101,5,"CF02103","DIRECTOR DE PLANTEL B Y C","C",27,"NB1","P",5753.58,0,1,0,5753.58]
[null,2,21,"020","PERSONAL TECNICO",1,83101,5,"CF02105","COORDINADOR EJECUTIVO II","C",27,"OB2","P",5165.88,0,1,0,5165.88]
[null,2,21,"020","PERSONAL TECNICO",1,83101,2,"CF33202","TECNICO EN CONTABILIDAD","C",27,"N07","P",8463.84,0,1,0,8463.84]
[null,2,21,"020","PERSONAL TECNICO",1,83101,2,"CF33206","JEFE DE PROYECTO","C",27,"N15","P",20607.759999999998,0,2,0,20607.759999999998]
[null,2,21,"020","PERSONAL TECNICO",1,83101,2,"CF33206","JEFE DE PROYECTO","C",27,"N15","P",23080.400000000001,0,4,0,23080.400000000001]
[null,2,21,"020","PERSONAL TECNICO",1,83101,2,"CF33204","SUBJEFE TECNICO ESPECIALISTA","C",27,"N13","P",13364.8,0,1,0,13364.8]
[null,2,21,"020","PERSONAL TECNICO",1,83101,2,"CF33204","SUBJEFE TECNICO ESPECIALISTA","C",27,"N13","P",14968.96,0,2,0,14968.96]
[null,2,21,"020","PERSONAL TECNICO",1,83101,2,"CF33204","SUBJEFE TECNICO ESPECIALISTA","C",27,"N13","P",14968.96,0,1,0,14968.96]
[null,2,21,"020","PERSONAL TECNICO",1,83101,2,"CF21202","ASISTENTE ESCOLAR Y SOCIAL","C",27,"N07","P",7865.46,0,1,0,7865.46]
[null,2,21,"020","PERSONAL TECNICO",1,83101,2,"CF04201","SECRETARIA   B","C",27,"N07","P",7865.46,0,1,0,7865.46]
[null,2,21,"020","PERSONAL TECNICO",1,83101,2,"A03202","SECRETARIA C","C",27,"N05","P",7277.3,0,2,0,7277.3]
[null,2,21,"020","PERSONAL TECNICO",1,83101,2,"S01201","ASISTENTE DE SERVICIOS BASICOS","C",27,"N02","P",6049.14,0,5,0,6049.14]
[null,2,21,"020","PERSONAL TECNICO",1,83101,2,"S01201","ASISTENTE DE SERVICIOS BASICOS","C",27,"N02","P",6412,0,2,0,6412]
[null,2,21,"020","PERSONAL TECNICO",1,83101,2,"S01202","AUXILIAR DE SERVICIOS GENERALES","C",27,"N04","P",6591.84,0,1,0,6591.84]
[null,2,21,"020","PERSONAL TECNICO",1,83101,2,"S01202","AUXILIAR DE SERVICIOS GENERALES","C",27,"N04","P",6591.84,0,1,0,6591.84]
[null,2,21,"020","PERSONAL TECNICO",1,83101,2,"CF18201","AUXILIAR DE SEGURIDAD","C",27,"N02","P",6049.14,0,2,0,6049.14]
[null,2,21,"020","PERSONAL TECNICO",1,83101,2,"CF18201","AUXILIAR DE SEGURIDAD","C",27,"N02","P",6049.14,0,1,0,6049.14]
[null,2,21,"020","PERSONAL TECNICO",1,83101,2,"CF18203","SUPERVISOR DE MANTENIMIENTO","C",27,"N09","P",8463.84,0,1,0,8463.84]
[null,2,21,"020","PERSONAL TECNICO",1,83101,2,"CF34201","TECNICO BIBLIOTECARIO","C",27,"N06","P",7569.8,0,1,0,7569.8]
[null,2,21,"020","PERSONAL TECNICO",1,83101,2,"CF34202","PROMOTOR CULTURAL Y DEPORTE","C",27,"N05","P",7277.3,0,1,0,7277.3]
[null,2,21,"020","PERSONAL TECNICO",1,83101,2,"CF19201","TUTOR ESCOLAR","C",27,"N06","P",7569.8,0,1,0,7569.8]
[null,2,21,"020","PERSONAL TECNICO",1,83101,2,"T08201","TECNICO EN GRAFICACION","C",27,"N08","P",8162.34,0,1,0,8162.34]
[null,2,21,"020","PERSONAL TECNICO",1,83101,2,"A03202","SECRETARIA C","C",27,"N05","P",6497.9,0,1,0,6497.9]
[null,2,21,"020","PERSONAL TECNICO",1,83101,2,"CF34202","PROMOTOR CULTURAL Y DEPORTE","C",27,"N05","P",7277.3,0,1,0,7277.3]
[null,2,21,"020","PERSONAL TECNICO",1,83101,2,"S01201","ASISTENTE DE SERVICIOS BASICOS","C",27,"N02","P",5724.7,0,1,0,5724.7]
[null,2,21,"020","PERSONAL TECNICO",1,83101,2,"S01202","AUXILIAR DE SERVICIOS GENERALES","C",27,"N04","P",6987.4,0,1,0,6987.4]
[null,2,21,"020","PERSONAL TECNICO",1,83101,5,"CF02103","DIRECTOR DE PLANTEL B Y C","A",27,"NB2","P",5753.58,0,1,0,5753.58]
[null,2,21,"020","PERSONAL TECNICO",1,83101,5,"CF02105","COORDINADOR EJECUTIVO II","A",27,"OB2","P",5165.88,0,1,0,5165.88]
[null,2,21,"020","PERSONAL TECNICO",1,83101,2,"CF33206","JEFE DE PROYECTO","A",27,"N15","P",25003.3,0,3,0,75009.899999999994]
[null,2,21,"020","PERSONAL TECNICO",1,83101,2,"CF33206","JEFE DE PROYECTO","A",27,"N15","P",24651.06,0,1,0,24651.06]
[null,2,21,"020","PERSONAL TECNICO",1,83101,2,"CF33206","JEFE DE PROYECTO","A",27,"N15","P",24471.9,0,2,0,48943.8]
[null,2,21,"020","PERSONAL TECNICO",1,83101,2,"CF33204","SUBJEFE TECNICO ESPECIALISTA","A",27,"N13","P",17775.060000000001,0,8,0,142200.48000000001]
[null,2,21,"020","PERSONAL TECNICO",1,83101,2,"CF33204","SUBJEFE TECNICO ESPECIALISTA","A",27,"N13","P",16768.8,0,1,0,16768.8]
[null,2,21,"020","PERSONAL TECNICO",1,83101,2,"CF18203","SUPERVISOR DE MANTENIMIENTO","A",27,"N09","P",10050.66,0,2,0,20101.32]
[null,2,21,"020","PERSONAL TECNICO",1,83101,2,"CF18203","SUPERVISOR DE MANTENIMIENTO","A",27,"N09","P",9481.5,0,1,0,9481.5]
[null,2,21,"020","PERSONAL TECNICO",1,83101,2,"CF04201","SECRETARIA   B","A",27,"N07","P",9340.1,0,1,0,9340.1]
[null,2,21,"020","PERSONAL TECNICO",1,83101,2,"CF19201","TUTOR ESCOLAR","A",27,"N06","P",8989.2999999999993,0,1,0,8989.2999999999993]
[null,2,21,"020","PERSONAL TECNICO",1,83101,2,"CF19201","TUTOR ESCOLAR","A",27,"N06","P",8480.56,0,1,0,8480.56]
[null,2,21,"020","PERSONAL TECNICO",1,83101,2,"CF34202","PROMOTOR CULTURAL Y DEPORTE","A",27,"N05","P",8769.9599999999991,0,1,0,8769.9599999999991]
[null,2,21,"020","PERSONAL TECNICO",1,83101,2,"A03202","SECRETARIA C","A",27,"N05","P",8769.9599999999991,0,1,0,8769.9599999999991]
[null,2,21,"020","PERSONAL TECNICO",1,83101,2,"S01202","AUXILIAR DE SERVICIOS GENERALES","A",27,"N04","P",8297.5,0,6,0,49785]
[null,2,21,"020","PERSONAL TECNICO",1,83101,2,"CF34201","TECNICO BIBLIOTECARIO","A",27,"N06","P",8989.2999999999993,0,1,0,8989.2999999999993]
[null,2,21,"020","PERSONAL TECNICO",1,83101,2,"S01201","ASISTENTE DE SERVICIOS BASICOS","A",27,"N02","P",7614.5,0,2,0,15229]
[null,2,21,"020","PERSONAL TECNICO",1,83101,2,"S01201","ASISTENTE DE SERVICIOS BASICOS","A",27,"N02","P",7183.44,0,2,0,14366.88]
[null,2,21,"020","PERSONAL TECNICO",1,83101,2,"S01201","ASISTENTE DE SERVICIOS BASICOS","A",27,"N02","P",6798.5,0,1,0,6798.5]
[null,2,21,"020","PERSONAL TECNICO",1,83101,2,"ED01201","TECNICO DE MATS DIDACTICOS","A",27,"N06","P",8989.2999999999993,0,2,0,17978.599999999999]
[null,2,21,"020","PERSONAL TECNICO",1,83101,2,"CF18201","AUXILIAR DE SEGURIDAD","A",27,"N02","P",6798.5,0,2,0,13597]
[null,2,21,"020","PERSONAL TECNICO",1,83101,5,"CF02103","DIRECTOR DE PLANTEL B Y C","C",27,"NB1","P",5753.58,0,1,0,5753.58]
[null,2,21,"020","PERSONAL TECNICO",1,83101,5,"CF02105","COORDINADOR EJECUTIVO II","C",27,"OB2","P",5165.8900000000003,0,1,0,5165.8900000000003]
[null,2,21,"020","PERSONAL TECNICO",1,83101,2,"CF33206","JEFE DE PROYECTO","C",27,"N15","P",23080.37,0,2,0,46160.74]
[null,2,21,"020","PERSONAL TECNICO",1,83101,2,"CF33206","JEFE DE PROYECTO","C",27,"N15","P",20607.75,0,4,0,82431]
[null,2,21,"020","PERSONAL TECNICO",1,83101,2,"CF33204","SUBJEFE TECNICO ESPECIALISTA","C",27,"N13","P",14968.96,0,2,0,29937.919999999998]
[null,2,21,"020","PERSONAL TECNICO",1,83101,2,"CF33204","SUBJEFE TECNICO ESPECIALISTA","C",27,"N13","P",14121.44,0,1,0,14121.44]
[null,2,21,"020","PERSONAL TECNICO",1,83101,2,"CF33204","SUBJEFE TECNICO ESPECIALISTA","C",27,"N13","P",13364.79,0,1,0,13364.79]
[null,2,21,"020","PERSONAL TECNICO",1,83101,2,"CF33203","TECNICO FINANCIERO","C",27,"N09","P",8463.83,0,1,0,8463.83]
[null,2,21,"020","PERSONAL TECNICO",1,83101,2,"CF04201","SECRETARIA   B","C",27,"N07","P",7865.45,0,2,0,15730.9]
[null,2,21,"020","PERSONAL TECNICO",1,83101,2,"CF21202","ASISTENTE ESCOLAR Y SOCIAL","C",27,"N07","P",7865.45,0,1,0,7865.45]
[null,2,21,"020","PERSONAL TECNICO",1,83101,2,"CF19201","TUTOR ESCOLAR","C",27,"N06","P",7569.8,0,1,0,7569.8]
[null,2,21,"020","PERSONAL TECNICO",1,83101,2,"A03202","SECRETARIA C","C",27,"N05","P",7277.3,0,1,0,7277.3]
[null,2,21,"020","PERSONAL TECNICO",1,83101,2,"A03202","SECRETARIA C","C",27,"N05","P",6865.43,0,2,0,13730.86]
[null,2,21,"020","PERSONAL TECNICO",1,83101,2,"CF34202","PROMOTOR CULTURAL Y DEPORTE","C",27,"N05","P",7277.28,0,1,0,7277.28]
[null,2,21,"020","PERSONAL TECNICO",1,83101,2,"S01202","AUXILIAR DE SERVICIOS GENERALES","C",27,"N04","P",6987.38,0,2,0,13974.76]
[null,2,21,"020","PERSONAL TECNICO",1,83101,2,"CF34201","TECNICO BIBLIOTECARIO","C",27,"N06","P",7569.78,0,1,0,7569.78]
[null,2,21,"020","PERSONAL TECNICO",1,83101,2,"S01201","ASISTENTE DE SERVICIOS BASICOS","C",27,"N02","P",6411.98,0,2,0,12823.96]
[null,2,21,"020","PERSONAL TECNICO",1,83101,2,"S01201","ASISTENTE DE SERVICIOS BASICOS","C",27,"N02","P",6049.14,0,3,0,18147.419999999998]
[null,2,21,"020","PERSONAL TECNICO",1,83101,2,"CF18201","AUXILIAR DE SEGURIDAD","C",27,"N02","P",6411.98,0,2,0,12823.96]
[null,2,21,"020","PERSONAL TECNICO",1,83101,5,"CF02103","DIRECTOR DE PLANTEL B Y C","A",27,"NB2","P",5753.58,0,1,0,5753.58]
[null,2,21,"020","PERSONAL TECNICO",1,83101,5,"CF02105","COORDINADOR EJECUTIVO II","A",27,"OB2","P",5165.88,0,1,0,5165.88]
[null,2,21,"020","PERSONAL TECNICO",1,83101,2,"CF33206","JEFE DE PROYECTO","A",27,"N15","P",25003.3,0,3,0,75009.899999999994]
[null,2,21,"020","PERSONAL TECNICO",1,83101,2,"CF33206","JEFE DE PROYECTO","A",27,"N15","P",24471.9,0,3,0,73415.7]
[null,2,21,"020","PERSONAL TECNICO",1,83101,2,"CF33204","SUBJEFE TECNICO ESPECIALISTA","A",27,"N13","P",17775.060000000001,0,5,0,88875.3]
[null,2,21,"020","PERSONAL TECNICO",1,83101,2,"CF33203","TECNICO FINANCIERO","A",27,"N09","P",10050.66,0,1,0,10050.66]
[null,2,21,"020","PERSONAL TECNICO",1,83101,2,"CF18203","SUPERVISOR DE MANTENIMIENTO","A",27,"N09","P",10050.66,0,2,0,20101.32]
[null,2,21,"020","PERSONAL TECNICO",1,83101,2,"CF04201","SECRETARIA   B","A",27,"N07","P",9340.1,0,1,0,9340.1]
[null,2,21,"020","PERSONAL TECNICO",1,83101,2,"CF19201","TUTOR ESCOLAR","A",27,"N06","P",8989.2999999999993,0,1,0,8989.2999999999993]
[null,2,21,"020","PERSONAL TECNICO",1,83101,2,"S01202","AUXILIAR DE SERVICIOS GENERALES","A",27,"N04","P",8297.5,0,2,0,16595]
[null,2,21,"020","PERSONAL TECNICO",1,83101,2,"S01202","AUXILIAR DE SERVICIOS GENERALES","A",27,"N04","P",7827.54,0,1,0,7827.54]
[null,2,21,"020","PERSONAL TECNICO",1,83101,2,"CF34202","PROMOTOR CULTURAL Y DEPORTE","A",27,"N05","P",8769.9599999999991,0,1,0,8769.9599999999991]
[null,2,21,"020","PERSONAL TECNICO",1,83101,2,"A03202","SECRETARIA C","A",27,"N05","P",8769.9599999999991,0,4,0,35079.839999999997]
[null,2,21,"020","PERSONAL TECNICO",1,83101,2,"S01201","ASISTENTE DE SERVICIOS BASICOS","A",27,"N02","P",7183.44,0,2,0,14366.88]
[null,2,21,"020","PERSONAL TECNICO",1,83101,5,"CF02103","DIRECTOR DE PLANTEL B Y C","C",27,"NB1","P",5753.58,0,1,0,5753.58]
[null,2,21,"020","PERSONAL TECNICO",1,83101,5,"CF02105","COORDINADOR EJECUTIVO II","C",27,"OB2","P",5165.8900000000003,0,1,0,5165.8900000000003]
[null,2,21,"020","PERSONAL TECNICO",1,83101,2,"CF33206","JEFE DE PROYECTO","C",27,"N15","P",23080.400000000001,0,4,0,92321.600000000006]
[null,2,21,"020","PERSONAL TECNICO",1,83101,2,"CF33206","JEFE DE PROYECTO","C",27,"N15","P",21774.36,0,2,0,43548.72]
[null,2,21,"020","PERSONAL TECNICO",1,83101,2,"CF33203","TECNICO FINANCIERO","C",27,"N09","P",8463.84,0,1,0,8463.84]
[null,2,21,"020","PERSONAL TECNICO",1,83101,2,"CF04201","SECRETARIA   B","C",27,"N07","P",7865.46,0,1,0,7865.46]
[null,2,21,"020","PERSONAL TECNICO",1,83101,2,"CF19201","TUTOR ESCOLAR","C",27,"N04","P",7569.8,0,1,0,7569.8]
[null,2,21,"020","PERSONAL TECNICO",1,83101,2,"A03202","SECRETARIA C","C",27,"N09","P",7277.3,0,2,0,14554.6]
[null,2,21,"020","PERSONAL TECNICO",1,83101,2,"S01202","AUXILIAR DE SERVICIOS GENERALES","C",27,"N06","P",6987.4,0,1,0,6987.4]
[null,2,21,"020","PERSONAL TECNICO",1,83101,2,"CF34201","TECNICO BIBLIOTECARIO","C",27,"N06","P",7141.3,0,1,0,7141.3]
[null,2,21,"020","PERSONAL TECNICO",1,83101,2,"S01201","ASISTENTE DE SERVICIOS BASICOS","C",27,"N05","P",6049.14,0,1,0,6049.14]
[null,2,21,"020","PERSONAL TECNICO",1,83101,2,"CF18201","AUXILIAR DE SEGURIDAD","C",27,"N02","P",6412,0,1,0,6412]
[null,2,21,"020","PERSONAL TECNICO",1,83101,2,"CF18201","AUXILIAR DE SEGURIDAD","C",27,"N02","P",6049.14,0,1,0,6049.14]
[null,2,21,"020","PERSONAL TECNICO",1,83101,2,"CF18203","SUPERVISOR DE MANTENIMIENTO","C",27,"N02","P",8463.84,0,2,0,16927.68]
[null,2,21,"020","PERSONAL TECNICO",1,83101,2,"A03202","SECRETARIA C","C",27,"N05","P",7277.3,0,2,0,14554.6]
[null,2,21,"020","PERSONAL TECNICO",1,83101,2,"CF33206","JEFE DE PROYECTO","C",27,"N15","P",23080.400000000001,0,4,0,92321.600000000006]
[null,2,21,"020","PERSONAL TECNICO",1,83101,2,"CF33203","TECNICO FINANCIERO","C",27,"N09","P",8463.84,0,1,0,8463.84]
[null,2,21,"020","PERSONAL TECNICO",1,83101,2,"S01201","ASISTENTE DE SERVICIOS BASICOS","C",27,"N02","P",6049.14,0,2,0,12098.28]
[null,2,21,"020","PERSONAL TECNICO",1,83101,5,"CF02104","DIRECTOR DE PLANTEL D Y E","C",27,"NA2","P",5165.88,0,1,0,5165.88]
[null,2,21,"020","PERSONAL TECNICO",1,83101,2,"CF33204","SUBJEFE TECNICO ESPECIALISTA","C",27,"N13","P",14968.96,0,1,0,14968.96]
[null,2,21,"020","PERSONAL TECNICO",1,83101,2,"CF18203","SUPERVISOR DE MANTENIMIENTO","C",27,"N09","P",8463.84,0,2,0,16927.68]
[null,2,21,"020","PERSONAL TECNICO",1,83101,2,"CF18201","AUXILIAR DE SEGURIDAD","C",27,"N02","P",6412,0,1,0,6412]
[null,2,21,"020","PERSONAL TECNICO",1,83101,2,"CF04201","SECRETARIA   B","C",27,"N07","P",7865.46,0,1,0,7865.46]
[null,2,21,"020","PERSONAL TECNICO",1,83101,2,"T08201","TECNICO EN GRAFICACION","C",27,"N08","P",8162.34,0,1,0,8162.34]
[null,2,21,"020","PERSONAL TECNICO",1,83101,2,"S01202","AUXILIAR DE SERVICIOS GENERALES","C",27,"N04","P",6987.4,0,1,0,6987.4]
[null,2,21,"020","PERSONAL TECNICO",1,83101,2,"CF19201","TUTOR ESCOLAR","C",27,"N06","P",7141.3,0,1,0,7141.3]
[null,2,21,"020","PERSONAL TECNICO",1,83101,2,"CF21202","ASISTENTE ESCOLAR Y SOCIAL","C",27,"N07","P",7865.46,0,1,0,7865.46]
[null,2,21,"020","PERSONAL TECNICO",1,83101,5,"CF02103","DIRECTOR DE PLANTEL B Y C","C",27,"NB1","P",5753.58,0,1,0,17260.740000000002]
[null,2,21,"020","PERSONAL TECNICO",1,83101,2,"CF02105","COORDINADOR EJECUTIVO II","C",27,"OB2","P",5165.88,0,1,0,5165.8900000000003]
[null,2,21,"020","PERSONAL TECNICO",1,83101,2,"CF33206","JEFE DE PROYECTO","C",27,"N15","P",23080.400000000001,0,3,0,207723.6]
[null,2,21,"020","PERSONAL TECNICO",1,83101,2,"CF33206","JEFE DE PROYECTO","C",27,"N15","P",20607.759999999998,0,3,0,185469.84]
[null,2,21,"020","PERSONAL TECNICO",1,83101,2,"CF33204","SUBJEFE TECNICO ESPECIALISTA","C",27,"N13","P",13364.8,0,2,0,80188.800000000003]
[null,2,21,"020","PERSONAL TECNICO",1,83101,2,"CF33204","SUBJEFE TECNICO ESPECIALISTA","C",27,"N13","P",14968.96,0,7,0,314348.15999999997]
[null,2,21,"020","PERSONAL TECNICO",1,83101,2,"CF18203","SUPERVISOR DE MANTENIMIENTO","C",27,"N09","P",8463.84,0,2,0,50783.040000000001]
[null,2,21,"020","PERSONAL TECNICO",1,83101,2,"CF19201","TUTOR ESCOLAR","C",27,"N06","P",7569.8,0,1,0,22709.4]
[null,2,21,"020","PERSONAL TECNICO",1,83101,2,"CF04201","SECRETARIA   B","C",27,"N07","P",7865.46,0,1,0,23596.38]
[null,2,21,"020","PERSONAL TECNICO",1,83101,2,"A03202","SECRETARIA C","C",27,"N05","P",7277.3,0,4,0,87327.6]
[null,2,21,"020","PERSONAL TECNICO",1,83101,2,"S01202","AUXILIAR DE SERVICIOS GENERALES","C",27,"N03","P",6591.84,0,3,0,59326.559999999998]
[null,2,21,"020","PERSONAL TECNICO",1,83101,2,"S01202","AUXILIAR DE SERVICIOS GENERALES","C",27,"N03","P",6987.4,0,2,0,41924.400000000001]
[null,2,21,"020","PERSONAL TECNICO",1,83101,2,"S01201","ASISTENTE DE SERVICIOS BASICOS","C",27,"N02","P",6049.14,0,3,0,54442.26]
[null,2,21,"020","PERSONAL TECNICO",1,83101,2,"S01201","ASISTENTE DE SERVICIOS BASICOS","C",27,"N02","P",5724.7,0,1,0,17174.099999999999]
[null,2,21,"020","PERSONAL TECNICO",1,83101,2,"CF18201","AUXILIAR DE SEGURIDAD","C",27,"N02","P",6049.14,0,1,0,18147.419999999998]
[null,2,21,"020","PERSONAL TECNICO",1,83101,2,"CF18201","AUXILIAR DE SEGURIDAD","C",27,"N02","P",6412,0,1,0,19236]
[null,2,21,"020","PERSONAL TECNICO",1,83101,5,"CF02100","SUBCOORDINADOR","C",27,"OC2","P",5165.8900000000003,0,2,0,10331.780000000001]
[null,2,21,"020","PERSONAL TECNICO",1,83101,2,"CF33206","JEFE DE PROYECTO","C",27,"N15","P",23080.400000000001,0,5,0,115402]
[null,2,21,"020","PERSONAL TECNICO",1,83101,2,"CF33206","JEFE DE PROYECTO","C",27,"N15","P",20607.75,0,2,0,41215.5]
[null,2,21,"020","PERSONAL TECNICO",1,83101,2,"CF34201","TECNICO BIBLIOTECARIO","C",27,"N06","P",7569.8,0,1,0,7569.8]
[null,2,21,"020","PERSONAL TECNICO",1,83101,2,"CF33204","SUBJEFE TECNICO ESPECIALISTA","C",27,"N13","P",14968.95,0,3,0,44906.85]
[null,2,21,"020","PERSONAL TECNICO",1,83101,5,"CF11100","DIRECTOR GENERAL ESTATAL","C",27,"MC2","P",11552.21,0,1,0,11552.21]
[null,2,21,"020","PERSONAL TECNICO",1,83101,2,"CF34205","ADMINISTRATIVO TECNICO ESPECIALISTA","C",27,"N11","P",9075.4,0,1,0,9075.4]
[null,2,21,"020","PERSONAL TECNICO",1,83101,2,"S01201","ASISTENTE DE SERVICIOS BASICOS","C",27,"N02","P",6412,0,1,0,6412]
[null,2,21,"020","PERSONAL TECNICO",1,83101,2,"ED01201","TECNICO DE MATS DIDACTICOS","C",27,"N06","P",7141.3,0,1,0,7141.3]
[null,2,21,"020","PERSONAL TECNICO",1,83101,2,"T08201","TECNICO EN GRAFICACION","C",27,"N08","H",8162.34,0,1,0,8162.34]
[null,2,21,"020","PERSONAL TECNICO",1,83101,3,"L5XC","DOCENTE","C",27,0,"H",0,472.65,0,4160,1966224]
[null,2,21,"020","PERSONAL TECNICO",1,83101,3,"L5XCBII","DOCENTE","C",27,0,"H",0,409.55,0,1061,434532.55]
[null,2,21,"020","PERSONAL TECNICO",1,83101,3,"L5XCBI","DOCENTE","C",27,0,"H",0,364.4,0,760,276944]
[null,2,21,"020","PERSONAL TECNICO",1,83101,3,"L5XATEC","DOCENTE","C",27,0,"H",0,267.89999999999998,0,108,28933.200000000001]
[null,2,21,"020","PERSONAL TECNICO",1,83101,3,"L5XC","DOCENTE","A",27,0,"H",0,571.75,0,1895,1083466.25]
[null,2,21,"020","PERSONAL TECNICO",1,83101,3,"L5XCBII","DOCENTE","A",27,0,"H",0,496.95,0,978,486017.1]
[null,2,21,"020","PERSONAL TECNICO",1,83101,3,"L5XCBI","DOCENTE","A",27,0,"H",0,439.7,0,700,307790]
[null,2,21,"020","PERSONAL TECNICO",1,83101,3,"L5XATEC","DOCENTE","A",27,0,"P",0,326.3,0,216,70480.800000000003]
[null,2,21,"020","PERSONAL TECNICO",1,83101,5,"CF11102","DIRECTOR DE CENTRO","A",27,"NB2","P",5753.58,0,1,0,5753.58]
[null,2,21,"020","PERSONAL TECNICO",1,83101,5,"CF01601","JEFE DE UNIDAD","A",27,"OC1","P",5165.88,0,4,0,20663.52]
[null,2,21,"020","PERSONAL TECNICO",1,83101,2,"CF33204","SUBJEFE TECNICO ESPECIALISTA","A",27,"N13","P",17775.060000000001,0,3,0,53325.18]
[null,2,21,"020","PERSONAL TECNICO",1,83101,2,"CF33204","SUBJEFE TECNICO ESPECIALISTA","A",27,"N13","P",17775.060000000001,0,2,0,35550.120000000003]
[null,null,null,null,null,null,null,null,null,null,null,null,null,"Total Jornada:",{"$f":"SUBTOTAL(109,Tabla15[Monto mensual\npor plaza jornada])","v":1370019.3499999996},null,"Total Autorizado:",null,{"$f":"SUBTOTAL(109,Tabla15[Monto total autorizado])","v":8141376.5999999978}]
[null,null,null,null,null,null,null,null,null,null,null,null,null,"Total HSM",null,{"$f":"SUM(P17:P162)","v":3349.2}]
[]
[null,"Fuente : Información proporcionada por las Entidades Federativas"]
[]
[]
[null,null,null,null,null,null,null,null," "]

{"sheet":"II D) 7 2 ","index":12,"n_rows":170,"n_cols":18,"rows_kept":170,"cut":false,"hidden":false,"merged":[[14,8,15,8],[14,9,14,13],[14,14,14,16],[10,16,10,17],[11,1,11,9],[14,1,15,1],[14,2,15,2],[14,3,15,3],[14,17,15,17],[14,6,15,6],[14,7,15,7],[14,4,15,4],[14,5,15,5],[11,16,11,17]]}
[]
[]
[]
[]
[]
[]
[]
[]
[]
[]
[null,"Formato: Catálogo de Categorías y Tabuladores",null,null,null,null,null,null,null,null,null,null,null,null,null,"Entidad Federativa:",{"$f":"IF('1'!D21=\"Elige el Periodo…\",\"\",'1'!D21)","v":"CHIHUAHUA "}]
[null,{"$f":"IF('1'!D22=\"Elige el Periodo…\",\"\",'1'!D22)","v":"Fondo de Aportaciones para la Educación Tecnológica y de Adultos/Colegio Nacional de Educación Profesional Técnica (FAETA/CONALEP)"},null,null,null,null,null,null,null,null,null,null,null,null,null,null,"2do. Trimestre 2018"]
[]
[]
[null,"Identificador origen presupuestal de la plaza","Clave de categoría","Descripción de la categoría","Tipo de contratación","Tipo de categoría","Clave de concepto de pago","Clave de nivel de puesto","Clave de nivel de sueldo","Sueldo asignado por zona económica",null,null,null,null,"Datos adicionales de horas",null,null,"Fecha de actualización"]
[null,null,null,null,null,null,null,null,null,"Inicio de vigencia del sueldo","Fin de vigencia del sueldo","Monto Mensual Jornada ó de HSM\nZona A","Monto Mensual Jornada ó de HSM\nZona B","Monto Mensual Jornada ó de HSM\nZona C","Horas \nde compatibilidad","Horas de servicio (HSM)","Horas de docencia"]
[]
[null,"Identificador origen presupuestal de la plaza","Clave de categoría","Descripción de la categoría","Tipo de contratación","Tipo de categoría","Clave de concepto de pago","Clave de nivel de puesto","Clave de nivel de sueldo","Inicio de vigencia del sueldo","Fin de vigencia del sueldo","Monto Mensual Jornada ó de HSM\nZona A","Monto Mensual Jornada ó de HSM\nZona B","Monto Mensual Jornada ó de HSM\nZona C","Horas \nde compatibilidad","Horas de servicio (HSM)","Horas de docencia","Fecha de actualización"]
[null,1,"CF02103","DIRECTOR DEL PLANTEL B Y C ","P",5,1003,27,"NB1",199909,999999,0,0,5753.58,"40.0",0,0,20170201]
[null,1,"CF02105","COORDINADOR EJECUTIVO","P",5,1003,27,"OB2",199909,999999,0,0,5165.88,"40.0",0,0,20170201]
[null,1,"CF33206","JEFE DE PROYECTO","P",2,1003,27,"N15",199909,999999,0,0,20607.759999999998,"40.0",0,0,20170201]
[null,1,"CF33206","JEFE DE PROYECTO","P",2,1003,27,"N15",199909,999999,0,0,23080.400000000001,"40.0",0,0,20170201]
[null,1,"CF33204","SUBJEFE TECNICO ESPECIALISTA","P",2,1003,27,"N13",199909,999999,0,0,13364.8,"40.0",0,0,20170201]
[null,1,"CF33204","SUBJEFE TECNICO ESPECIALISTA","P",2,1003,27,"N13",199909,999999,0,0,14968.96,"40.0",0,0,20170201]
[null,1,"CF33204","SUBJEFE TECNICO ESPECIALISTA","P",2,1003,27,"N13",199909,999999,0,0,14968.96,"40.0",0,0,20170201]
[null,1,"CF33202","TECNICO EN CONTABILIDAD","P",2,1003,27,"N09",199909,999999,0,0,8463.84,"40.0",0,0,20170201]
[null,1,"CF04201","SECRETARIA B","P",2,1003,27,"N07",199909,999999,0,0,7865.46,"40.0",0,0,20170201]
[null,1,"A03202","SECRETARIA C","P",2,1003,27,"N05",199909,999999,0,0,7277.3,"40.0",0,0,20170201]
[null,1,"S01201","ASISTENTE DE SERVICIOS BASICOS","P",2,1003,27,"N02",199909,999999,0,0,6412,"40.0",0,0,20170201]
[null,1,"S01201","ASISTENTE DE SERVICIOS BASICOS","P",2,1003,27,"N02",199909,999999,0,0,6049.14,"40.0",0,0,20170201]
[null,1,"S01202","AUXILIAR DE SERVICIOS GENERALES","P",2,1003,27,"N04",199909,999999,0,0,6591.84,"40.0",0,0,20170201]
[null,1,"S01202","AUXILIAR DE SERVICIOS GENERALES","P",2,1003,27,"N04",199909,999999,0,0,6987.4,"40.0",0,0,20170201]
[null,1,"CF18201","AUXILIAR DE SEGURIDAD","P",2,1003,27,"N02",199909,999999,0,0,6049.14,"40.0",0,0,20170201]
[null,1,"CF34201","TECNICO BIBLIOTECARIO","P",2,1003,27,"N06",199909,999999,0,0,7569.8,"40.0",0,0,20170201]
[null,1,"CF34202","PROMOTOR CULTURAL Y DEPORTIVO","P",2,1003,27,"N05",199909,999999,0,0,7277.3,"40.0",0,0,20170201]
[null,1,"CF19201","TUTOR ESCOLAR","P",2,1003,27,"N06",199909,999999,0,0,7569.8,"40.0",0,0,20170201]
[null,1,"CF18203","SUPERVISOR DE MANTENIMIENTO","P",2,1003,27,"N09",199909,999999,0,0,8463.84,"40.0",0,0,20170201]
[null,1,"CF21202","ASISTENTE ESCOLAR Y SOCIAL","P",2,1003,27,"N07",199909,999999,0,0,7865.46,"40.0",0,0,20170201]
[null,1,"T08201","TECNICO EN GRAFICACION","P",2,1003,27,"N08",199909,999999,0,0,8162.34,"40.0",0,0,20170201]
[null,1,"A03202","SECRETARIA C","P",2,1003,27,"N05",199909,999999,0,0,6497.9,"40.0",0,0,20170201]
[null,1,"CF34202","PROMOTOR CULTURAL Y DEPORTIVO","P",2,1003,27,"N05",199909,999999,0,0,7277.3,"40.0",0,0,20170201]
[null,1,"S01201","ASISTENTE DE SERVICIOS BASICOS","P",2,1003,27,"N02",199909,999999,0,0,5724.7,"40.0",0,0,20170201]
[null,1,"CF02103","DIRECTOR DEL PLANTEL B Y C ","P",5,1003,27,"NB2",199909,999999,5753.58,0,0,"40.0",0,0,20170201]
[null,1,"CF02105","COORDINADOR EJECUTIVO","P",5,1003,27,"N14",199909,999999,5165.88,0,0,"40.0",0,0,20170201]
[null,1,"CF33206","JEFE DE PROYECTO ","P",2,1003,27,"N15",199909,999999,25003.3,0,0,"40.0",0,0,20170201]
[null,1,"CF33206","JEFE DE PROYECTO ","P",2,1003,27,"N15",199909,999999,24651.06,0,0,"40.0",0,0,20170201]
[null,1,"CF33206","JEFE DE PROYECTO ","P",2,1003,27,"N15",199909,999999,24471.9,0,0,"40.0",0,0,20170201]
[null,1,"CF33204","SUBJEFE TECNICO ESPECIALISTA","P",2,1003,27,"N13",199909,999999,17775.060000000001,0,0,"40.0",0,0,20170201]
[null,1,"CF33204","SUBJEFE TECNICO ESPECIALISTA","P",2,1003,27,"N13",199909,999999,16768.8,0,0,"40.0",0,0,20170201]
[null,1,"CF18203","SUPERVISOR DE MANTENIMIENTO","P",2,1003,27,"N09",199909,999999,10050.66,0,0,"40.0",0,0,20170201]
[null,1,"CF18203","SUPERVISOR DE MANTENIMIENTO","P",2,1003,27,"N09",199909,999999,9481.5,0,0,"40.0",0,0,20170201]
[null,1,"CF04201","SECRETARIA B","P",2,1003,27,"N07",199909,999999,9340.1,0,0,"40.0",0,0,20170201]
[null,1,"CF19201","TUTOR ESCOLAR","P",1,1003,27,"N06",199909,999999,8989.2999999999993,0,0,"40.0",0,0,20170201]
[null,1,"CF19201","TUTOR ESCOLAR","P",1,1003,27,"N06",199909,999999,8480.56,0,0,"40.0",0,0,20170201]
[null,1,"CF34202","PROMOTOR DEPORTIVO Y CULTURAL","P",2,1003,27,"N05",199909,999999,8769.9599999999991,0,0,"40.0",0,0,20170201]
[null,1,"A03202","SECRETARIA C","P",2,1003,27,"N05",199909,999999,8769.9599999999991,0,0,"40.0",0,0,20170201]
[null,1,"S01202","AUXILIAR DE SERVICIOS GENERALES","P",2,1003,27,"N04",199909,999999,8297.5,0,0,"40.0",0,0,20170201]
[null,1,"CF34201","TECNICO BIBLIOTECARIO","P",2,1003,27,"N06",199909,999999,8989.2999999999993,0,0,"40.0",0,0,20170201]
[null,1,"S01201","ASISTENTE DE SERVICIOS BASICOS","P",2,1003,27,"N02",199909,999999,7614.5,0,0,"40.0",0,0,20170201]
[null,1,"S01201","ASISTENTE DE SERVICIOS BASICOS","P",2,1003,27,"N02",199909,999999,7183.44,0,0,"40.0",0,0,20170201]
[null,1,"S01201","ASISTENTE DE SERVICIOS BASICOS","P",2,1003,27,"N02",199909,999999,6798.5,0,0,"40.0",0,0,20170201]
[null,1,"ED01201","TECNICO EN MATERIALES DIDACTICOS","P",2,1003,27,"N06",199909,999999,8989.2999999999993,0,0,"40.0",0,0,20170201]
[null,1,"CF18201","AUXILIAR DE SEGURIDAD","P",2,1003,27,"N02",199909,999999,6798.5,0,0,"40.0",0,0,20170201]
[null,1,"CF02103","DIRECTOR DEL PLANTEL","P",5,1003,27,"NB1",199909,999999,0,0,5753.58,"40.0",0,0,20170201]
[null,1,"CF02105","COORDINADOR EJECUTIVO","P",5,1003,27,"OB2",199909,999999,0,0,5165.8900000000003,"40.0",0,0,20170201]
[null,1,"CF33206","JEFE DE PROYECTO","P",2,1003,27,"N15",199909,999999,0,0,23080.37,"40.0",0,0,20170201]
[null,1,"CF33206","JEFE DE PROYECTO","P",2,1003,27,"N15",199909,999999,0,0,20607.75,"40.0",0,0,20170201]
[null,1,"CF33204","SUBJEFE TECNICO ESPECIALISTA","P",2,1003,27,"N13",199909,999999,0,0,14968.96,"40.0",0,0,20170201]
[null,1,"CF33204","SUBJEFE TECNICO ESPECIALISTA","P",2,1003,27,"N13",199909,999999,0,0,14121.44,"40.0",0,0,20170201]
[null,1,"CF33204","SUBJEFE TECNICO ESPECIALISTA","P",2,1003,27,"N13",199909,999999,0,0,13364.79,"40.0",0,0,20170201]
[null,1,"CF33203","TECNICO FINANCIERO","P",2,1003,27,"N09",199909,999999,0,0,8463.83,"40.0",0,0,20170201]
[null,1,"CF34202","PROMOTOR CULTURAL Y DEPORTIVO","P",2,1003,27,"N05",199909,999999,0,0,7277.28,"40.0",0,0,20170201]
[null,1,"CF21202","ASISTENTE ESCOLAR Y SOCIAL","P",2,1003,27,"N07",199909,999999,0,0,7865.45,"40.0",0,0,20170201]
[null,1,"CF19201","TUTOR ESCOLAR","P",2,1003,27,"N06",199909,999999,0,0,7569.8,"40.0",0,0,20170201]
[null,1,"A03202","SECRETARIA C","P",2,1003,27,"N05",199909,999999,0,0,7277.3,"40.0",0,0,20170201]
[null,1,"A03202","SECRETARIA C","P",2,1003,27,"N05",199909,999999,0,0,6865.43,"40.0",0,0,20170201]
[null,1,"CF04201","SECRETARIA B","P",2,1003,27,"N05",199909,999999,0,0,7865.45,"40.0",0,0,20170201]
[null,1,"CF34201","TECNICO BIBLIOTECARIO","P",2,1003,27,"N06",199909,999999,0,0,7569.78,"40.0",0,0,20170201]
[null,1,"S01201","ASISTENTE DE SERVICIOS BASICOS","P",2,1003,27,"N02",199909,999999,0,0,6411.98,"40.0",0,0,20170201]
[null,1,"S01201","ASISTENTE DE SERVICIOS BASICOS","P",2,1003,27,"N02",199909,999999,0,0,6049.14,"40.0",0,0,20170201]
[null,1,"S01202","AUXILIAR DE SERVICIOS GENERALES","P",2,1003,27,"N04",199909,999999,0,0,6987.38,"40.0",0,0,20170201]
[null,1,"CF18201","AUXILIAR DE SEGURIDAD","P",2,1003,27,"N02",199909,999999,0,0,6411.98,"40.0",0,0,20170201]
[null,1,"S01201","ASISTENTE DE SERVICIOS BASICOS","P",2,1003,27,"N02",199909,999999,7183.44,0,0,"40.0",0,0,20170201]
[null,1,"S01201","ASISTENTE DE SERVICIOS BASICOS","P",2,1003,27,"N02",199909,999999,7183.44,0,0,"40.0",0,0,20170201]
[null,1,"S01202","AUXILIAR DE SERVICIOS GENERALES","P",2,1003,27,"N04",199909,999999,7827.54,0,0,"40.0",0,0,20170201]
[null,1,"S01202","AUXILIAR DE SERVICIOS GENERALES","P",2,1003,27,"N04",199909,999999,8297.5,0,0,"40.0",0,0,20170201]
[null,1,"S01202","AUXILIAR DE SERVICIOS GENERALES","P",2,1003,27,"N04",199909,999999,8297.5,0,0,"40.0",0,0,20170201]
[null,1,"CF34202","PROMOTOR CULTURAL Y DEPORTIVO","P",2,1003,27,"N05",199909,999999,8769.9599999999991,0,0,"40.0",0,0,20170201]
[null,1,"A03202","SECRETARIA C","P",2,1003,27,"N05",199909,999999,8769.9599999999991,0,0,"40.0",0,0,20170201]
[null,1,"A03202","SECRETARIA C","P",2,1003,27,"N05",199909,999999,8769.9599999999991,0,0,"40.0",0,0,20170201]
[null,1,"A03202","SECRETARIA C","P",2,1003,27,"N05",199909,999999,8769.9599999999991,0,0,"40.0",0,0,20170201]
[null,1,"A03202","SECRETARIA C","P",2,1003,27,"N05",199909,999999,8769.9599999999991,0,0,"40.0",0,0,20170201]
[null,1,"CF19201","TUTOR ESCOLAR","P",2,1003,27,"N06",199909,999999,8989.2999999999993,0,0,"40.0",0,0,20170201]
[null,1,"CF04201","SECRETARIA B","P",2,1003,27,"N07",199909,999999,9340.1,0,0,"40.0",0,0,20170201]
[null,1,"CF18203","SUPERVISOR DE MANTENIMIENTO","P",2,1003,27,"N09",199909,999999,10050.66,0,0,"40.0",0,0,20170201]
[null,1,"CF18203","SUPERVISOR DE MANTENIMIENTO","P",2,1003,27,"N09",199909,999999,10050.66,0,0,"40.0",0,0,20170201]
[null,1,"CF33203","TECNICO FINANCIERO","P",2,1003,27,"N09",199909,999999,10050.66,0,0,"40.0",0,0,20170201]
[null,1,"CF33204","SUBJEFE TECNICO ESPECIALISTA","P",2,1003,27,"N13",199909,999999,17775.060000000001,0,0,"40.0",0,0,20170201]
[null,1,"CF33204","SUBJEFE TECNICO ESPECIALISTA","P",2,1003,27,"N13",199909,999999,17775.060000000001,0,0,"40.0",0,0,20170201]
[null,1,"CF33204","SUBJEFE TECNICO ESPECIALISTA","P",2,1003,27,"N13",199909,999999,17775.060000000001,0,0,"40.0",0,0,20170201]
[null,1,"CF33204","SUBJEFE TECNICO ESPECIALISTA","P",2,1003,27,"N13",199909,999999,17775.060000000001,0,0,"40.0",0,0,20170201]
[null,1,"CF33204","SUBJEFE TECNICO ESPECIALISTA","P",2,1003,27,"N13",199909,999999,17775.060000000001,0,0,"40.0",0,0,20170201]
[null,1,"CF02105","COORDINADOR EJECUTIVO ","P",5,1003,27,"OB2",199909,999999,5165.88,0,0,"40.0",0,0,20170201]
[null,1,"CF33206","JEFE DE PROYECTO","P",2,1003,27,"N15",199909,999999,24471.9,0,0,"40.0",0,0,20170201]
[null,1,"CF33206","JEFE DE PROYECTO","P",2,1003,27,"N15",199909,999999,24471.9,0,0,"40.0",0,0,20170201]
[null,1,"CF33206","JEFE DE PROYECTO","P",2,1003,27,"N15",199909,999999,25003.3,0,0,"40.0",0,0,20170201]
[null,1,"CF33206","JEFE DE PROYECTO","P",2,1003,27,"N15",199909,999999,25003.3,0,0,"40.0",0,0,20170201]
[null,1,"CF33206","JEFE DE PROYECTO","P",2,1003,27,"N15",199909,201807,24471.9,0,0,"40.0",0,0,20170201]
[null,1,"CF33206","JEFE DE PROYECTO","P",2,1003,27,"N15",199909,999999,25003.3,0,0,"40.0",0,0,20170201]
[null,1,"CF02103","DIRECTOR DEL PLANTEL B Y C ","P",5,1003,27,"NB2",199909,999999,5753.58,0,0,"40.0",0,0,20170201]
[null,1,"CF02103","DIRECTOR DEL PLANTEL","P",5,1003,27,"NB1",199909,999999,0,0,5753.58,"40.0",0,0,20170201]
[null,1,"CF02105","COORDINADOR EJECUTIVO","P",5,1003,27,"OB2",199909,999999,0,0,5165.88,"40.0",0,0,20170201]
[null,1,"CF33206","JEFE DE PROYECTO ","P",2,1003,27,"N15",199909,999999,0,0,23080.400000000001,"40.0",0,0,20170201]
[null,1,"CF33206","JEFE DE PROYECTO ","P",2,1003,27,"N15",199909,999999,0,0,21774.36,"40.0",0,0,20170201]
[null,1,"CF33203","TECNICO FINANCIERO","P",2,1003,27,"N09",199909,999999,0,0,8463.84,"40.0",0,0,20170201]
[null,1,"CF04201","SECRETARIA B","P",2,1003,27,"N07",199909,999999,0,0,7865.46,"40.0",0,0,20170201]
[null,1,"CF19201","TUTOR ESCOLAR","P",2,1003,27,"N04",199909,999999,0,0,7569.8,"40.0",0,0,20170201]
[null,1,"A03202","SECRETARIA C","P",2,1003,27,"N09",199909,999999,0,0,7277.3,"40.0",0,0,20170201]
[null,1,"S01202","AUXILIAR DE SERVICIOS GENERALES","P",2,1003,27,"N06",199909,999999,0,0,6987.4,"40.0",0,0,20170201]
[null,1,"CF34201","TECNICO BIBLIOTECARIO","P",2,1003,27,"N06",199909,999999,0,0,7141.3,"40.0",0,0,20170201]
[null,1,"S01201","ASISTENTE DE SERVICIOS BASICOS","P",2,1003,27,"N05",199909,999999,0,0,6049.14,"40.0",0,0,20170201]
[null,1,"CF18201","AUXILIAR DE SEGURIDAD","P",2,1003,27,"N02",199909,999999,0,0,6412,"40.0",0,0,20170201]
[null,1,"CF18201","AUXILIAR DE SEGURIDAD","P",2,1003,27,"N02",199909,999999,0,0,6049.14,"40.0",0,0,20170201]
[null,1,"CF18203","SUPERVISOR DE MANTENIMIENTO","P",2,1003,27,"N02",199909,999999,0,0,8463.84,"40.0",0,0,20170201]
[null,1,"AO3202","SECRETARIA C","P",2,1003,27,"N05",199909,999999,0,0,7277.3,"40.0",0,0,20170201]
[null,1,"CF33206","JEFE DE PROYECTO","P",2,1003,27,"N15",199909,999999,0,0,23080.400000000001,"40.0",0,0,20170201]
[null,1,"CF33203","TECNICO FINANCIERO","P",2,1003,27,"N09",199909,999999,0,0,8463.84,"40.0",0,0,20170201]
[null,1,"SO1201","ASISTENTE DE SERVICIOS BASICOS","P",2,1003,27,"N02",199909,999999,0,0,6049.14,"40.0",0,0,20170201]
[null,1,"CF02104","DIRECTOR DE PLANTEL D Y E","P",5,1003,27,"NA2",199909,999999,0,0,5165.88,"40.0",0,0,20170201]
[null,1,"CF33204","SUBJEFE TECNICO ESPECIALISTA","P",2,1003,27,"N13",199909,999999,0,0,14968.96,"40.0",0,0,20170201]
[null,1,"CF18203","SUPERVISOR DE MANTENIMIENTO","P",2,1003,27,"N09",199909,999999,0,0,8463.84,"40.0",0,0,20170201]
[null,1,"CF18201","AUXILIAR DE SEGURIDAD","P",2,1003,27,"N02",199909,999999,0,0,6412,"40.0",0,0,20170201]
[null,1,"CF04201","SECRETARIA B","P",2,1003,27,"N07",199909,999999,0,0,7865.46,"40.0",0,0,20170201]
[null,1,"T08201","TECNICO EN GRAFICACION","P",2,1003,27,"N08",199909,999999,0,0,8162.34,"40.0",0,0,20170201]
[null,1,"S01202","AUXILIAR DE SERVICIOS GENERALES","P",2,1003,27,"N04",199909,999999,0,0,6987.4,"40.0",0,0,20170201]
[null,1,"CF19201","TUTOR ESCOLAR","P",2,1003,27,"N06",199909,999999,0,0,7141.3,"40.0",0,0,20170201]
[null,1,"CF21202","ASISTENTE ESCOLAR Y SOCIAL","P",2,1003,27,"N07",199909,999999,0,0,7865.46,"40.0",0,0,20170201]
[null,1,"CF02103","DIRECTOR DEL PLANTEL B Y C ","P",5,1003,27,"NB2",199909,999999,0,0,5753.58,"40.0",0,0,20170201]
[null,1,"CF02105","COORDINADOR EJECUTIVO","P",5,1003,27,"OB2",199909,999999,0,0,4165.88,"40.0","0",0,20170201]
[null,1,"CF33206","JEFE DE PROYECTO","P",2,1003,27,"N15",199909,999999,0,0,20607.759999999998,"40.0",0,0,20170201]
[null,1,"CF33206","JEFE DE PROYECTO","P",2,1003,27,"N15",199909,999999,0,0,23080.400000000001,"40.0",0,0,20170201]
[null,1,"CF33204","SUBJEFE TECNICO ESPECIALISTA","P",2,1003,27,"N13",199909,999999,0,0,14968.96,"40.0",0,0,20170201]
[null,1,"CF33204","SUBJEFE TECNICO ESPECIALISTA","P",2,1003,27,"N13",199909,999999,0,0,13364.8,"40.0",0,0,20170201]
[null,1,"CF18203","SUPERVISOR DE MANTENIMIENTO","P",2,1003,27,"N09",199909,999999,0,0,8463.84,"40.0",0,0,20170201]
[null,1,"CF19201","TUTOR ESCOLAR","P",2,1003,27,"N06",199909,999999,0,0,7569.8,"40.0",0,0,20170201]
[null,1,"CF04201","SECRETARIA B","P",2,1003,27,"N07",199909,999999,0,0,7865.46,"40.0",0,0,20170201]
[null,1,"A03202","SECRETARIA C","P",2,1003,27,"N05",199909,999999,0,0,7277.3,"40.0",0,0,20170201]
[null,1,"SO1201","ASISTENTE DE SERVICIOS BASICOS","P",2,1003,27,"N02",199909,999999,0,0,5724.7,"40.0",0,0,20170201]
[null,1,"SO1202","AUXILIAR DE SERVICIOS GENERALES","P",2,1003,27,"N04",199909,999999,0,0,6238.86,"40.0",0,0,20170201]
[null,1,"SO1202","AUXILIAR DE SERVICIOS GENERALES","P",2,1003,27,"N04",199909,999999,0,0,6987.4,"40.0",0,0,20170201]
[null,1,"CF18201","AUXILIAR DE SEGURIDAD","P",2,1003,27,"N02",199909,999999,0,0,5724.7,"40.0",0,0,20170201]
[null,1,"CF18201","AUXILIAR DE SEGURIDAD","P",2,1003,27,"N02",199909,999999,0,0,6412,"40.0",0,0,20170201]
[null,1,"CF02100","SUBCOORDINADOR","P",5,1003,27,"OC2",199909,999999,0,0,5165.8900000000003,"40.0",0,0,20170201]
[null,1,"CF33206","JEFE DE PROYECTO","P",2,1003,27,"N15",199909,999999,0,0,23080.400000000001,"40.0",0,0,20170201]
[null,1,"CF33206","JEFE DE PROYECTO","P",2,1003,27,"N15",199909,999999,0,0,20607.75,"40.0",0,0,20170201]
[null,1,"CF34201","TECNICO BIBLIOTECARIO","P",2,1003,27,"N06",199909,999999,0,0,7569.8,"40.0",0,0,20170201]
[null,1,"CF33204","SUFJEFE TECNICO ESPECIALISTA","P",2,1003,27,"N13",199909,999999,0,0,14968.95,"40.0",0,0,20170201]
[null,1,"CF11100","DIRECTOR GENERAL ESTATAL","P",5,1003,27,"MC2",199909,999999,0,0,11552.21,"40.0",0,0,20170201]
[null,1,"S01201","ASISTENTE DE SERVICIOS GENERALES","P",2,1003,27,"N02",199909,999999,0,0,6412,"40.0",0,0,20170201]
[null,1,"CF34205","ADMINISTRATIVO TECNICO ESPECIALISTA","P",2,1003,27,"N11",199909,999999,0,0,9075.4,"40.0",0,0,20170201]
[null,1,"ED01201","TECNICO DE MATERIALES DIDACTICOS","P",2,1003,27,"N06",199909,999999,0,0,7141.3,"40.0",0,0,20170201]
[null,1,"T08201","TECNICO EN GRAFICACION","P",2,1003,27,"N08",199909,999999,0,0,8162.34,"40.0",0,0,20170201]
[null,1,"CF11102","DIRECTOR DEL CENTRO","P",5,1003,27,"NB2",199909,999999,5753.58,0,0,"40.0",0,0,20170201]
[null,1,"CF01601","JEFE DE UNIDAD","P",5,1003,27,"OC1",199909,999999,5165.8900000000003,0,0,"40.0",0,0,20170201]
[null,1,"CF33204","SUBJEFE TECNICO ESPECIALISTA","P",2,1003,27,"N13",199909,999999,17775.060000000001,0,0,"40.0",0,0,20170201]
[null,null,null,null,null,null,null,null,null,null,"Total Zona A:",{"$f":"SUBTOTAL(109,Tabla16[Monto Mensual Jornada ó de HSM\nZona A])","v":646178.15000000014}]
[null,null,null,null,null,null,null,null,null,null,null,"Total Zona B:",{"$f":"SUM(M19:M166)","v":0}]
[null,null,null,null,null,null,null,null,null,null,null,null,"Total Zona C:",{"$f":"SUM(N19:N167)","v":907590.72000000009}]
[]
[null,"Fuente : Información proporcionada por las Entidades Federativas"]

{"sheet":"II D) 7 3","index":13,"n_rows":95,"n_cols":11,"rows_kept":95,"cut":false,"hidden":false,"merged":[[9,1,9,7],[8,9,8,10],[9,9,9,10]]}
[]
[]
[]
[]
[]
[]
[]
[]
[null,"Formato: Catálogo de Percepciones y Deducciones",null,null,null,null,null,null,"Entidad Federativa:",{"$f":"IF('1'!D21=\"Elige el Periodo…\",\"\",'1'!D21)","v":"CHIHUAHUA "}]
[null,{"$f":"IF('1'!D22=\"Elige el Periodo…\",\"\",'1'!D22)","v":"Fondo de Aportaciones para la Educación Tecnológica y de Adultos/Colegio Nacional de Educación Profesional Técnica (FAETA/CONALEP)"},null,null,null,null,null,null,null,"2do. Trimestre 2018"]
[]
[]
[null,"Identificador origen presupuestal de la plaza","Tipo de concepto de pago ","Origen de financiamiento del concepto de percepciones.","Porcentaje de participación federal por fuente de recursos","Grupo al que pertenece concepto de pago (Percepción y/o Deducción)","Clave de concepto de pago","Descripción del concepto de pago ","Partida presupuestal","Fecha del","Fecha  al"]
[]
[null,"Identificador origen presupuestal de la plaza","Tipo de concepto de pago ","Origen de financiamiento del concepto de percepciones.","Porcentaje de participación federal por fuente de recursos","Grupo al que pertenece concepto de pago (Percepción y/o Deducción)","Clave de concepto de pago","Descripción del concepto de pago ","Partida presupuestal","Fecha del","Fecha  al"]
[null,1,"P","F",100,"P2",1003,"SALARIO BASE",83301,19990918,99999999]
[null,1,"P","F",100,"P3",2766,"PRIMA DE ANTIGÜEDAD",83301,19990918,99999999]
[null,1,"P","F",100,"P1",5050,"EXCESO DE CREDITO AL SALARIO",83301,19990918,99999999]
[null,1,"P","F",100,"P3",2627,"ESTIMULO 10 DE MAYO",83301,19990918,99999999]
[null,1,"P","F",100,"P1",2517,"ESTIMULO POR PRODUCTIVIDAD",83301,19990918,99999999]
[null,1,"P","F",100,"P1",2800,"DESPENSA",83301,19990918,99999999]
[null,1,"P","F",100,"P2",3623,"PRIMA VACACIONAL",83301,19990918,99999999]
[null,1,"P","F",100,"P3",2600,"PUNTUALIDAD Y ASISTENCIA",83301,19990918,99999999]
[null,1,"P","F",100,"P3",4468,"HORAS EXTRAS",83301,19990918,99999999]
[null,1,"P","F",100,"P1",1602,"DESARROLLO Y CAPACITACION",83301,19990918,99999999]
[null,1,"P","F",100,"P3",1624,"PRIMA DOMINICAL",83301,19990918,99999999]
[null,1,"P","F",100,"P3",2754,"GUARDERIA",83301,19990918,99999999]
[null,1,"P","F",100,"P1",2518,"COMPENSACION GARANTIZADA",83301,19990918,99999999]
[null,1,"P","F",100,"P3",2850,"LABORES EN CONDICIONES INSALUBRES",83301,19990918,99999999]
[null,1,"P","F",100,"P3",2680,"ANTEOJOS O LENTES DE CONTACTO",83301,19990918,99999999]
[null,1,"P","F",100,"P3",2655,"APARATOS ORTOPEDICOS",83301,19990918,99999999]
[null,1,"P","F",100,"P3",2810,"AYUDA PARA TITULACION",83301,19990918,99999999]
[null,1,"P","F",100,"P3",2615,"CANASTILLA MATERNAL",83301,19990918,99999999]
[null,1,"P","F",100,"P3",2553,"DIAS ECONOMICOS",83301,19990918,99999999]
[null,1,"P","F",100,"P3",2565,"AJUSTE SALARIAL",83301,19990918,99999999]
[null,1,"P","F",100,"P3",2573,"DIAS DE DESCANSO OBLIGATORIO",83301,19990918,99999999]
[null,1,"P","F",100,"P3",2625,"AYUDA UTILES ESCOLARES",83301,19990918,99999999]
[null,1,"P","F",100,"P2",3613,"AGUINALDO",83301,19990918,99999999]
[null,1,"P","F",100,"P3",2830,"BONIFICACION IMPUESTO",83301,19990918,99999999]
[null,1,"P","F",100,"P3",1601,"NUPCIAS",83301,19990918,99999999]
[null,1,"P","F",100,"P3",2955,"OTRAS PERCEPCIONES",83301,19990918,99999999]
[null,1,"P","F",100,"P1",2805,"PREVISION MULTIPLE",83301,20111116,99999999]
[null,1,"D",null,100,"D3",2950,"OTRAS DEDUCCIONES",null,19990918,99999999]
[null,1,"D",null,100,"D2",5045,"I.S.P.T. A RETENER",null,19990918,99999999]
[null,1,"D",null,100,"D2",2735,"SEGURO DE VIDA AHISA",null,19990918,99999999]
[null,1,"D",null,100,"D1",8523,"CUOTA SINDICAL",null,19990918,99999999]
[null,1,"D",null,100,"D2",2920,"SEGURO DE RETIRO",null,19990918,99999999]
[null,1,"D",null,100,"D3",8135,"PRESTAMO ISSSTE",null,19990918,99999999]
[null,1,"D",null,100,"D3",8095,"CREDITO HIPOTECARIO",null,19990918,99999999]
[null,1,"D",null,100,"D3",5710,"ANTICIPO DE SUELDO",null,19990918,99999999]
[null,1,"D",null,100,"D3",8580,"PENSION ALIMENTICIA",null,19990918,99999999]
[null,1,"D",null,100,"D3",6044,"IMPUESTO A RETENER",null,19990918,99999999]
[null,1,"D",null,100,"D3",1927,"SEGURO DE DAÑOS FOVISSSTE",null,19990918,99999999]
[null,1,"D",null,100,"D3",2910,"PRESTAMO KONDINERO",null,20180401,99999999]
[null,1,"D",null,100,"D3",2915,"SEGURO DE VIDA COMERCIAL AMERICA",null,19990918,99999999]
[null,1,"D",null,100,"D3",2929,"DEDUCCIONES EXTRAS",null,19990918,99999999]
[null,1,"D",null,100,"D2",6250,"ISSSTE SEG SALUD",null,19990918,99999999]
[null,1,"D",null,100,"D2",6251,"ISSSTE SEG SALUD PENSIONADO",null,19990918,99999999]
[null,1,"D",null,100,"D2",6252,"ISSSTE SEG INVALIDEZ Y VIDA",null,19990918,99999999]
[null,1,"D",null,100,"D2",6253,"ISSSTE SEG SOCIALES Y CULT",null,19990918,99999999]
[null,1,"D",null,100,"D2",6254,"ISSSTE SEG RET CESANTIA AVZDA",null,19990918,99999999]
[null,1,"D",null,100,"D3",2740,"PRESTAMO DIMEX",null,19990918,20150415]
[null,1,"D",null,100,"D3",2740,"OTRAS DEDUCCIONES",null,20150416,99999999]
[null,1,"D",null,100,"D3",2912,"AHORRO SOLIDARIO EMP",null,19990918,99999999]
[null,1,"D",null,100,"D3",2880,"CREDITO CREDIFIEL",null,20130601,99999999]
[null,1,"D",null,100,"D3",2717,"SEGURO GENERAL AUTO",null,20150416,99999999]
[null,1,"D",null,100,"D3",2748,"SEGURO GENERAL VIDA",null,20150416,99999999]
[null,1,"D",null,100,"D3",2965,"SEGURO GENERAL SALUD",null,20150416,99999999]
[null,4,"P","F",100,"P1",1001,"SALARIO BASE",83301,20111116,99999999]
[null,4,"P","F",100,"P2",1005,"ESTIMULO",83301,20111116,99999999]
[null,4,"P","F",100,"P2",1006,"HORAS RECUPERADAS",83301,20111116,99999999]
[null,4,"D",null,100,"D1",2001,"I.S.R.",null,20111116,99999999]
[null,4,"D",null,100,"D2",2002,"CUOTA SINDICAL LOCAL",null,20111116,99999999]
[null,4,"D",null,100,"D1",2003,"SEG. SALUD T. ACTIVO",null,20111116,99999999]
[null,4,"D",null,100,"D2",2005,"PENSION ALIMENTICIA",null,20111116,99999999]
[null,4,"D",null,100,"D2",2006,"HORAS NO IMPARTIDAS",null,20111116,99999999]
[null,4,"D",null,100,"D1",2007,"S. RET. CESANTIA AVANZADA",null,20111116,99999999]
[null,4,"D",null,100,"D2",2013,"PRESTAMO ISSSTE",null,20111116,99999999]
[null,4,"D",null,100,"D2",2014,"PRESTAMO ISSSTE CORTO PLAZO",null,20111116,99999999]
[null,4,"D",null,100,"D2",2015,"PRESTAMO HIPOTECARIO",null,20111116,99999999]
[null,4,"D",null,100,"D2",2016,"SEGURO DE DAÑOS FOVISSTE",null,20111116,99999999]
[null,4,"D",null,100,"D2",2019,"TELETON",null,20111116,99999999]
[null,4,"D",null,100,"D3",2020,"PRESTAMO PERSONAL",null,20111116,99999999]
[null,4,"D",null,100,"D3",2021,"PRESTAMO CREDIFIEL",null,20130601,99999999]
[null,4,"D",null,100,"D1",2023,"SEG. SALUD T. PENSIONADO",null,20111116,99999999]
[null,4,"D",null,100,"D2",2024,"APORT. VOL. CRUZ ROJA",null,20111116,99999999]
[null,4,"D",null,100,"D1",2025,"SEG. INV. Y VIDA",null,20111116,99999999]
[null,4,"D",null,100,"D1",2026,"S. SOCIEDAD Y CULT.",null,20111116,99999999]
[null,4,"D",null,100,"D2",2870,"PRESTAMO SALVADOR",null,20140916,99999999]
[null,4,"D",null,100,"D3",2004,"CREDITO SALVADOR",null,20140916,99999999]
[null,4,"P","F",100,"P1",1035,"RETROACTIVO DE AGUINALDO",83301,20141116,99999999]
[null,4,"D",null,100,"D3",2036,"KONDINERO",null,20180401,99999999]
[null,4,"D",null,100,"D3",2038,"SEGURO AUTO",null,20150416,99999999]
[null,4,"D",null,100,"D3",2039,"SEGURO VIDA",null,20150416,99999999]
[null,"Fuente : Información proporcionada por las Entidades Federativas"]

{"sheet":"E)","index":14,"n_rows":27,"n_cols":8,"rows_kept":27,"cut":false,"hidden":false,"merged":[[9,1,9,5],[12,1,14,1],[12,2,14,2],[13,7,14,7],[12,3,14,3],[12,4,14,4],[12,5,12,7],[13,5,14,5],[13,6,14,6],[9,6,9,7]]}
[]
[]
[]
[]
[]
[]
[]
[]
[null,"Formato: Trabajadores que Cobran con RFC / CURP con Formato Incorrecto"]
[null,{"$f":"IF('1'!D22=\"Elige el Periodo…\",\"\",'1'!D22)","v":"Fondo de Aportaciones para la Educación Tecnológica y de Adultos/Colegio Nacional de Educación Profesional Técnica (FAETA/CONALEP)"},null,null,null,null,"2do. Trimestre 2018"]
[]
[]
[null,"Entidad Federativa","RFC","CURP","NOMBRE TRABAJADOR","Motivo"]
[null,null,null,null,null,"Sin RFC o erroneo","RFC Sin Homoclave","Sin CURP o Erronea"]
[]
[]
[null,"Entidad Federativa","RFC","CURP","NOMBRE TRABAJADOR","Sin RFC o erroneo","RFC Sin Homoclave","Sin CURP o Erronea"]
[]
[]
[]
[]
[]
[]
[null,"Total Personas : ",null,null,"Total Sin RFC o Erroneo:"]
[null,null,null,null,null,"Total RFC Sin Homoclave:"]
[null,null,null,null,null,null,"Total Sin CURP o Erroneo:"]
[null,"Fuente : Información proporcionada por las Entidades Federativas"]

{"sheet":"F) 1","index":15,"n_rows":27,"n_cols":19,"rows_kept":27,"cut":false,"hidden":false,"merged":[[9,1,9,6],[12,15,13,15],[12,16,13,16],[12,17,12,18],[12,1,13,1],[12,2,13,2],[12,3,13,3],[12,4,13,4],[12,5,13,5],[12,6,13,6],[12,7,13,7],[12,8,12,14],[9,17,9,18]]}
[]
[]
[]
[]
[]
[]
[]
[]
[null,"Formato: Trabajadores con Doble Asignación Salarial en Municipios no Colindantes Geográficamente"]
[null,{"$f":"IF('1'!D22=\"Elige el Periodo…\",\"\",'1'!D22)","v":"Fondo de Aportaciones para la Educación Tecnológica y de Adultos/Colegio Nacional de Educación Profesional Técnica (FAETA/CONALEP)"},null,null,null,null,null,null,null,null,null,null,null,null,null,null,null,"2do. Trimestre 2018"]
[]
[]
[null,"Entidad Federativa","Municipio","Localidad","RFC","CURP","Nombre del Trabajador","Clave integrada","Clave Presupuestal",null,null,null,null,null,null,"Clave CT","Nombre CT","Periodo en el CT"]
[null,null,null,null,null,null,null,null,"Partida Presupuestal","Código de Pago","Clave de Unidad","Clave de Sub Unidad","Clave de Categoría","Horas Semana Mes ","Número de Plaza",null,null,"Desde","Hasta"]
[]
[null,"Entidad Federativa","Municipio","Localidad","RFC","CURP","Nombre del Trabajador","Clave integrada","Partida Presupuestal","Código de Pago","Clave de Unidad","Clave de Sub Unidad","Clave de Categoría","Horas semana mes","Número de Plaza","Clave CT","Nombre CT","Periodo en el CT\nDesde","Periodo en el CTH\nasta"]
[]
[]
[]
[]
[]
[]
[null,"Total Personas : ",null,null,null,null,null,null,null,null,null,null,"Total Plazas : "]
[]
[]
[null,"Fuente : Información proporcionada por las Entidades Federativas"]
[null,"Importante: Listar Sólo los Municipios no Colindantes"]

{"sheet":"F) 2","index":16,"n_rows":27,"n_cols":20,"rows_kept":27,"cut":false,"hidden":false,"merged":[[13,3,14,3],[13,4,14,4],[13,5,14,5],[10,1,10,9],[13,19,14,19],[13,18,14,18],[13,6,13,12],[13,13,14,13],[13,14,14,14],[13,15,14,15],[13,16,13,17],[13,1,14,1],[13,2,14,2]]}
[]
[]
[]
[]
[]
[]
[]
[]
[]
[null,"Formato: Trabajadores Ocupando Plazas que Superan el Número de Horas de Compatibilidad Autorizadas"]
[null,{"$f":"IF('1'!D22=\"Elige el Periodo…\",\"\",'1'!D22)","v":"Fondo de Aportaciones para la Educación Tecnológica y de Adultos/Colegio Nacional de Educación Profesional Técnica (FAETA/CONALEP)"},null,null,null,null,null,null,null,null,null,null,null,null,null,null,null,null,"2do. Trimestre 2018"]
[]
[]
[null,"Entidad Federativa","RFC","CURP","Nombre","Clave integrada","Clave Presupuestal",null,null,null,null,null,null,"CT","Nombre CT","Turno CT","Periodo",null,"Total de Horas en el CT","Horas de compatibilidad de la categoría"]
[null,null,null,null,null,null,"Partida Presupuestal","Código de Pago","Clave de Unidad","Clave de Sub Unidad","Clave de Categoría","Horas Semana Mes ","Número de Plaza",null,null,null,"Desde","Hasta"]
[]
[null,"Entidad Federativa","RFC","CURP","Nombre","Clave integrada","Partida Presupuestal","Código de Pago","Clave de Unidad","Clave de Sub Unidad","Clave de Categoría","Horas semana mes","Número de plaza","CT","Nombre CT","Turno CT","Periodo\nDesde","Periodo\nHasta","Total de Horas en el CT","Horas de compatibilidad de la categoría"]
[]
[]
[]
[]
[]
[]
[null,"Total Personas : ",null,null,null,null,null,null,null,null,"Total Plazas : "]
[]
[]
[null,"Fuente : Información proporcionada por las Entidades Federativas"]

{"sheet":"G)","index":17,"n_rows":28,"n_cols":20,"rows_kept":28,"cut":false,"hidden":false,"merged":[[10,1,10,8],[12,5,12,11],[13,1,14,1],[13,2,14,2],[13,3,14,3],[13,4,14,4],[13,5,14,5],[13,6,13,12],[10,18,10,19],[13,19,14,19],[13,13,14,13],[13,14,14,14],[13,15,13,16],[13,17,14,17],[13,18,14,18]]}
[]
[]
[]
[]
[]
[]
[]
[]
[]
[null,"Formato: Trabajadores Cuyo Salario Básico Supere los Ingresos Promedio de un Docente en la Categoría más Alta del Tabulador Salarial Correspondiente a Cada Entidad"]
[null,{"$f":"IF('1'!D22=\"Elige el Periodo…\",\"\",'1'!D22)","v":"Fondo de Aportaciones para la Educación Tecnológica y de Adultos/Colegio Nacional de Educación Profesional Técnica (FAETA/CONALEP)"},null,null,null,null,null,null,null,null,null,null,null,null,null,null,null,null,"2do. Trimestre 2018"]
[]
[]
[null,"Entidad Federativa","R.F.C.","CURP","Nombre","Clave integrada","Clave Presupuestal Integrada y Categoria aparte",null,null,null,null,null,null,"Clave CT Origen","Nombre CT","Periodo",null,"Monto de Remuneraciones Mensuales ","Monto de referencia","Diferencia\n(R-S)"]
[null,null,null,null,null,null,"Partida Presupuestal","Código de Pago","Clave de Unidad","Clave de Sub Unidad","Clave de Categoría","Horas Semana Mes ","Número de Plaza",null,null,"Desde","Hasta"]
[]
[null,"Entidad Federativa","R.F.C.","CURP","Nombre","Clave integrada","Partida Presupuestal","Código de Pago","Clave de Unidad","Clave de Sub Unidad","Clave de Categoría","Horas Semana Mes ","No. de plaza","CT","Nombre CT","Periodo\nDesde","Periodo\nHasta","Monto de Remuneraciones Mensuales ","Monto de referencia","Diferencia\n(R-S)"]
[]
[]
[]
[]
[]
[]
[null,"Total Personas : ",null,null,null,null,null,null,null,null,null,null,null,null,"Total Remuneraciones Mensuales:"]
[]
[null,null,null,null,null,null,null,null,null,null,null,null,null,null,null,null,null,"Total Diferencia:"]
[]
[null,"Fuente : Información proporcionada por las Entidades Federativas"]

{"sheet":"H)","index":18,"n_rows":13,"n_cols":8,"rows_kept":13,"cut":false,"hidden":false,"merged":[[0,1,0,2]]}
[null,"2do. Trimestre 2018"]
[null,"Movimientos de Personal por Centro de Trabajo"]
[null,"Personal Registrado en la Nómina Federalizada"]
[null,"Nómina","Plaza (Clave presupuestal)","Categoría de la plaza","RFC","CURP","Nombre","Movimientos"]
[]
[]
[]
[]
[]
[]
[null,"Información reportada por la Entidad Federativa, correspondiente al periodo"]
[null,"La Entidad Federativa pudo haber reportado pagos a más de una persona con la misma plaza por distintos motivos de carácter administrativo"]
[null,"Alta: Se refiere a la incorporación de la plaza a la Base de Datos en este sistema"]

{"sheet":"Listas","index":19,"n_rows":42,"n_cols":8,"rows_kept":42,"cut":false,"hidden":true,"merged":[]}
[]
[]
[]
[null,"Elige un Fondo…"]
[null,"Fondo de Aportaciones para la Educación Básica y Normal (FAEB)"]
[null,"Fondo de Aportaciones para la Educación Tecnológica y de Adultos/Colegio Nacional de Educación Profesional Técnica (FAETA/CONALEP)"]
[null,"Fondo de Aportaciones para la Educación Tecnológica y de Adultos/Instituto Nacional para la Educación de los Adultos (FAETA/INEA)"]
[]
[]
[null,null,null,null,null,null,null,"Elige la Entidad Federativa…"]
[null,"Elige el Periodo…",null,null,null,null,null,"AGUASCALIENTES"]
[null,"1er. Trimestre",null,null,null,null,null,"BAJA CALIFORNIA"]
[null,"2do. Trimestre",null,null,null,null,null,"BAJA CALIFORNIA SUR"]
[null,"3er. Trimestre",null,null,null,null,null,"CAMPECHE"]
[null,"4to. Trimestre",null,null,null,null,null,"COAHUILA "]
[null,null,null,"Elige el Año…",null,null,null,"COLIMA "]
[null,null,null,2013,null,null,null,"CHIAPAS "]
[null,null,null,2014,null,null,null,"CHIHUAHUA "]
[null,null,null,2015,null,null,null,"DISTRITO FEDERAL"]
[null,null,null,2016,null,null,null," DURANGO "]
[null,null,null,2017,null,null,null," GUANAJUATO "]
[null,null,null,2018,null,null,null," GUERRERO "]
[null,null,null,null,null,null,null," HIDALGO"]
[null,null,null,null,null,null,null," JALISCO "]
[null,null,null,null,null,null,null," MEXICO "]
[null,null,null,null,null,null,null," MICHOACAN "]
[null,null,null,null,null,null,null," MORELOS "]
[null,null,null,null,null,null,null," NAYARIT "]
[null,null,null,null,null,null,null," NUEVO LEON"]
[null,null,null,null,null,null,null," OAXACA "]
[null,null,null,null,null,null,null," PUEBLA "]
[null,null,null,null,null,null,null," QUERETARO "]
[null,null,null,null,null,null,null," QUINTANA ROO"]
[null,null,null,null,null,null,null," SAN LUIS"]
[null,null,null,null,null,null,null," SINALOA "]
[null,null,null,null,null,null,null," SONORA "]
[null,null,null,null,null,null,null," TABASCO "]
[null,null,null,null,null,null,null," TAMAULIPAS "]
[null,null,null,null,null,null,null," TLAXCALA "]
[null,null,null,null,null,null,null," VERACRUZ"]
[null,null,null,null,null,null,null," YUCATÁN "]
[null,null,null,null,null,null,null," ZACATECAS "]